SHARE
TWEET

Untitled

randomname123random1 Sep 11th, 2019 98 Never
Not a member of Pastebin yet? Sign Up, it unlocks many cool features!
  1. Launching lib\main.dart on SM G965F in debug mode...
  2. Initializing gradle...
  3. Resolving dependencies...
  4. Running Gradle task 'assembleDebug'...
  5.  
  6. FAILURE: Build failed with an exception.
  7.  
  8. * What went wrong:
  9. Execution failed for task ':app:processDebugResources'.
  10. > Android resource linking failed
  11.   Output:  C:\Users\caspe\AndroidStudioProjects\MediTolkUnity\build\app\intermediates\incremental\mergeDebugResources\merged.dir\values\values.xml:189: error: resource android:attr/fontVariationSettings not found.
  12.   C:\Users\caspe\AndroidStudioProjects\MediTolkUnity\build\app\intermediates\incremental\mergeDebugResources\merged.dir\values\values.xml:190: error: resource android:attr/ttcIndex not found.
  13.   error: failed linking references.
  14.  
  15.   Command: C:\Users\caspe\.gradle\caches\transforms-1\files-1.1\aapt2-3.2.1-4818971-windows.jar\a873a45634a462a323e7a276c366cce7\aapt2-3.2.1-4818971-windows\aapt2.exe link -I\
  16.           C:\Users\caspe\AppData\Local\Android\sdk\platforms\android-27\android.jar\
  17.           --manifest\
  18.           C:\Users\caspe\AndroidStudioProjects\MediTolkUnity\build\app\intermediates\merged_manifests\debug\processDebugManifest\merged\AndroidManifest.xml\
  19.           -o\
  20.           C:\Users\caspe\AndroidStudioProjects\MediTolkUnity\build\app\intermediates\processed_res\debug\processDebugResources\out\resources-debug.ap_\
  21.           -R\
  22.           @C:\Users\caspe\AndroidStudioProjects\MediTolkUnity\build\app\intermediates\incremental\processDebugResources\resources-list-for-resources-debug.ap_.txt\
  23.           --auto-add-overlay\
  24.           --java\
  25.           C:\Users\caspe\AndroidStudioProjects\MediTolkUnity\build\app\generated\not_namespaced_r_class_sources\debug\processDebugResources\r\
  26.           --custom-package\
  27.           com.rexraphael.flutterunitywidgetexample\
  28.           -0\
  29.           apk\
  30.           --output-text-symbols\
  31.           C:\Users\caspe\AndroidStudioProjects\MediTolkUnity\build\app\intermediates\symbols\debug\R.txt\
  32.           --no-version-vectors
  33.   Daemon:  AAPT2 aapt2-3.2.1-4818971-windows Daemon #0
  34.   Output:  C:\Users\caspe\.gradle\caches\transforms-1\files-1.1\core-1.0.0.aar\fce8d116afb7d089b8ac0b43ba6bd9bb\res\values\values.xml:89:5-125:25: AAPT: error: resource android:attr/fontVariationSettings not found.
  35.  
  36.   C:\Users\caspe\.gradle\caches\transforms-1\files-1.1\core-1.0.0.aar\fce8d116afb7d089b8ac0b43ba6bd9bb\res\values\values.xml:89:5-125:25: AAPT: error: resource android:attr/ttcIndex not found.
  37.  
  38.   error: failed linking references.
  39.   Command: C:\Users\caspe\.gradle\caches\transforms-1\files-1.1\aapt2-3.2.1-4818971-windows.jar\a873a45634a462a323e7a276c366cce7\aapt2-3.2.1-4818971-windows\aapt2.exe link -I\
  40.           C:\Users\caspe\AppData\Local\Android\sdk\platforms\android-27\android.jar\
  41.           --manifest\
  42.           C:\Users\caspe\AndroidStudioProjects\MediTolkUnity\build\app\intermediates\merged_manifests\debug\processDebugManifest\merged\AndroidManifest.xml\
  43.           -o\
  44.           C:\Users\caspe\AndroidStudioProjects\MediTolkUnity\build\app\intermediates\processed_res\debug\processDebugResources\out\resources-debug.ap_\
  45.           -R\
  46.           @C:\Users\caspe\AndroidStudioProjects\MediTolkUnity\build\app\intermediates\incremental\processDebugResources\resources-list-for-resources-debug.ap_.txt\
  47.           --auto-add-overlay\
  48.           --java\
  49.           C:\Users\caspe\AndroidStudioProjects\MediTolkUnity\build\app\generated\not_namespaced_r_class_sources\debug\processDebugResources\r\
  50.           --custom-package\
  51.           com.rexraphael.flutterunitywidgetexample\
  52.           -0\
  53.           apk\
  54.           --output-text-symbols\
  55.           C:\Users\caspe\AndroidStudioProjects\MediTolkUnity\build\app\intermediates\symbols\debug\R.txt\
  56.           --no-version-vectors
  57.   Daemon:  AAPT2 aapt2-3.2.1-4818971-windows Daemon #0
  58.  
  59. * Try:
  60. Run with --stacktrace option to get the stack trace. Run with --info or --debug option to get more log output. Run with --scan to get full insights.
  61.  
  62. * Get more help at https://help.gradle.org
  63.  
  64. BUILD FAILED in 15s
  65. *******************************************************************************************
  66. The Gradle failure may have been because of AndroidX incompatibilities in this Flutter app.
  67. See https://goo.gl/CP92wY for more information on the problem and how to fix it.
  68. *******************************************************************************************
  69. Finished with error: Gradle task assembleDebug failed with exit code 1
RAW Paste Data
We use cookies for various purposes including analytics. By continuing to use Pastebin, you agree to our use of cookies as described in the Cookies Policy. OK, I Understand
 
Top