Advertisement
Guest User

logs

a guest
Jun 22nd, 2020
37
Never
Not a member of Pastebin yet? Sign Up, it unlocks many cool features!
text 112.21 KB | None
  1. [INFO] T E S T S
  2. [INFO] -------------------------------------------------------
  3. [INFO] Running liquibase.ext.datatype.core.MySQLBooleanTypeTest
  4. [INFO] Tests run: 3, Failures: 0, Errors: 0, Skipped: 0, Time elapsed: 0.892 s - in liquibase.ext.dat
  5. atype.core.MySQLBooleanTypeTest
  6. [INFO] Running liquibase.ext.sqlgenerator.core.ModifyColumnChangeTest
  7. [INFO] Tests run: 2, Failures: 0, Errors: 0, Skipped: 0, Time elapsed: 0.001 s - in liquibase.ext.sql
  8. generator.core.ModifyColumnChangeTest
  9. [INFO] Running liquibase.ext.sqlgenerator.core.ModifyColumnGeneratorTest
  10. [INFO] Tests run: 8, Failures: 0, Errors: 0, Skipped: 0, Time elapsed: 0.812 s - in liquibase.ext.sql
  11. generator.core.ModifyColumnGeneratorTest
  12. [INFO] Running org.openmrs.AllergenTest
  13. [INFO] Tests run: 6, Failures: 0, Errors: 0, Skipped: 0, Time elapsed: 13.278 s - in org.openmrs.Alle
  14. rgenTest
  15. [INFO] Running org.openmrs.AllergiesTest
  16. [INFO] Tests run: 26, Failures: 0, Errors: 0, Skipped: 0, Time elapsed: 1.133 s - in org.openmrs.Alle
  17. rgiesTest
  18. [INFO] Running org.openmrs.annotation.OpenmrsProfileExcludeFilterTest
  19. [WARNING] Tests run: 8, Failures: 0, Errors: 0, Skipped: 2, Time elapsed: 0.096 s - in org.openmrs.an
  20. notation.OpenmrsProfileExcludeFilterTest
  21. [INFO] Running org.openmrs.annotation.OpenmrsProfileExcludeFilterWithModulesTest
  22. [INFO] Tests run: 1, Failures: 0, Errors: 0, Skipped: 0, Time elapsed: 0.887 s - in org.openmrs.annot
  23. ation.OpenmrsProfileExcludeFilterWithModulesTest
  24. [INFO] Running org.openmrs.annotation.OpenmrsProfileIncludeFilterTest
  25. [INFO] Tests run: 2, Failures: 0, Errors: 0, Skipped: 0, Time elapsed: 1.04 s - in org.openmrs.annota
  26. tion.OpenmrsProfileIncludeFilterTest
  27. [INFO] Running org.openmrs.annotation.StartModuleAnnotationReuseTest
  28. [INFO] Tests run: 1, Failures: 0, Errors: 0, Skipped: 0, Time elapsed: 1.272 s - in org.openmrs.annot
  29. ation.StartModuleAnnotationReuseTest
  30. [INFO] Running org.openmrs.aop.AuthorizationAdviceTest
  31. [INFO] Tests run: 2, Failures: 0, Errors: 0, Skipped: 0, Time elapsed: 0.99 s - in org.openmrs.aop.Au
  32. thorizationAdviceTest
  33. [INFO] Running org.openmrs.aop.RequiredDataAdviceTest
  34. [INFO] Tests run: 26, Failures: 0, Errors: 0, Skipped: 0, Time elapsed: 0.625 s - in org.openmrs.aop.
  35. RequiredDataAdviceTest
  36. [INFO] Running org.openmrs.api.AdministrationServiceTest
  37. [WARNING] Tests run: 57, Failures: 0, Errors: 0, Skipped: 4, Time elapsed: 2.009 s - in org.openmrs.a
  38. pi.AdministrationServiceTest
  39. [INFO] Running org.openmrs.api.AdministrationServiceUnitTest
  40. [INFO] Tests run: 5, Failures: 0, Errors: 0, Skipped: 0, Time elapsed: 0.02 s - in org.openmrs.api.Ad
  41. ministrationServiceUnitTest
  42. [INFO] Running org.openmrs.api.cache.CachePropertiesUtilTest
  43. [INFO] Tests run: 1, Failures: 0, Errors: 0, Skipped: 0, Time elapsed: 0.002 s - in org.openmrs.api.c
  44. ache.CachePropertiesUtilTest
  45. [INFO] Running org.openmrs.api.cache.OpenmrsCacheManagerFactoryBeanTest
  46. [INFO] Tests run: 1, Failures: 0, Errors: 0, Skipped: 0, Time elapsed: 0.913 s - in org.openmrs.api.c
  47. ache.OpenmrsCacheManagerFactoryBeanTest
  48. [INFO] Running org.openmrs.api.CohortServiceTest
  49. [INFO] Tests run: 39, Failures: 0, Errors: 0, Skipped: 0, Time elapsed: 2.896 s - in org.openmrs.api.
  50. CohortServiceTest
  51. [INFO] Running org.openmrs.api.ConceptServiceTest
  52. [WARNING] Tests run: 245, Failures: 0, Errors: 0, Skipped: 1, Time elapsed: 42.296 s - in org.openmrs
  53. .api.ConceptServiceTest
  54. [INFO] Running org.openmrs.api.context.ContextTest
  55. [INFO] Tests run: 17, Failures: 0, Errors: 0, Skipped: 0, Time elapsed: 0.84 s - in org.openmrs.api.c
  56. ontext.ContextTest
  57. [INFO] Running org.openmrs.api.context.ContextWithModuleTest
  58. [INFO] Tests run: 1, Failures: 0, Errors: 0, Skipped: 0, Time elapsed: 0.821 s - in org.openmrs.api.c
  59. ontext.ContextWithModuleTest
  60. [INFO] Running org.openmrs.api.context.DaemonTest
  61. [INFO] Tests run: 10, Failures: 0, Errors: 0, Skipped: 0, Time elapsed: 0.832 s - in org.openmrs.api.
  62. context.DaemonTest
  63. [INFO] Running org.openmrs.api.DatatypeServiceTest
  64. [INFO] Tests run: 2, Failures: 0, Errors: 0, Skipped: 0, Time elapsed: 0.905 s - in org.openmrs.api.D
  65. atatypeServiceTest
  66. [INFO] Running org.openmrs.api.db.ConceptDAOTest
  67. [WARNING] Tests run: 13, Failures: 0, Errors: 0, Skipped: 2, Time elapsed: 0.998 s - in org.openmrs.a
  68. pi.db.ConceptDAOTest
  69. [INFO] Running org.openmrs.api.db.ContextDAOTest
  70. [INFO] Tests run: 24, Failures: 0, Errors: 0, Skipped: 0, Time elapsed: 1.048 s - in org.openmrs.api.
  71. db.ContextDAOTest
  72. [INFO] Running org.openmrs.api.db.EncounterDAOTest
  73. [INFO] Tests run: 4, Failures: 0, Errors: 0, Skipped: 0, Time elapsed: 0.86 s - in org.openmrs.api.db
  74. .EncounterDAOTest
  75. [INFO] Running org.openmrs.api.db.hibernate.AuditableInterceptorTest
  76. Security framework of XStream not initialized, XStream is probably vulnerable.
  77. [INFO] Tests run: 15, Failures: 0, Errors: 0, Skipped: 0, Time elapsed: 0.867 s - in org.openmrs.api.
  78. db.hibernate.AuditableInterceptorTest
  79. [INFO] Running org.openmrs.api.db.hibernate.DropMillisecondsHibernateInterceptorTest
  80. [INFO] Tests run: 3, Failures: 0, Errors: 0, Skipped: 0, Time elapsed: 0.665 s - in org.openmrs.api.d
  81. b.hibernate.DropMillisecondsHibernateInterceptorTest
  82. [INFO] Running org.openmrs.api.db.hibernate.HibernateAdministrationDAOTest
  83. [INFO] Tests run: 4, Failures: 0, Errors: 0, Skipped: 0, Time elapsed: 0.647 s - in org.openmrs.api.d
  84. b.hibernate.HibernateAdministrationDAOTest
  85. [INFO] Running org.openmrs.api.db.hibernate.HibernateConceptDAOTest
  86. [INFO] Tests run: 11, Failures: 0, Errors: 0, Skipped: 0, Time elapsed: 2.227 s - in org.openmrs.api.
  87. db.hibernate.HibernateConceptDAOTest
  88. [INFO] Running org.openmrs.api.db.hibernate.HibernateConditionDAOTest
  89. [INFO] Tests run: 6, Failures: 0, Errors: 0, Skipped: 0, Time elapsed: 1.353 s - in org.openmrs.api.d
  90. b.hibernate.HibernateConditionDAOTest
  91. [INFO] Running org.openmrs.api.db.hibernate.HibernateDiagnosisDAOTest
  92. [INFO] Tests run: 9, Failures: 0, Errors: 0, Skipped: 0, Time elapsed: 0.731 s - in org.openmrs.api.d
  93. b.hibernate.HibernateDiagnosisDAOTest
  94. [INFO] Running org.openmrs.api.db.hibernate.HibernateFormDAOTest
  95. [INFO] Tests run: 1, Failures: 0, Errors: 0, Skipped: 0, Time elapsed: 0.642 s - in org.openmrs.api.d
  96. b.hibernate.HibernateFormDAOTest
  97. [INFO] Running org.openmrs.api.db.hibernate.HibernateLocationDAOTest
  98. [INFO] Tests run: 3, Failures: 0, Errors: 0, Skipped: 0, Time elapsed: 0.682 s - in org.openmrs.api.d
  99. b.hibernate.HibernateLocationDAOTest
  100. [INFO] Running org.openmrs.api.db.hibernate.HibernateObsDAOTest
  101. [INFO] Tests run: 1, Failures: 0, Errors: 0, Skipped: 0, Time elapsed: 0.579 s - in org.openmrs.api.d
  102. b.hibernate.HibernateObsDAOTest
  103. [INFO] Running org.openmrs.api.db.hibernate.HibernateOrderDAOTest
  104. [INFO] Tests run: 5, Failures: 0, Errors: 0, Skipped: 0, Time elapsed: 0.868 s - in org.openmrs.api.d
  105. b.hibernate.HibernateOrderDAOTest
  106. [INFO] Running org.openmrs.api.db.hibernate.HibernatePatientDAOTest
  107. [INFO] Tests run: 2, Failures: 0, Errors: 0, Skipped: 0, Time elapsed: 0.856 s - in org.openmrs.api.d
  108. b.hibernate.HibernatePatientDAOTest
  109. [INFO] Running org.openmrs.api.db.hibernate.HibernatePersonDAOTest
  110. [INFO] Tests run: 41, Failures: 0, Errors: 0, Skipped: 0, Time elapsed: 7.168 s - in org.openmrs.api.
  111. db.hibernate.HibernatePersonDAOTest
  112. [INFO] Running org.openmrs.api.db.hibernate.HibernateProviderDAOTest
  113. [INFO] Tests run: 3, Failures: 0, Errors: 0, Skipped: 0, Time elapsed: 0.822 s - in org.openmrs.api.d
  114. b.hibernate.HibernateProviderDAOTest
  115. [INFO] Running org.openmrs.api.db.hibernate.ImmutableEntityInterceptorTest
  116. [INFO] Tests run: 4, Failures: 0, Errors: 0, Skipped: 0, Time elapsed: 0.642 s - in org.openmrs.api.d
  117. b.hibernate.ImmutableEntityInterceptorTest
  118. [INFO] Running org.openmrs.api.db.hibernate.PatientSearchCriteriaTest
  119. [INFO] Tests run: 18, Failures: 0, Errors: 0, Skipped: 0, Time elapsed: 0.704 s - in org.openmrs.api.
  120. db.hibernate.PatientSearchCriteriaTest
  121. [INFO] Running org.openmrs.api.db.hibernate.PersonAttributeHelperTest
  122. [INFO] Tests run: 5, Failures: 0, Errors: 0, Skipped: 0, Time elapsed: 0.752 s - in org.openmrs.api.d
  123. b.hibernate.PersonAttributeHelperTest
  124. [INFO] Running org.openmrs.api.db.hibernate.ProviderDAOTest
  125. [INFO] Tests run: 3, Failures: 0, Errors: 0, Skipped: 0, Time elapsed: 0.676 s - in org.openmrs.api.d
  126. b.hibernate.ProviderDAOTest
  127. [INFO] Running org.openmrs.api.db.PatientDAOTest
  128. [WARNING] Tests run: 157, Failures: 0, Errors: 0, Skipped: 1, Time elapsed: 33.938 s - in org.openmrs
  129. .api.db.PatientDAOTest
  130. [INFO] Running org.openmrs.api.db.PersonDAOTest
  131. [INFO] Tests run: 3, Failures: 0, Errors: 0, Skipped: 0, Time elapsed: 0.602 s - in org.openmrs.api.d
  132. b.PersonDAOTest
  133. [INFO] Running org.openmrs.api.db.ProgramWorkflowDAOTest
  134. [INFO] Tests run: 4, Failures: 0, Errors: 0, Skipped: 0, Time elapsed: 0.628 s - in org.openmrs.api.d
  135. b.ProgramWorkflowDAOTest
  136. [INFO] Running org.openmrs.api.db.SerializedObjectDAOTest
  137. [WARNING] Tests run: 1, Failures: 0, Errors: 0, Skipped: 1, Time elapsed: 0.001 s - in org.openmrs.ap
  138. i.db.SerializedObjectDAOTest
  139. [INFO] Running org.openmrs.api.db.UserDAOTest
  140. [INFO] Tests run: 8, Failures: 0, Errors: 0, Skipped: 0, Time elapsed: 0.673 s - in org.openmrs.api.d
  141. b.UserDAOTest
  142. [INFO] Running org.openmrs.api.db.VisitDAOTest
  143. [INFO] Tests run: 3, Failures: 0, Errors: 0, Skipped: 0, Time elapsed: 0.763 s - in org.openmrs.api.d
  144. b.VisitDAOTest
  145. [INFO] Running org.openmrs.api.EncounterServiceTest
  146. [WARNING] Tests run: 144, Failures: 0, Errors: 0, Skipped: 2, Time elapsed: 18.188 s - in org.openmrs
  147. .api.EncounterServiceTest
  148. [INFO] Running org.openmrs.api.FormServiceTest
  149. [INFO] Tests run: 48, Failures: 0, Errors: 0, Skipped: 0, Time elapsed: 1.084 s - in org.openmrs.api.
  150. FormServiceTest
  151. [INFO] Running org.openmrs.api.handler.BaseRetireHandlerTest
  152. [INFO] Tests run: 8, Failures: 0, Errors: 0, Skipped: 0, Time elapsed: 0.002 s - in org.openmrs.api.h
  153. andler.BaseRetireHandlerTest
  154. [INFO] Running org.openmrs.api.handler.BaseUnretireHandlerTest
  155. [INFO] Tests run: 6, Failures: 0, Errors: 0, Skipped: 0, Time elapsed: 0.002 s - in org.openmrs.api.h
  156. andler.BaseUnretireHandlerTest
  157. [INFO] Running org.openmrs.api.handler.BaseUnvoidHandlerTest
  158. [INFO] Tests run: 6, Failures: 0, Errors: 0, Skipped: 0, Time elapsed: 0.002 s - in org.openmrs.api.h
  159. andler.BaseUnvoidHandlerTest
  160. [INFO] Running org.openmrs.api.handler.BaseVoidHandlerTest
  161. [INFO] Tests run: 8, Failures: 0, Errors: 0, Skipped: 0, Time elapsed: 0.001 s - in org.openmrs.api.h
  162. andler.BaseVoidHandlerTest
  163. [INFO] Running org.openmrs.api.handler.ConceptNameSaveHandlerTest
  164. [INFO] Tests run: 4, Failures: 0, Errors: 0, Skipped: 0, Time elapsed: 0.697 s - in org.openmrs.api.h
  165. andler.ConceptNameSaveHandlerTest
  166. [INFO] Running org.openmrs.api.handler.ExistingOrNewVisitAssignmentHandlerTest
  167. [INFO] Tests run: 5, Failures: 0, Errors: 0, Skipped: 0, Time elapsed: 1.238 s - in org.openmrs.api.h
  168. andler.ExistingOrNewVisitAssignmentHandlerTest
  169. [INFO] Running org.openmrs.api.handler.ExistingVisitAssignmentHandlerTest
  170. [INFO] Tests run: 3, Failures: 0, Errors: 0, Skipped: 0, Time elapsed: 1.026 s - in org.openmrs.api.h
  171. andler.ExistingVisitAssignmentHandlerTest
  172. [INFO] Running org.openmrs.api.handler.OpenmrsMetadataSaveHandlerTest
  173. [INFO] Tests run: 2, Failures: 0, Errors: 0, Skipped: 0, Time elapsed: 0.001 s - in org.openmrs.api.h
  174. andler.OpenmrsMetadataSaveHandlerTest
  175. [INFO] Running org.openmrs.api.handler.OpenmrsObjectSaveHandlerTest
  176. [INFO] Tests run: 5, Failures: 0, Errors: 0, Skipped: 0, Time elapsed: 0.001 s - in org.openmrs.api.h
  177. andler.OpenmrsObjectSaveHandlerTest
  178. [INFO] Running org.openmrs.api.handler.PatientDataUnvoidHandlerTest
  179. [INFO] Tests run: 3, Failures: 0, Errors: 0, Skipped: 0, Time elapsed: 2.376 s - in org.openmrs.api.h
  180. andler.PatientDataUnvoidHandlerTest
  181. [INFO] Running org.openmrs.api.handler.PatientDataVoidHandlerTest
  182. [INFO] Tests run: 2, Failures: 0, Errors: 0, Skipped: 0, Time elapsed: 0.751 s - in org.openmrs.api.h
  183. andler.PatientDataVoidHandlerTest
  184. [INFO] Running org.openmrs.api.handler.PersonSaveHandlerTest
  185. [INFO] Tests run: 1, Failures: 0, Errors: 0, Skipped: 0, Time elapsed: 0.686 s - in org.openmrs.api.h
  186. andler.PersonSaveHandlerTest
  187. [INFO] Running org.openmrs.api.handler.PersonUnvoidHandlerTest
  188. [INFO] Tests run: 6, Failures: 0, Errors: 0, Skipped: 0, Time elapsed: 0.001 s - in org.openmrs.api.h
  189. andler.PersonUnvoidHandlerTest
  190. [INFO] Running org.openmrs.api.handler.PersonVoidHandlerTest
  191. [INFO] Tests run: 8, Failures: 0, Errors: 0, Skipped: 0, Time elapsed: 0.641 s - in org.openmrs.api.h
  192. andler.PersonVoidHandlerTest
  193. [INFO] Running org.openmrs.api.handler.RequiredReasonVoidSaveHandlerTest
  194. [INFO] Tests run: 5, Failures: 0, Errors: 0, Skipped: 0, Time elapsed: 0.732 s - in org.openmrs.api.h
  195. andler.RequiredReasonVoidSaveHandlerTest
  196. [INFO] Running org.openmrs.api.handler.RequireVoidReasonVoidHandlerTest
  197. [INFO] Tests run: 5, Failures: 0, Errors: 0, Skipped: 0, Time elapsed: 0.71 s - in org.openmrs.api.ha
  198. ndler.RequireVoidReasonVoidHandlerTest
  199. [INFO] Running org.openmrs.api.impl.ConceptServiceImplTest
  200. [INFO] Tests run: 63, Failures: 0, Errors: 0, Skipped: 0, Time elapsed: 0.982 s - in org.openmrs.api.
  201. impl.ConceptServiceImplTest
  202. [INFO] Running org.openmrs.api.impl.ConditionServiceImplTest
  203. [INFO] Tests run: 11, Failures: 0, Errors: 0, Skipped: 0, Time elapsed: 0.878 s - in org.openmrs.api.
  204. impl.ConditionServiceImplTest
  205. [INFO] Running org.openmrs.api.impl.DiagnosisServiceImplTest
  206. [INFO] Tests run: 11, Failures: 0, Errors: 0, Skipped: 0, Time elapsed: 0.921 s - in org.openmrs.api.
  207. impl.DiagnosisServiceImplTest
  208. [INFO] Running org.openmrs.api.impl.GlobalLocaleListTest
  209. [INFO] Tests run: 2, Failures: 0, Errors: 0, Skipped: 0, Time elapsed: 0 s - in org.openmrs.api.impl.
  210. GlobalLocaleListTest
  211. [INFO] Running org.openmrs.api.impl.PatientServiceImplTest
  212. [INFO] Tests run: 14, Failures: 0, Errors: 0, Skipped: 0, Time elapsed: 0.294 s - in org.openmrs.api.
  213. impl.PatientServiceImplTest
  214. [INFO] Running org.openmrs.api.impl.SerializationServiceImplTest
  215. [INFO] Tests run: 1, Failures: 0, Errors: 0, Skipped: 0, Time elapsed: 0.002 s - in org.openmrs.api.i
  216. mpl.SerializationServiceImplTest
  217. [INFO] Running org.openmrs.api.LocationServiceTest
  218. [INFO] Tests run: 70, Failures: 0, Errors: 0, Skipped: 0, Time elapsed: 2.601 s - in org.openmrs.api.
  219. LocationServiceTest
  220. [INFO] Running org.openmrs.api.ObsServiceTest
  221. [INFO] Tests run: 80, Failures: 0, Errors: 0, Skipped: 0, Time elapsed: 2.493 s - in org.openmrs.api.
  222. ObsServiceTest
  223. [INFO] Running org.openmrs.api.OpenmrsServiceTest
  224. [WARNING] Tests run: 1, Failures: 0, Errors: 0, Skipped: 1, Time elapsed: 0.002 s - in org.openmrs.ap
  225. i.OpenmrsServiceTest
  226. [INFO] Running org.openmrs.api.OrderServiceTest
  227. [WARNING] Tests run: 191, Failures: 0, Errors: 0, Skipped: 3, Time elapsed: 4.031 s - in org.openmrs.
  228. api.OrderServiceTest
  229. [INFO] Running org.openmrs.api.OrderSetServiceTest
  230. [INFO] Tests run: 12, Failures: 0, Errors: 0, Skipped: 0, Time elapsed: 1.108 s - in org.openmrs.api.
  231. OrderSetServiceTest
  232. [INFO] Running org.openmrs.api.PatientServiceAllergyTest
  233. [INFO] Tests run: 16, Failures: 0, Errors: 0, Skipped: 0, Time elapsed: 1.214 s - in org.openmrs.api.
  234. PatientServiceAllergyTest
  235. [INFO] Running org.openmrs.api.PatientServiceTest
  236. [WARNING] Tests run: 169, Failures: 0, Errors: 0, Skipped: 1, Time elapsed: 29.593 s - in org.openmrs
  237. .api.PatientServiceTest
  238. [INFO] Running org.openmrs.api.PersonServiceTest
  239. [INFO] Tests run: 143, Failures: 0, Errors: 0, Skipped: 0, Time elapsed: 2.261 s - in org.openmrs.api
  240. .PersonServiceTest
  241. [INFO] Running org.openmrs.api.ProgramWorkflowServiceTest
  242. [INFO] Tests run: 63, Failures: 0, Errors: 0, Skipped: 0, Time elapsed: 5.104 s - in org.openmrs.api.
  243. ProgramWorkflowServiceTest
  244. [INFO] Running org.openmrs.api.ProgramWorkflowServiceUnitTest
  245. [INFO] Tests run: 12, Failures: 0, Errors: 0, Skipped: 0, Time elapsed: 0.008 s - in org.openmrs.api.
  246. ProgramWorkflowServiceUnitTest
  247. [INFO] Running org.openmrs.api.ProviderServiceTest
  248. [INFO] Tests run: 40, Failures: 0, Errors: 0, Skipped: 0, Time elapsed: 2.205 s - in org.openmrs.api.
  249. ProviderServiceTest
  250. [INFO] Running org.openmrs.api.UserServiceTest
  251. [WARNING] Tests run: 109, Failures: 0, Errors: 0, Skipped: 1, Time elapsed: 6.951 s - in org.openmrs.
  252. api.UserServiceTest
  253. [INFO] Running org.openmrs.api.VisitServiceTest
  254. [INFO] Tests run: 68, Failures: 0, Errors: 0, Skipped: 0, Time elapsed: 1.919 s - in org.openmrs.api.
  255. VisitServiceTest
  256. [INFO] Running org.openmrs.attribute.AttributeIntegrationTest
  257. [INFO] Tests run: 1, Failures: 0, Errors: 0, Skipped: 0, Time elapsed: 0.633 s - in org.openmrs.attri
  258. bute.AttributeIntegrationTest
  259. [INFO] Running org.openmrs.BaseCustomizableMetadataTest
  260. [INFO] Tests run: 2, Failures: 0, Errors: 0, Skipped: 0, Time elapsed: 0.748 s - in org.openmrs.BaseC
  261. ustomizableMetadataTest
  262. [INFO] Running org.openmrs.BaseOpenmrsObjectTest
  263. [INFO] Tests run: 20, Failures: 0, Errors: 0, Skipped: 0, Time elapsed: 0.733 s - in org.openmrs.Base
  264. OpenmrsObjectTest
  265. [INFO] Running org.openmrs.CohortMembershipTest
  266. [INFO] Tests run: 21, Failures: 0, Errors: 0, Skipped: 0, Time elapsed: 0.002 s - in org.openmrs.Coho
  267. rtMembershipTest
  268. [INFO] Running org.openmrs.CohortTest
  269. [INFO] Tests run: 15, Failures: 0, Errors: 0, Skipped: 0, Time elapsed: 0.155 s - in org.openmrs.Coho
  270. rtTest
  271. [INFO] Running org.openmrs.comparator.PatientIdentifierTypeDefaultComparatorTest
  272. [INFO] Tests run: 1, Failures: 0, Errors: 0, Skipped: 0, Time elapsed: 0.001 s - in org.openmrs.compa
  273. rator.PatientIdentifierTypeDefaultComparatorTest
  274. [INFO] Running org.openmrs.ConceptComponentTest
  275. [INFO] Tests run: 1, Failures: 0, Errors: 0, Skipped: 0, Time elapsed: 0.68 s - in org.openmrs.Concep
  276. tComponentTest
  277. [INFO] Running org.openmrs.ConceptNumericTest
  278. [INFO] Tests run: 8, Failures: 0, Errors: 0, Skipped: 0, Time elapsed: 0.717 s - in org.openmrs.Conce
  279. ptNumericTest
  280. [INFO] Running org.openmrs.ConceptReferenceTermTest
  281. [INFO] Tests run: 3, Failures: 0, Errors: 0, Skipped: 0, Time elapsed: 0.001 s - in org.openmrs.Conce
  282. ptReferenceTermTest
  283. [INFO] Running org.openmrs.ConceptTest
  284. [INFO] Tests run: 72, Failures: 0, Errors: 0, Skipped: 0, Time elapsed: 0.925 s - in org.openmrs.Conc
  285. eptTest
  286. [INFO] Running org.openmrs.customdatatype.CustomDatatypeUtilTest
  287. [INFO] Tests run: 1, Failures: 0, Errors: 0, Skipped: 0, Time elapsed: 0.659 s - in org.openmrs.custo
  288. mdatatype.CustomDatatypeUtilTest
  289. [INFO] Running org.openmrs.customdatatype.datatype.BaseMetadataDatatypeTest
  290. [INFO] Tests run: 1, Failures: 0, Errors: 0, Skipped: 0, Time elapsed: 0.001 s - in org.openmrs.custo
  291. mdatatype.datatype.BaseMetadataDatatypeTest
  292. [INFO] Running org.openmrs.customdatatype.datatype.BaseOpenmrsDatatypeTest
  293. [INFO] Tests run: 1, Failures: 0, Errors: 0, Skipped: 0, Time elapsed: 0.001 s - in org.openmrs.custo
  294. mdatatype.datatype.BaseOpenmrsDatatypeTest
  295. [INFO] Running org.openmrs.customdatatype.datatype.DateDatatypeTest
  296. [INFO] Tests run: 2, Failures: 0, Errors: 0, Skipped: 0, Time elapsed: 0.008 s - in org.openmrs.custo
  297. mdatatype.datatype.DateDatatypeTest
  298. [INFO] Running org.openmrs.customdatatype.datatype.RegexValidatedTextTest
  299. [INFO] Tests run: 3, Failures: 0, Errors: 0, Skipped: 0, Time elapsed: 0.002 s - in org.openmrs.custo
  300. mdatatype.datatype.RegexValidatedTextTest
  301. [INFO] Running org.openmrs.DrugOrderTest
  302. [INFO] Tests run: 22, Failures: 0, Errors: 0, Skipped: 0, Time elapsed: 0.043 s - in org.openmrs.Drug
  303. OrderTest
  304. [INFO] Running org.openmrs.DrugTest
  305. [INFO] Tests run: 2, Failures: 0, Errors: 0, Skipped: 0, Time elapsed: 0.635 s - in org.openmrs.DrugT
  306. est
  307. [INFO] Running org.openmrs.DurationTest
  308. [INFO] Tests run: 11, Failures: 0, Errors: 0, Skipped: 0, Time elapsed: 0.706 s - in org.openmrs.Dura
  309. tionTest
  310. [INFO] Running org.openmrs.EncounterProviderTest
  311. [INFO] Tests run: 1, Failures: 0, Errors: 0, Skipped: 0, Time elapsed: 0.001 s - in org.openmrs.Encou
  312. nterProviderTest
  313. [INFO] Running org.openmrs.EncounterRoleTest
  314. [INFO] Tests run: 1, Failures: 0, Errors: 0, Skipped: 0, Time elapsed: 0.001 s - in org.openmrs.Encou
  315. nterRoleTest
  316. [INFO] Running org.openmrs.EncounterTest
  317. [INFO] Tests run: 63, Failures: 0, Errors: 0, Skipped: 0, Time elapsed: 0.849 s - in org.openmrs.Enco
  318. unterTest
  319. [INFO] Running org.openmrs.EncounterTypeTest
  320. [INFO] Tests run: 1, Failures: 0, Errors: 0, Skipped: 0, Time elapsed: 0.001 s - in org.openmrs.Encou
  321. nterTypeTest
  322. [INFO] Running org.openmrs.FormTest
  323. [INFO] Tests run: 1, Failures: 0, Errors: 0, Skipped: 0, Time elapsed: 0.001 s - in org.openmrs.FormT
  324. est
  325. [INFO] Running org.openmrs.hl7.handler.ORUR01HandlerTest
  326. [INFO] Tests run: 39, Failures: 0, Errors: 0, Skipped: 0, Time elapsed: 4.529 s - in org.openmrs.hl7.
  327. handler.ORUR01HandlerTest
  328. [INFO] Running org.openmrs.hl7.HL7ServiceTest
  329. [WARNING] Tests run: 29, Failures: 0, Errors: 0, Skipped: 2, Time elapsed: 1.938 s - in org.openmrs.h
  330. l7.HL7ServiceTest
  331. [INFO] Running org.openmrs.hl7.HL7UtilTest
  332. [INFO] Tests run: 5, Failures: 0, Errors: 0, Skipped: 0, Time elapsed: 0.001 s - in org.openmrs.hl7.H
  333. L7UtilTest
  334. [INFO] Running org.openmrs.layout.name.NameTemplateTest
  335. [INFO] Tests run: 2, Failures: 0, Errors: 0, Skipped: 0, Time elapsed: 0.62 s - in org.openmrs.layout
  336. .name.NameTemplateTest
  337. [INFO] Running org.openmrs.liquibase.ChangeLogDetectiveTest
  338. [INFO] Tests run: 11, Failures: 0, Errors: 0, Skipped: 0, Time elapsed: 0.032 s - in org.openmrs.liqu
  339. ibase.ChangeLogDetectiveTest
  340. [INFO] Running org.openmrs.liquibase.ChangeLogVersionFinderTest
  341. [INFO] Tests run: 15, Failures: 0, Errors: 0, Skipped: 0, Time elapsed: 0.006 s - in org.openmrs.liqu
  342. ibase.ChangeLogVersionFinderTest
  343. [INFO] Running org.openmrs.liquibase.ChangeLogVersionsTest
  344. [INFO] Tests run: 3, Failures: 0, Errors: 0, Skipped: 0, Time elapsed: 0.222 s - in org.openmrs.liqui
  345. base.ChangeLogVersionsTest
  346. [INFO] Running org.openmrs.LocationTest
  347. [INFO] Tests run: 3, Failures: 0, Errors: 0, Skipped: 0, Time elapsed: 0.001 s - in org.openmrs.Locat
  348. ionTest
  349. [INFO] Running org.openmrs.logic.result.EmptyResultTest
  350. [INFO] Tests run: 2, Failures: 0, Errors: 0, Skipped: 0, Time elapsed: 0.001 s - in org.openmrs.logic
  351. .result.EmptyResultTest
  352. [INFO] Running org.openmrs.logic.result.ResultTest
  353. [INFO] Tests run: 17, Failures: 0, Errors: 0, Skipped: 0, Time elapsed: 0.001 s - in org.openmrs.logi
  354. c.result.ResultTest
  355. [INFO] Running org.openmrs.messagesource.impl.CachedMessageSourceTest
  356. [INFO] Tests run: 2, Failures: 0, Errors: 0, Skipped: 0, Time elapsed: 0.001 s - in org.openmrs.messa
  357. gesource.impl.CachedMessageSourceTest
  358. [INFO] Running org.openmrs.messagesource.impl.DefaultMessageSourceServiceImplTest
  359. [INFO] Tests run: 1, Failures: 0, Errors: 0, Skipped: 0, Time elapsed: 0.001 s - in org.openmrs.messa
  360. gesource.impl.DefaultMessageSourceServiceImplTest
  361. [INFO] Running org.openmrs.messagesource.MessageSourceServiceTest
  362. [INFO] Tests run: 1, Failures: 0, Errors: 0, Skipped: 0, Time elapsed: 0.576 s - in org.openmrs.messa
  363. gesource.MessageSourceServiceTest
  364. [INFO] Running org.openmrs.messagesource.PresentationMessageMapTest
  365. [INFO] Tests run: 2, Failures: 0, Errors: 0, Skipped: 0, Time elapsed: 0.001 s - in org.openmrs.messa
  366. gesource.PresentationMessageMapTest
  367. [INFO] Running org.openmrs.module.ModuleActivatorTest
  368. [INFO] Tests run: 11, Failures: 0, Errors: 0, Skipped: 0, Time elapsed: 1.581 s - in org.openmrs.modu
  369. le.ModuleActivatorTest
  370. [INFO] Running org.openmrs.module.ModuleClassLoaderTest
  371. [INFO] Tests run: 10, Failures: 0, Errors: 0, Skipped: 0, Time elapsed: 0.642 s - in org.openmrs.modu
  372. le.ModuleClassLoaderTest
  373. [INFO] Running org.openmrs.module.ModuleExtensionsTest
  374. [INFO] Tests run: 10, Failures: 0, Errors: 0, Skipped: 0, Time elapsed: 0.014 s - in org.openmrs.modu
  375. le.ModuleExtensionsTest
  376. [INFO] Running org.openmrs.module.ModuleFactoryTest
  377. [INFO] Tests run: 9, Failures: 0, Errors: 0, Skipped: 0, Time elapsed: 0.855 s - in org.openmrs.modul
  378. e.ModuleFactoryTest
  379. [INFO] Running org.openmrs.module.ModuleFileParserTest
  380. [INFO] Tests run: 6, Failures: 0, Errors: 0, Skipped: 0, Time elapsed: 0.692 s - in org.openmrs.modul
  381. e.ModuleFileParserTest
  382. [INFO] Running org.openmrs.module.ModuleFileParserUnitTest
  383. [Fatal Error] :1:67: XML document structures must start and end within the same entity.
  384. [Fatal Error] :-1:-1: Premature end of file.
  385. [INFO] Tests run: 73, Failures: 0, Errors: 0, Skipped: 0, Time elapsed: 0.45 s - in org.openmrs.modul
  386. e.ModuleFileParserUnitTest
  387. [INFO] Running org.openmrs.module.ModuleInteroperabilityTest
  388. [INFO] Tests run: 1, Failures: 0, Errors: 0, Skipped: 0, Time elapsed: 0.393 s - in org.openmrs.modul
  389. e.ModuleInteroperabilityTest
  390. [INFO] Running org.openmrs.module.ModuleTest
  391. [INFO] Tests run: 9, Failures: 0, Errors: 0, Skipped: 0, Time elapsed: 0.001 s - in org.openmrs.modul
  392. e.ModuleTest
  393. [INFO] Running org.openmrs.module.ModuleUtilTest
  394. [INFO] Tests run: 56, Failures: 0, Errors: 0, Skipped: 0, Time elapsed: 0.856 s - in org.openmrs.modu
  395. le.ModuleUtilTest
  396. [INFO] Running org.openmrs.module.UpdateFileParserTest
  397. [INFO] Tests run: 3, Failures: 0, Errors: 0, Skipped: 0, Time elapsed: 0.001 s - in org.openmrs.modul
  398. e.UpdateFileParserTest
  399. [INFO] Running org.openmrs.module.VersionComparatorTest
  400. [INFO] Tests run: 1, Failures: 0, Errors: 0, Skipped: 0, Time elapsed: 0.001 s - in org.openmrs.modul
  401. e.VersionComparatorTest
  402. [INFO] Running org.openmrs.notification.AlertServiceTest
  403. [INFO] Tests run: 3, Failures: 0, Errors: 0, Skipped: 0, Time elapsed: 0.638 s - in org.openmrs.notif
  404. ication.AlertServiceTest
  405. [INFO] Running org.openmrs.notification.db.hibernate.HibernateAlertDAOTest
  406. [INFO] Tests run: 1, Failures: 0, Errors: 0, Skipped: 0, Time elapsed: 0.648 s - in org.openmrs.notif
  407. ication.db.hibernate.HibernateAlertDAOTest
  408. [INFO] Running org.openmrs.notification.MessageTest
  409. [INFO] Tests run: 4, Failures: 0, Errors: 0, Skipped: 0, Time elapsed: 0.001 s - in org.openmrs.notif
  410. ication.MessageTest
  411. [INFO] Running org.openmrs.obs.AbstractHandlerTest
  412. [INFO] Tests run: 4, Failures: 0, Errors: 0, Skipped: 0, Time elapsed: 3.019 s - in org.openmrs.obs.A
  413. bstractHandlerTest
  414. [INFO] Running org.openmrs.obs.BinaryDataHandlerTest
  415. [INFO] Tests run: 4, Failures: 0, Errors: 0, Skipped: 0, Time elapsed: 2.508 s - in org.openmrs.obs.B
  416. inaryDataHandlerTest
  417. [INFO] Running org.openmrs.obs.BinaryStreamHandlerTest
  418. [INFO] Tests run: 4, Failures: 0, Errors: 0, Skipped: 0, Time elapsed: 2.065 s - in org.openmrs.obs.B
  419. inaryStreamHandlerTest
  420. [INFO] Running org.openmrs.obs.ImageHandlerTest
  421. [INFO] Tests run: 4, Failures: 0, Errors: 0, Skipped: 0, Time elapsed: 2.001 s - in org.openmrs.obs.I
  422. mageHandlerTest
  423. [INFO] Running org.openmrs.obs.MediaHandlerTest
  424. [INFO] Tests run: 4, Failures: 0, Errors: 0, Skipped: 0, Time elapsed: 1.951 s - in org.openmrs.obs.M
  425. ediaHandlerTest
  426. [INFO] Running org.openmrs.obs.TextHandlerTest
  427. [INFO] Tests run: 4, Failures: 0, Errors: 0, Skipped: 0, Time elapsed: 1.741 s - in org.openmrs.obs.T
  428. extHandlerTest
  429. [INFO] Running org.openmrs.ObsBehaviorTest
  430. [WARNING] Tests run: 3, Failures: 0, Errors: 0, Skipped: 1, Time elapsed: 0.676 s - in org.openmrs.Ob
  431. sBehaviorTest
  432. [INFO] Running org.openmrs.ObsTest
  433. [INFO] Tests run: 58, Failures: 0, Errors: 0, Skipped: 0, Time elapsed: 0.01 s - in org.openmrs.ObsTe
  434. st
  435. [INFO] Running org.openmrs.OpenmrsTestAnnotationsTest
  436. [INFO] Tests run: 2, Failures: 0, Errors: 0, Skipped: 0, Time elapsed: 0.735 s - in org.openmrs.Openm
  437. rsTestAnnotationsTest
  438. [INFO] Running org.openmrs.OpenmrsTestsTest
  439. [INFO] Tests run: 4, Failures: 0, Errors: 0, Skipped: 0, Time elapsed: 0.128 s - in org.openmrs.Openm
  440. rsTestsTest
  441. [INFO] Running org.openmrs.order.OrderUtilTest
  442. [INFO] Tests run: 15, Failures: 0, Errors: 0, Skipped: 0, Time elapsed: 0.001 s - in org.openmrs.orde
  443. r.OrderUtilTest
  444. [INFO] Running org.openmrs.OrderEntryIntegrationTest
  445. [INFO] Tests run: 15, Failures: 0, Errors: 0, Skipped: 0, Time elapsed: 0.945 s - in org.openmrs.Orde
  446. rEntryIntegrationTest
  447. [INFO] Running org.openmrs.OrderGroupTest
  448. [INFO] Tests run: 1, Failures: 0, Errors: 0, Skipped: 0, Time elapsed: 0.001 s - in org.openmrs.Order
  449. GroupTest
  450. [INFO] Running org.openmrs.OrderTest
  451. [INFO] Tests run: 64, Failures: 0, Errors: 0, Skipped: 0, Time elapsed: 0.939 s - in org.openmrs.Orde
  452. rTest
  453. [INFO] Running org.openmrs.OrderTypeTest
  454. [INFO] Tests run: 3, Failures: 0, Errors: 0, Skipped: 0, Time elapsed: 0.001 s - in org.openmrs.Order
  455. TypeTest
  456. [INFO] Running org.openmrs.patient.impl.LuhnIdentifierValidatorTest
  457. [INFO] Tests run: 3, Failures: 0, Errors: 0, Skipped: 0, Time elapsed: 0.001 s - in org.openmrs.patie
  458. nt.impl.LuhnIdentifierValidatorTest
  459. [INFO] Running org.openmrs.patient.impl.VerhoeffIdentifierValidatorTest
  460. [INFO] Tests run: 8, Failures: 0, Errors: 0, Skipped: 0, Time elapsed: 0.001 s - in org.openmrs.patie
  461. nt.impl.VerhoeffIdentifierValidatorTest
  462. [INFO] Running org.openmrs.PatientProgramTest
  463. [INFO] Tests run: 5, Failures: 0, Errors: 0, Skipped: 0, Time elapsed: 0.001 s - in org.openmrs.Patie
  464. ntProgramTest
  465. [INFO] Running org.openmrs.PatientStateTest
  466. [INFO] Tests run: 13, Failures: 0, Errors: 0, Skipped: 0, Time elapsed: 0.001 s - in org.openmrs.Pati
  467. entStateTest
  468. [INFO] Running org.openmrs.PatientTest
  469. [INFO] Tests run: 9, Failures: 0, Errors: 0, Skipped: 0, Time elapsed: 0.002 s - in org.openmrs.Patie
  470. ntTest
  471. [INFO] Running org.openmrs.PersonAddressTest
  472. [INFO] Tests run: 15, Failures: 0, Errors: 0, Skipped: 0, Time elapsed: 0.001 s - in org.openmrs.Pers
  473. onAddressTest
  474. [INFO] Running org.openmrs.PersonAttributeTest
  475. [INFO] Tests run: 6, Failures: 0, Errors: 0, Skipped: 0, Time elapsed: 0.603 s - in org.openmrs.Perso
  476. nAttributeTest
  477. [INFO] Running org.openmrs.PersonNameTest
  478. [INFO] Tests run: 19, Failures: 0, Errors: 0, Skipped: 0, Time elapsed: 0 s - in org.openmrs.PersonNa
  479. meTest
  480. [INFO] Running org.openmrs.PersonTest
  481. [INFO] Tests run: 36, Failures: 0, Errors: 0, Skipped: 0, Time elapsed: 0.735 s - in org.openmrs.Pers
  482. onTest
  483. [INFO] Running org.openmrs.propertyeditor.CohortEditorTest
  484. [INFO] Tests run: 8, Failures: 0, Errors: 0, Skipped: 0, Time elapsed: 0.999 s - in org.openmrs.prope
  485. rtyeditor.CohortEditorTest
  486. [INFO] Running org.openmrs.propertyeditor.ConceptAnswerEditorTest
  487. [INFO] Tests run: 8, Failures: 0, Errors: 0, Skipped: 0, Time elapsed: 0.645 s - in org.openmrs.prope
  488. rtyeditor.ConceptAnswerEditorTest
  489. [INFO] Running org.openmrs.propertyeditor.ConceptAnswersEditorTest
  490. [INFO] Tests run: 1, Failures: 0, Errors: 0, Skipped: 0, Time elapsed: 0.722 s - in org.openmrs.prope
  491. rtyeditor.ConceptAnswersEditorTest
  492. [INFO] Running org.openmrs.propertyeditor.ConceptAttributeTypeEditorTest
  493. [INFO] Tests run: 8, Failures: 0, Errors: 0, Skipped: 0, Time elapsed: 0.784 s - in org.openmrs.prope
  494. rtyeditor.ConceptAttributeTypeEditorTest
  495. [INFO] Running org.openmrs.propertyeditor.ConceptClassEditorTest
  496. [INFO] Tests run: 8, Failures: 0, Errors: 0, Skipped: 0, Time elapsed: 0.74 s - in org.openmrs.proper
  497. tyeditor.ConceptClassEditorTest
  498. [INFO] Running org.openmrs.propertyeditor.ConceptDatatypeEditorTest
  499. [INFO] Tests run: 8, Failures: 0, Errors: 0, Skipped: 0, Time elapsed: 0.697 s - in org.openmrs.prope
  500. rtyeditor.ConceptDatatypeEditorTest
  501. [INFO] Running org.openmrs.propertyeditor.ConceptEditorTest
  502. [INFO] Tests run: 8, Failures: 0, Errors: 0, Skipped: 0, Time elapsed: 0.659 s - in org.openmrs.prope
  503. rtyeditor.ConceptEditorTest
  504. [INFO] Running org.openmrs.propertyeditor.ConceptMapTypeEditorTest
  505. [INFO] Tests run: 8, Failures: 0, Errors: 0, Skipped: 0, Time elapsed: 0.627 s - in org.openmrs.prope
  506. rtyeditor.ConceptMapTypeEditorTest
  507. [INFO] Running org.openmrs.propertyeditor.ConceptNameEditorTest
  508. [INFO] Tests run: 8, Failures: 0, Errors: 0, Skipped: 0, Time elapsed: 0.66 s - in org.openmrs.proper
  509. tyeditor.ConceptNameEditorTest
  510. [INFO] Running org.openmrs.propertyeditor.ConceptNumericEditorTest
  511. [INFO] Tests run: 8, Failures: 0, Errors: 0, Skipped: 0, Time elapsed: 0.651 s - in org.openmrs.prope
  512. rtyeditor.ConceptNumericEditorTest
  513. [INFO] Running org.openmrs.propertyeditor.ConceptReferenceTermEditorTest
  514. [INFO] Tests run: 8, Failures: 0, Errors: 0, Skipped: 0, Time elapsed: 0.65 s - in org.openmrs.proper
  515. tyeditor.ConceptReferenceTermEditorTest
  516. [INFO] Running org.openmrs.propertyeditor.ConceptSourceEditorTest
  517. [INFO] Tests run: 8, Failures: 0, Errors: 0, Skipped: 0, Time elapsed: 0.646 s - in org.openmrs.prope
  518. rtyeditor.ConceptSourceEditorTest
  519. [INFO] Running org.openmrs.propertyeditor.DateOrDatetimeEditorTest
  520. [INFO] Tests run: 6, Failures: 0, Errors: 0, Skipped: 0, Time elapsed: 0.001 s - in org.openmrs.prope
  521. rtyeditor.DateOrDatetimeEditorTest
  522. [INFO] Running org.openmrs.propertyeditor.DrugEditorTest
  523. [INFO] Tests run: 8, Failures: 0, Errors: 0, Skipped: 0, Time elapsed: 0.649 s - in org.openmrs.prope
  524. rtyeditor.DrugEditorTest
  525. [INFO] Running org.openmrs.propertyeditor.EncounterEditorTest
  526. [INFO] Tests run: 8, Failures: 0, Errors: 0, Skipped: 0, Time elapsed: 0.737 s - in org.openmrs.prope
  527. rtyeditor.EncounterEditorTest
  528. [INFO] Running org.openmrs.propertyeditor.EncounterTypeEditorTest
  529. [INFO] Tests run: 8, Failures: 0, Errors: 0, Skipped: 0, Time elapsed: 0.673 s - in org.openmrs.prope
  530. rtyeditor.EncounterTypeEditorTest
  531. [INFO] Running org.openmrs.propertyeditor.FormEditorTest
  532. [INFO] Tests run: 8, Failures: 0, Errors: 0, Skipped: 0, Time elapsed: 0.646 s - in org.openmrs.prope
  533. rtyeditor.FormEditorTest
  534. [INFO] Running org.openmrs.propertyeditor.LocationAttributeTypeEditorTest
  535. [INFO] Tests run: 8, Failures: 0, Errors: 0, Skipped: 0, Time elapsed: 0.78 s - in org.openmrs.proper
  536. tyeditor.LocationAttributeTypeEditorTest
  537. [INFO] Running org.openmrs.propertyeditor.LocationEditorTest
  538. [INFO] Tests run: 8, Failures: 0, Errors: 0, Skipped: 0, Time elapsed: 0.7 s - in org.openmrs.propert
  539. yeditor.LocationEditorTest
  540. [INFO] Running org.openmrs.propertyeditor.LocationTagEditorTest
  541. [INFO] Tests run: 8, Failures: 0, Errors: 0, Skipped: 0, Time elapsed: 0.91 s - in org.openmrs.proper
  542. tyeditor.LocationTagEditorTest
  543. [INFO] Running org.openmrs.propertyeditor.OrderEditorTest
  544. [INFO] Tests run: 8, Failures: 0, Errors: 0, Skipped: 0, Time elapsed: 0.69 s - in org.openmrs.proper
  545. tyeditor.OrderEditorTest
  546. [INFO] Running org.openmrs.propertyeditor.PatientEditorTest
  547. [INFO] Tests run: 8, Failures: 0, Errors: 0, Skipped: 0, Time elapsed: 0.634 s - in org.openmrs.prope
  548. rtyeditor.PatientEditorTest
  549. [INFO] Running org.openmrs.propertyeditor.PatientIdentifierTypeEditorTest
  550. [INFO] Tests run: 8, Failures: 0, Errors: 0, Skipped: 0, Time elapsed: 0.66 s - in org.openmrs.proper
  551. tyeditor.PatientIdentifierTypeEditorTest
  552. [INFO] Running org.openmrs.propertyeditor.PersonAttributeEditorTest
  553. [INFO] Tests run: 8, Failures: 0, Errors: 0, Skipped: 0, Time elapsed: 0.641 s - in org.openmrs.prope
  554. rtyeditor.PersonAttributeEditorTest
  555. [INFO] Running org.openmrs.propertyeditor.PersonAttributeTypeEditorTest
  556. [INFO] Tests run: 8, Failures: 0, Errors: 0, Skipped: 0, Time elapsed: 0.65 s - in org.openmrs.proper
  557. tyeditor.PersonAttributeTypeEditorTest
  558. [INFO] Running org.openmrs.propertyeditor.PersonEditorTest
  559. [INFO] Tests run: 8, Failures: 0, Errors: 0, Skipped: 0, Time elapsed: 0.64 s - in org.openmrs.proper
  560. tyeditor.PersonEditorTest
  561. [INFO] Running org.openmrs.propertyeditor.PrivilegeEditorTest
  562. [INFO] Tests run: 2, Failures: 0, Errors: 0, Skipped: 0, Time elapsed: 0.862 s - in org.openmrs.prope
  563. rtyeditor.PrivilegeEditorTest
  564. [INFO] Running org.openmrs.propertyeditor.ProgramEditorTest
  565. [INFO] Tests run: 4, Failures: 0, Errors: 0, Skipped: 0, Time elapsed: 0.695 s - in org.openmrs.prope
  566. rtyeditor.ProgramEditorTest
  567. [INFO] Running org.openmrs.propertyeditor.ProgramWorkflowEditorTest
  568. [INFO] Tests run: 8, Failures: 0, Errors: 0, Skipped: 0, Time elapsed: 0.722 s - in org.openmrs.prope
  569. rtyeditor.ProgramWorkflowEditorTest
  570. [INFO] Running org.openmrs.propertyeditor.ProgramWorkflowStateEditorTest
  571. [INFO] Tests run: 8, Failures: 0, Errors: 0, Skipped: 0, Time elapsed: 0.731 s - in org.openmrs.prope
  572. rtyeditor.ProgramWorkflowStateEditorTest
  573. [INFO] Running org.openmrs.propertyeditor.ProviderEditorTest
  574. [WARNING] Tests run: 8, Failures: 0, Errors: 0, Skipped: 1, Time elapsed: 0.646 s - in org.openmrs.pr
  575. opertyeditor.ProviderEditorTest
  576. [INFO] Running org.openmrs.propertyeditor.RoleEditorTest
  577. [INFO] Tests run: 2, Failures: 0, Errors: 0, Skipped: 0, Time elapsed: 0.611 s - in org.openmrs.prope
  578. rtyeditor.RoleEditorTest
  579. [INFO] Running org.openmrs.propertyeditor.UserEditorTest
  580. [INFO] Tests run: 8, Failures: 0, Errors: 0, Skipped: 0, Time elapsed: 0.7 s - in org.openmrs.propert
  581. yeditor.UserEditorTest
  582. [INFO] Running org.openmrs.propertyeditor.VisitEditorTest
  583. [INFO] Tests run: 8, Failures: 0, Errors: 0, Skipped: 0, Time elapsed: 0.647 s - in org.openmrs.prope
  584. rtyeditor.VisitEditorTest
  585. [INFO] Running org.openmrs.propertyeditor.VisitTypeEditorTest
  586. [INFO] Tests run: 8, Failures: 0, Errors: 0, Skipped: 0, Time elapsed: 0.664 s - in org.openmrs.prope
  587. rtyeditor.VisitTypeEditorTest
  588. [INFO] Running org.openmrs.propertyeditor.WorkflowCollectionEditorTest
  589. [INFO] Tests run: 1, Failures: 0, Errors: 0, Skipped: 0, Time elapsed: 0.613 s - in org.openmrs.prope
  590. rtyeditor.WorkflowCollectionEditorTest
  591. [INFO] Running org.openmrs.ProviderTest
  592. [INFO] Tests run: 2, Failures: 0, Errors: 0, Skipped: 0, Time elapsed: 0.001 s - in org.openmrs.Provi
  593. derTest
  594. [INFO] Running org.openmrs.RoleTest
  595. [INFO] Tests run: 8, Failures: 0, Errors: 0, Skipped: 0, Time elapsed: 0 s - in org.openmrs.RoleTest
  596. [INFO] Running org.openmrs.scheduler.SchedulerServiceTest
  597. [WARNING] Tests run: 1, Failures: 0, Errors: 0, Skipped: 1, Time elapsed: 0.001 s - in org.openmrs.sc
  598. heduler.SchedulerServiceTest
  599. [INFO] Running org.openmrs.scheduler.SchedulerUtilTest
  600. [INFO] Tests run: 1, Failures: 0, Errors: 0, Skipped: 0, Time elapsed: 0.001 s - in org.openmrs.sched
  601. uler.SchedulerUtilTest
  602. [INFO] Running org.openmrs.scheduler.timer.TimerSchedulerServiceImplTest
  603. [INFO] Tests run: 1, Failures: 0, Errors: 0, Skipped: 0, Time elapsed: 0.646 s - in org.openmrs.sched
  604. uler.timer.TimerSchedulerServiceImplTest
  605. [INFO] Running org.openmrs.serialization.JavaSerializationTest
  606. [INFO] Tests run: 2, Failures: 0, Errors: 0, Skipped: 0, Time elapsed: 0.001 s - in org.openmrs.seria
  607. lization.JavaSerializationTest
  608. [INFO] Running org.openmrs.serialization.SimpleXStreamSerializerTest
  609. Security framework of XStream not initialized, XStream is probably vulnerable.
  610. Security framework of XStream not initialized, XStream is probably vulnerable.
  611. Security framework of XStream not initialized, XStream is probably vulnerable.
  612. [INFO] Tests run: 5, Failures: 0, Errors: 0, Skipped: 0, Time elapsed: 0.006 s - in org.openmrs.seria
  613. lization.SimpleXStreamSerializerTest
  614. [INFO] Running org.openmrs.SimpleDosingInstructionsTest
  615. [INFO] Tests run: 10, Failures: 0, Errors: 0, Skipped: 0, Time elapsed: 0.7 s - in org.openmrs.Simple
  616. DosingInstructionsTest
  617. [INFO] Running org.openmrs.test.matchers.HasFieldErrorsTest
  618. [INFO] Tests run: 13, Failures: 0, Errors: 0, Skipped: 0, Time elapsed: 0.002 s - in org.openmrs.test
  619. .matchers.HasFieldErrorsTest
  620. [INFO] Running org.openmrs.test.matchers.HasGlobalErrorsTest
  621. [INFO] Tests run: 7, Failures: 0, Errors: 0, Skipped: 0, Time elapsed: 0.001 s - in org.openmrs.test.
  622. matchers.HasGlobalErrorsTest
  623. [INFO] Running org.openmrs.TestOrderTest
  624. [INFO] Tests run: 4, Failures: 0, Errors: 0, Skipped: 0, Time elapsed: 0.001 s - in org.openmrs.TestO
  625. rderTest
  626. [INFO] Running org.openmrs.UserTest
  627. [INFO] Tests run: 9, Failures: 0, Errors: 0, Skipped: 0, Time elapsed: 0.001 s - in org.openmrs.UserT
  628. est
  629. [INFO] Running org.openmrs.util.databasechange.ClassLoaderFileOpenerTest
  630. [INFO] Tests run: 3, Failures: 0, Errors: 0, Skipped: 0, Time elapsed: 0.002 s - in org.openmrs.util.
  631. databasechange.ClassLoaderFileOpenerTest
  632. [INFO] Running org.openmrs.util.DatabaseUpdaterTest
  633. [INFO] Tests run: 5, Failures: 0, Errors: 0, Skipped: 0, Time elapsed: 4.084 s - in org.openmrs.util.
  634. DatabaseUpdaterTest
  635. [INFO] Running org.openmrs.util.DateUtilTest
  636. [INFO] Tests run: 1, Failures: 0, Errors: 0, Skipped: 0, Time elapsed: 0.001 s - in org.openmrs.util.
  637. DateUtilTest
  638. [INFO] Running org.openmrs.util.DoubleRangeTest
  639. [INFO] Tests run: 28, Failures: 0, Errors: 0, Skipped: 0, Time elapsed: 0.002 s - in org.openmrs.util
  640. .DoubleRangeTest
  641. [INFO] Running org.openmrs.util.DrugsByNameComparatorTest
  642. [INFO] Tests run: 4, Failures: 0, Errors: 0, Skipped: 0, Time elapsed: 0.002 s - in org.openmrs.util.
  643. DrugsByNameComparatorTest
  644. [INFO] Running org.openmrs.util.ExceptionUtilTest
  645. [INFO] Tests run: 1, Failures: 0, Errors: 0, Skipped: 0, Time elapsed: 0.001 s - in org.openmrs.util.
  646. ExceptionUtilTest
  647. [INFO] Running org.openmrs.util.FormatTest
  648. [INFO] Tests run: 8, Failures: 0, Errors: 0, Skipped: 0, Time elapsed: 0.003 s - in org.openmrs.util.
  649. FormatTest
  650. [INFO] Running org.openmrs.util.GraphTest
  651. [INFO] Tests run: 2, Failures: 0, Errors: 0, Skipped: 0, Time elapsed: 0.001 s - in org.openmrs.util.
  652. GraphTest
  653. [INFO] Running org.openmrs.util.HandlerUtilTest
  654. [INFO] Tests run: 6, Failures: 0, Errors: 0, Skipped: 0, Time elapsed: 0.616 s - in org.openmrs.util.
  655. HandlerUtilTest
  656. [INFO] Running org.openmrs.util.HttpClientTest
  657. [INFO] Tests run: 1, Failures: 0, Errors: 0, Skipped: 0, Time elapsed: 0.021 s - in org.openmrs.util.
  658. HttpClientTest
  659. [INFO] Running org.openmrs.util.HttpUrlTest
  660. [INFO] Tests run: 6, Failures: 0, Errors: 0, Skipped: 0, Time elapsed: 0.001 s - in org.openmrs.util.
  661. HttpUrlTest
  662. [INFO] Running org.openmrs.util.JavaVersionTest
  663. [INFO] Tests run: 2, Failures: 0, Errors: 0, Skipped: 0, Time elapsed: 1.399 s - in org.openmrs.util.
  664. JavaVersionTest
  665. [INFO] Running org.openmrs.util.LocaleUtilityTest
  666. [INFO] Tests run: 21, Failures: 0, Errors: 0, Skipped: 0, Time elapsed: 0.741 s - in org.openmrs.util
  667. .LocaleUtilityTest
  668. [INFO] Running org.openmrs.util.LocationUtilityTest
  669. [INFO] Tests run: 2, Failures: 0, Errors: 0, Skipped: 0, Time elapsed: 0.684 s - in org.openmrs.util.
  670. LocationUtilityTest
  671. [INFO] Running org.openmrs.util.Log4JCompatibilityTest
  672. [INFO] Tests run: 1, Failures: 0, Errors: 0, Skipped: 0, Time elapsed: 0.01 s - in org.openmrs.util.L
  673. og4JCompatibilityTest
  674. [INFO] Running org.openmrs.util.MemoryAppenderTest
  675. [INFO] Tests run: 3, Failures: 0, Errors: 0, Skipped: 0, Time elapsed: 0.02 s - in org.openmrs.util.M
  676. emoryAppenderTest
  677. [INFO] Running org.openmrs.util.NaturalStringsTest
  678. [INFO] Tests run: 40, Failures: 0, Errors: 0, Skipped: 0, Time elapsed: 0.003 s - in org.openmrs.util
  679. .NaturalStringsTest
  680. [INFO] Running org.openmrs.util.OpenmrsSecurityManagerTest
  681. [INFO] Tests run: 2, Failures: 0, Errors: 0, Skipped: 0, Time elapsed: 0.001 s - in org.openmrs.util.
  682. OpenmrsSecurityManagerTest
  683. [INFO] Running org.openmrs.util.OpenmrsUtilTest
  684. DEBUG - LoggingAdvice.invoke(115) |2020-06-22T07:35:34,245| In method AdministrationService.getGlobal
  685. Property. Arguments: String=log.level, String=,
  686. DEBUG - LoggingAdvice.invoke(115) |2020-06-22T07:35:34,249| In method AdministrationService.getGlobal
  687. Property. Arguments: String=log.level,
  688. DEBUG - LoggingAdvice.invoke(155) |2020-06-22T07:35:34,249| Exiting method getGlobalProperty. executi
  689. on time: 0 ms
  690. DEBUG - LoggingAdvice.invoke(155) |2020-06-22T07:35:34,249| Exiting method getGlobalProperty. executi
  691. on time: 4 ms
  692. WARN - OpenmrsUtil.applyLogLevel(614) |2020-06-22T07:35:34,871| Log level invalid string is invalid.
  693. Valid values are trace, debug, info, warn, error or fatal
  694. DEBUG - LoggingAdvice.invoke(115) |2020-06-22T07:35:35,783| In method AdministrationService.getGlobal
  695. Property. Arguments: String=log.level, String=,
  696. DEBUG - LoggingAdvice.invoke(115) |2020-06-22T07:35:35,784| In method AdministrationService.getGlobal
  697. Property. Arguments: String=log.level,
  698. DEBUG - LoggingAdvice.invoke(155) |2020-06-22T07:35:35,784| Exiting method getGlobalProperty. executi
  699. on time: 0 ms
  700. DEBUG - LoggingAdvice.invoke(155) |2020-06-22T07:35:35,784| Exiting method getGlobalProperty. executi
  701. on time: 1 ms
  702. [INFO] Tests run: 57, Failures: 0, Errors: 0, Skipped: 0, Time elapsed: 2.83 s - in org.openmrs.util.
  703. OpenmrsUtilTest
  704. [INFO] Running org.openmrs.util.OpenmrsUtilUnitTest
  705. [INFO] Tests run: 49, Failures: 0, Errors: 0, Skipped: 0, Time elapsed: 0.001 s - in org.openmrs.util
  706. .OpenmrsUtilUnitTest
  707. [INFO] Running org.openmrs.util.PersonByNameComparatorTest
  708. [INFO] Tests run: 4, Failures: 0, Errors: 0, Skipped: 0, Time elapsed: 0.001 s - in org.openmrs.util.
  709. PersonByNameComparatorTest
  710. [INFO] Running org.openmrs.util.ProviderByPersonNameComparatorTest
  711. [INFO] Tests run: 6, Failures: 0, Errors: 0, Skipped: 0, Time elapsed: 0.001 s - in org.openmrs.util.
  712. ProviderByPersonNameComparatorTest
  713. [INFO] Running org.openmrs.util.ReflectTest
  714. [INFO] Tests run: 18, Failures: 0, Errors: 0, Skipped: 0, Time elapsed: 0.001 s - in org.openmrs.util
  715. .ReflectTest
  716. [INFO] Running org.openmrs.util.SecurityTest
  717. [INFO] Tests run: 7, Failures: 0, Errors: 0, Skipped: 0, Time elapsed: 0.017 s - in org.openmrs.util.
  718. SecurityTest
  719. [INFO] Running org.openmrs.util.UpgradeUtilTest
  720. [INFO] Tests run: 2, Failures: 0, Errors: 0, Skipped: 0, Time elapsed: 0.688 s - in org.openmrs.util.
  721. UpgradeUtilTest
  722. [INFO] Running org.openmrs.util.UserByNameComparatorTest
  723. [INFO] Tests run: 1, Failures: 0, Errors: 0, Skipped: 0, Time elapsed: 0.001 s - in org.openmrs.util.
  724. UserByNameComparatorTest
  725. [INFO] Running org.openmrs.validator.AlertValidatorTest
  726. [INFO] Tests run: 5, Failures: 0, Errors: 0, Skipped: 0, Time elapsed: 0.638 s - in org.openmrs.valid
  727. ator.AlertValidatorTest
  728. [INFO] Running org.openmrs.validator.AllergyValidatorTest
  729. [INFO] Tests run: 9, Failures: 0, Errors: 0, Skipped: 0, Time elapsed: 2.038 s - in org.openmrs.valid
  730. ator.AllergyValidatorTest
  731. [INFO] Running org.openmrs.validator.BaseAttributeTypeValidatorTest
  732. [INFO] Tests run: 16, Failures: 0, Errors: 0, Skipped: 0, Time elapsed: 2.432 s - in org.openmrs.vali
  733. dator.BaseAttributeTypeValidatorTest
  734. [INFO] Running org.openmrs.validator.CohortValidatorTest
  735. [INFO] Tests run: 7, Failures: 0, Errors: 0, Skipped: 0, Time elapsed: 0.974 s - in org.openmrs.valid
  736. ator.CohortValidatorTest
  737. [INFO] Running org.openmrs.validator.ConceptAttributeTypeValidatorTest
  738. [INFO] Tests run: 8, Failures: 0, Errors: 0, Skipped: 0, Time elapsed: 0.846 s - in org.openmrs.valid
  739. ator.ConceptAttributeTypeValidatorTest
  740. [INFO] Running org.openmrs.validator.ConceptClassValidatorTest
  741. [INFO] Tests run: 6, Failures: 0, Errors: 0, Skipped: 0, Time elapsed: 0.689 s - in org.openmrs.valid
  742. ator.ConceptClassValidatorTest
  743. [INFO] Running org.openmrs.validator.ConceptDatatypeValidatorTest
  744. [INFO] Tests run: 5, Failures: 0, Errors: 0, Skipped: 0, Time elapsed: 0.655 s - in org.openmrs.valid
  745. ator.ConceptDatatypeValidatorTest
  746. [INFO] Running org.openmrs.validator.ConceptDrugValidatorTest
  747. [INFO] Tests run: 3, Failures: 0, Errors: 0, Skipped: 0, Time elapsed: 0.001 s - in org.openmrs.valid
  748. ator.ConceptDrugValidatorTest
  749. [INFO] Running org.openmrs.validator.ConceptMapTypeValidatorTest
  750. [INFO] Tests run: 8, Failures: 0, Errors: 0, Skipped: 0, Time elapsed: 0.655 s - in org.openmrs.valid
  751. ator.ConceptMapTypeValidatorTest
  752. [INFO] Running org.openmrs.validator.ConceptNameTagValidatorTest
  753. [INFO] Tests run: 7, Failures: 0, Errors: 0, Skipped: 0, Time elapsed: 0.627 s - in org.openmrs.valid
  754. ator.ConceptNameTagValidatorTest
  755. [INFO] Running org.openmrs.validator.ConceptReferenceTermValidatorTest
  756. [Field error in object 'term' on field 'conceptReferenceTermMaps[1].termB': rejected value [weight te
  757. rm(WGT234)]; codes [ConceptReferenceTerm.termToTerm.alreadyMapped.term.conceptReferenceTermMaps[1].te
  758. rmB,ConceptReferenceTerm.termToTerm.alreadyMapped.term.conceptReferenceTermMaps.termB,ConceptReferenc
  759. eTerm.termToTerm.alreadyMapped.conceptReferenceTermMaps[1].termB,ConceptReferenceTerm.termToTerm.alre
  760. adyMapped.conceptReferenceTermMaps.termB,ConceptReferenceTerm.termToTerm.alreadyMapped.termB,ConceptR
  761. eferenceTerm.termToTerm.alreadyMapped.org.openmrs.ConceptReferenceTerm,ConceptReferenceTerm.termToTer
  762. m.alreadyMapped]; arguments []; default message [Cannot map a reference term multiple times to the sa
  763. me concept reference term]]
  764. [WARNING] Tests run: 18, Failures: 0, Errors: 0, Skipped: 3, Time elapsed: 0.765 s - in org.openmrs.v
  765. alidator.ConceptReferenceTermValidatorTest
  766. [INFO] Running org.openmrs.validator.ConceptSourceValidatorTest
  767. [INFO] Tests run: 6, Failures: 0, Errors: 0, Skipped: 0, Time elapsed: 0.714 s - in org.openmrs.valid
  768. ator.ConceptSourceValidatorTest
  769. [INFO] Running org.openmrs.validator.ConceptValidatorTest
  770. [INFO] Tests run: 31, Failures: 0, Errors: 0, Skipped: 0, Time elapsed: 0.808 s - in org.openmrs.vali
  771. dator.ConceptValidatorTest
  772. [INFO] Running org.openmrs.validator.ConditionValidatorTest
  773. [INFO] Tests run: 4, Failures: 0, Errors: 0, Skipped: 0, Time elapsed: 0.001 s - in org.openmrs.valid
  774. ator.ConditionValidatorTest
  775. [INFO] Running org.openmrs.validator.DiagnosisValidatorTest
  776. [INFO] Tests run: 6, Failures: 0, Errors: 0, Skipped: 0, Time elapsed: 0.649 s - in org.openmrs.valid
  777. ator.DiagnosisValidatorTest
  778. [INFO] Running org.openmrs.validator.DrugOrderValidatorTest
  779. [INFO] Tests run: 36, Failures: 0, Errors: 0, Skipped: 0, Time elapsed: 1.897 s - in org.openmrs.vali
  780. dator.DrugOrderValidatorTest
  781. [INFO] Running org.openmrs.validator.DrugValidatorTest
  782. [INFO] Tests run: 9, Failures: 0, Errors: 0, Skipped: 0, Time elapsed: 0.757 s - in org.openmrs.valid
  783. ator.DrugValidatorTest
  784. [INFO] Running org.openmrs.validator.EncounterRoleValidatorTest
  785. [INFO] Tests run: 5, Failures: 0, Errors: 0, Skipped: 0, Time elapsed: 0.742 s - in org.openmrs.valid
  786. ator.EncounterRoleValidatorTest
  787. [INFO] Running org.openmrs.validator.EncounterTypeValidatorTest
  788. [INFO] Tests run: 7, Failures: 0, Errors: 0, Skipped: 0, Time elapsed: 0.661 s - in org.openmrs.valid
  789. ator.EncounterTypeValidatorTest
  790. [INFO] Running org.openmrs.validator.EncounterValidatorTest
  791. [INFO] Tests run: 12, Failures: 0, Errors: 0, Skipped: 0, Time elapsed: 0.68 s - in org.openmrs.valid
  792. ator.EncounterValidatorTest
  793. [INFO] Running org.openmrs.validator.FieldTypeValidatorTest
  794. [INFO] Tests run: 5, Failures: 0, Errors: 0, Skipped: 0, Time elapsed: 0.674 s - in org.openmrs.valid
  795. ator.FieldTypeValidatorTest
  796. [INFO] Running org.openmrs.validator.FieldValidatorTest
  797. [INFO] Tests run: 8, Failures: 0, Errors: 0, Skipped: 0, Time elapsed: 0.692 s - in org.openmrs.valid
  798. ator.FieldValidatorTest
  799. [INFO] Running org.openmrs.validator.FormValidatorTest
  800. [INFO] Tests run: 8, Failures: 0, Errors: 0, Skipped: 0, Time elapsed: 0.66 s - in org.openmrs.valida
  801. tor.FormValidatorTest
  802. [INFO] Running org.openmrs.validator.HL7SourceValidatorTest
  803. [INFO] Tests run: 2, Failures: 0, Errors: 0, Skipped: 0, Time elapsed: 0.625 s - in org.openmrs.valid
  804. ator.HL7SourceValidatorTest
  805. [INFO] Running org.openmrs.validator.ImplementationIdValidatorTest
  806. [INFO] Tests run: 8, Failures: 0, Errors: 0, Skipped: 0, Time elapsed: 0.677 s - in org.openmrs.valid
  807. ator.ImplementationIdValidatorTest
  808. [INFO] Running org.openmrs.validator.LocationAttributeTypeValidatorTest
  809. [INFO] Tests run: 6, Failures: 0, Errors: 0, Skipped: 0, Time elapsed: 0.804 s - in org.openmrs.valid
  810. ator.LocationAttributeTypeValidatorTest
  811. [INFO] Running org.openmrs.validator.LocationTagValidatorTest
  812. [INFO] Tests run: 2, Failures: 0, Errors: 0, Skipped: 0, Time elapsed: 0.705 s - in org.openmrs.valid
  813. ator.LocationTagValidatorTest
  814. [INFO] Running org.openmrs.validator.LocationValidatorTest
  815. [INFO] Tests run: 9, Failures: 0, Errors: 0, Skipped: 0, Time elapsed: 0.684 s - in org.openmrs.valid
  816. ator.LocationValidatorTest
  817. [INFO] Running org.openmrs.validator.ObsValidatorTest
  818. [INFO] Tests run: 22, Failures: 0, Errors: 0, Skipped: 0, Time elapsed: 0.778 s - in org.openmrs.vali
  819. dator.ObsValidatorTest
  820. [INFO] Running org.openmrs.validator.OrderFrequencyValidatorTest
  821. [INFO] Tests run: 9, Failures: 0, Errors: 0, Skipped: 0, Time elapsed: 0.669 s - in org.openmrs.valid
  822. ator.OrderFrequencyValidatorTest
  823. [INFO] Running org.openmrs.validator.OrderTypeValidatorTest
  824. [INFO] Tests run: 14, Failures: 0, Errors: 0, Skipped: 0, Time elapsed: 0.687 s - in org.openmrs.vali
  825. dator.OrderTypeValidatorTest
  826. [INFO] Running org.openmrs.validator.OrderValidatorTest
  827. [INFO] Tests run: 22, Failures: 0, Errors: 0, Skipped: 0, Time elapsed: 0.936 s - in org.openmrs.vali
  828. dator.OrderValidatorTest
  829. [INFO] Running org.openmrs.validator.PatientIdentifierTypeValidatorTest
  830. [INFO] Tests run: 9, Failures: 0, Errors: 0, Skipped: 0, Time elapsed: 0.711 s - in org.openmrs.valid
  831. ator.PatientIdentifierTypeValidatorTest
  832. [INFO] Running org.openmrs.validator.PatientIdentifierValidatorTest
  833. [INFO] Tests run: 20, Failures: 0, Errors: 0, Skipped: 0, Time elapsed: 0.746 s - in org.openmrs.vali
  834. dator.PatientIdentifierValidatorTest
  835. [INFO] Running org.openmrs.validator.PatientProgramValidatorTest
  836. [INFO] Tests run: 22, Failures: 0, Errors: 0, Skipped: 0, Time elapsed: 0.766 s - in org.openmrs.vali
  837. dator.PatientProgramValidatorTest
  838. [INFO] Running org.openmrs.validator.PatientValidatorTest
  839. [INFO] Tests run: 17, Failures: 0, Errors: 0, Skipped: 0, Time elapsed: 0.734 s - in org.openmrs.vali
  840. dator.PatientValidatorTest
  841. [INFO] Running org.openmrs.validator.PersonAddressValidatorTest
  842. [INFO] Tests run: 10, Failures: 0, Errors: 0, Skipped: 0, Time elapsed: 0.687 s - in org.openmrs.vali
  843. dator.PersonAddressValidatorTest
  844. [INFO] Running org.openmrs.validator.PersonAttributeTypeValidatorTest
  845. [INFO] Tests run: 7, Failures: 0, Errors: 0, Skipped: 0, Time elapsed: 0.651 s - in org.openmrs.valid
  846. ator.PersonAttributeTypeValidatorTest
  847. [INFO] Running org.openmrs.validator.PersonMergeLogValidatorTest
  848. [INFO] Tests run: 6, Failures: 0, Errors: 0, Skipped: 0, Time elapsed: 0.646 s - in org.openmrs.valid
  849. ator.PersonMergeLogValidatorTest
  850. [INFO] Running org.openmrs.validator.PersonNameValidatorTest
  851. [WARNING] Tests run: 59, Failures: 0, Errors: 0, Skipped: 8, Time elapsed: 0.936 s - in org.openmrs.v
  852. alidator.PersonNameValidatorTest
  853. [INFO] Running org.openmrs.validator.PersonValidatorTest
  854. [INFO] Tests run: 13, Failures: 0, Errors: 0, Skipped: 0, Time elapsed: 0.796 s - in org.openmrs.vali
  855. dator.PersonValidatorTest
  856. [INFO] Running org.openmrs.validator.PrivilegeValidatorTest
  857. [INFO] Tests run: 5, Failures: 0, Errors: 0, Skipped: 0, Time elapsed: 0.743 s - in org.openmrs.valid
  858. ator.PrivilegeValidatorTest
  859. [INFO] Running org.openmrs.validator.ProgramValidatorTest
  860. [INFO] Tests run: 8, Failures: 0, Errors: 0, Skipped: 0, Time elapsed: 0.795 s - in org.openmrs.valid
  861. ator.ProgramValidatorTest
  862. [INFO] Running org.openmrs.validator.ProviderAttributeTypeValidatorTest
  863. [INFO] Tests run: 2, Failures: 0, Errors: 0, Skipped: 0, Time elapsed: 0.659 s - in org.openmrs.valid
  864. ator.ProviderAttributeTypeValidatorTest
  865. [INFO] Running org.openmrs.validator.ProviderValidatorTest
  866. [INFO] Tests run: 13, Failures: 0, Errors: 0, Skipped: 0, Time elapsed: 0.81 s - in org.openmrs.valid
  867. ator.ProviderValidatorTest
  868. [INFO] Running org.openmrs.validator.RelationshipTypeValidatorTest
  869. [INFO] Tests run: 7, Failures: 0, Errors: 0, Skipped: 0, Time elapsed: 0.653 s - in org.openmrs.valid
  870. ator.RelationshipTypeValidatorTest
  871. [INFO] Running org.openmrs.validator.RelationshipValidatorTest
  872. [INFO] Tests run: 7, Failures: 0, Errors: 0, Skipped: 0, Time elapsed: 0.656 s - in org.openmrs.valid
  873. ator.RelationshipValidatorTest
  874. [INFO] Running org.openmrs.validator.RequireNameValidatorTest
  875. [INFO] Tests run: 2, Failures: 0, Errors: 0, Skipped: 0, Time elapsed: 0.001 s - in org.openmrs.valid
  876. ator.RequireNameValidatorTest
  877. [INFO] Running org.openmrs.validator.RoleValidatorTest
  878. [INFO] Tests run: 6, Failures: 0, Errors: 0, Skipped: 0, Time elapsed: 0.64 s - in org.openmrs.valida
  879. tor.RoleValidatorTest
  880. [INFO] Running org.openmrs.validator.SchedulerFormValidatorTest
  881. [INFO] Tests run: 10, Failures: 0, Errors: 0, Skipped: 0, Time elapsed: 0.712 s - in org.openmrs.vali
  882. dator.SchedulerFormValidatorTest
  883. [INFO] Running org.openmrs.validator.StateConversionValidatorTest
  884. [INFO] Tests run: 4, Failures: 0, Errors: 0, Skipped: 0, Time elapsed: 0.649 s - in org.openmrs.valid
  885. ator.StateConversionValidatorTest
  886. [INFO] Running org.openmrs.validator.TestOrderValidatorTest
  887. [INFO] Tests run: 2, Failures: 0, Errors: 0, Skipped: 0, Time elapsed: 0.633 s - in org.openmrs.valid
  888. ator.TestOrderValidatorTest
  889. [INFO] Running org.openmrs.validator.UserValidatorTest
  890. [INFO] Tests run: 23, Failures: 0, Errors: 0, Skipped: 0, Time elapsed: 0.719 s - in org.openmrs.vali
  891. dator.UserValidatorTest
  892. [INFO] Running org.openmrs.validator.ValidateUtilTest
  893. [INFO] Tests run: 9, Failures: 0, Errors: 0, Skipped: 0, Time elapsed: 0.699 s - in org.openmrs.valid
  894. ator.ValidateUtilTest
  895. [INFO] Running org.openmrs.validator.VisitAttributeTypeValidatorTest
  896. [INFO] Tests run: 2, Failures: 0, Errors: 0, Skipped: 0, Time elapsed: 0.633 s - in org.openmrs.valid
  897. ator.VisitAttributeTypeValidatorTest
  898. [INFO] Running org.openmrs.validator.VisitTypeValidatorTest
  899. [INFO] Tests run: 2, Failures: 0, Errors: 0, Skipped: 0, Time elapsed: 0.633 s - in org.openmrs.valid
  900. ator.VisitTypeValidatorTest
  901. [INFO] Running org.openmrs.validator.VisitValidatorTest
  902. [WARNING] Tests run: 27, Failures: 0, Errors: 0, Skipped: 1, Time elapsed: 1.397 s - in org.openmrs.v
  903. alidator.VisitValidatorTest
  904. [INFO]
  905. [INFO] Results:
  906. [INFO]
  907. [WARNING] Tests run: 4259, Failures: 0, Errors: 0, Skipped: 36
  908. [INFO]
  909. [INFO]
  910. [INFO] --- maven-jar-plugin:2.3.2:jar (default-jar) @ openmrs-api ---
  911. [INFO] Building jar: C:\Users\barba\IdeaProjects\openmrs-core\api\target\openmrs-api-2.4.0-SNAPSHOT.j
  912. ar
  913. [INFO]
  914. [INFO] --- maven-jar-plugin:2.3.2:test-jar (default) @ openmrs-api ---
  915. [INFO] Building jar: C:\Users\barba\IdeaProjects\openmrs-core\api\target\openmrs-api-2.4.0-SNAPSHOT-t
  916. ests.jar
  917. [INFO]
  918. [INFO] --- license-maven-plugin:3.0:check (default) @ openmrs-api ---
  919. [INFO] Checking licenses...
  920. [INFO]
  921. [INFO] --- maven-install-plugin:2.4:install (default-install) @ openmrs-api ---
  922. [INFO] Installing C:\Users\barba\IdeaProjects\openmrs-core\api\target\openmrs-api-2.4.0-SNAPSHOT.jar
  923. to C:\Users\barba\.m2\repository\org\openmrs\api\openmrs-api\2.4.0-SNAPSHOT\openmrs-api-2.4.0-SNAPSHO
  924. T.jar
  925. [INFO] Installing C:\Users\barba\IdeaProjects\openmrs-core\api\pom.xml to C:\Users\barba\.m2\reposito
  926. ry\org\openmrs\api\openmrs-api\2.4.0-SNAPSHOT\openmrs-api-2.4.0-SNAPSHOT.pom
  927. [INFO] Installing C:\Users\barba\IdeaProjects\openmrs-core\api\target\openmrs-api-2.4.0-SNAPSHOT-test
  928. s.jar to C:\Users\barba\.m2\repository\org\openmrs\api\openmrs-api\2.4.0-SNAPSHOT\openmrs-api-2.4.0-S
  929. NAPSHOT-tests.jar
  930. [INFO]
  931. [INFO] --------------------< org.openmrs.web:openmrs-web >---------------------
  932. [INFO] Building openmrs-web 2.4.0-SNAPSHOT [5/7]
  933. [INFO] --------------------------------[ jar ]---------------------------------
  934. [INFO]
  935. [INFO] --- maven-clean-plugin:2.5:clean (default-clean) @ openmrs-web ---
  936. [INFO] Deleting C:\Users\barba\IdeaProjects\openmrs-core\web\target
  937. [INFO]
  938. [INFO] --- buildnumber-maven-plugin:1.1:create (default) @ openmrs-web ---
  939. [INFO]
  940. [INFO] --- build-helper-maven-plugin:1.5:parse-version (parse-version) @ openmrs-web ---
  941. [INFO]
  942. [INFO] --- jacoco-maven-plugin:0.8.5:prepare-agent (prepare-agent) @ openmrs-web ---
  943. [INFO] argLine set to -javaagent:C:\\Users\\barba\\.m2\\repository\\org\\jacoco\\org.jacoco.agent\\0.
  944. 8.5\\org.jacoco.agent-0.8.5-runtime.jar=destfile=C:\\Users\\barba\\IdeaProjects\\openmrs-core\\web\\t
  945. arget\\jacoco.exec,includes=org/openmrs/** -Duser.language=en -Duser.region=US -Xmx2g -Djava.locale.p
  946. roviders=COMPAT
  947. [INFO]
  948. [INFO] --- maven-java-formatter-plugin:0.3:format (default) @ openmrs-web ---
  949. [INFO] Using 'UTF-8' encoding to format source files.
  950. [INFO] Number of files to be formatted: 53
  951. [INFO] Successfully formatted: 0 file(s)
  952. [INFO] Fail to format : 0 file(s)
  953. [INFO] Skipped : 53 file(s)
  954. [INFO] Approximate time taken: 0s
  955. [INFO]
  956. [INFO] --- maven-resources-plugin:2.4:resources (default-resources) @ openmrs-web ---
  957. [INFO] Using 'UTF-8' encoding to copy filtered resources.
  958. [INFO] Copying 22 resources
  959. [INFO]
  960. [INFO] --- maven-compiler-plugin:3.8.1:compile (default-compile) @ openmrs-web ---
  961. [INFO] Changes detected - recompiling the module!
  962. [INFO] Compiling 37 source files to C:\Users\barba\IdeaProjects\openmrs-core\web\target\classes
  963. [INFO] /C:/Users/barba/IdeaProjects/openmrs-core/web/src/main/java/org/openmrs/web/WebUtil.java: Some
  964. input files use or override a deprecated API.
  965. [INFO] /C:/Users/barba/IdeaProjects/openmrs-core/web/src/main/java/org/openmrs/web/WebUtil.java: Reco
  966. mpile with -Xlint:deprecation for details.
  967. [INFO] /C:/Users/barba/IdeaProjects/openmrs-core/web/src/main/java/org/openmrs/module/web/ModuleServl
  968. et.java: C:\Users\barba\IdeaProjects\openmrs-core\web\src\main\java\org\openmrs\module\web\ModuleServ
  969. let.java uses unchecked or unsafe operations.
  970. [INFO] /C:/Users/barba/IdeaProjects/openmrs-core/web/src/main/java/org/openmrs/module/web/ModuleServl
  971. et.java: Recompile with -Xlint:unchecked for details.
  972. [INFO]
  973. [INFO] --- maven-resources-plugin:2.4:testResources (default-testResources) @ openmrs-web ---
  974. [INFO] Using 'UTF-8' encoding to copy filtered resources.
  975. [INFO] Copying 1 resource
  976. [INFO]
  977. [INFO] --- maven-compiler-plugin:3.8.1:testCompile (default-testCompile) @ openmrs-web ---
  978. [INFO] Changes detected - recompiling the module!
  979. [INFO] Compiling 16 source files to C:\Users\barba\IdeaProjects\openmrs-core\web\target\test-classes
  980. [INFO] /C:/Users/barba/IdeaProjects/openmrs-core/web/src/test/java/org/openmrs/web/filter/update/Upda
  981. teFilterModelTest.java: Some input files use or override a deprecated API.
  982. [INFO] /C:/Users/barba/IdeaProjects/openmrs-core/web/src/test/java/org/openmrs/web/filter/update/Upda
  983. teFilterModelTest.java: Recompile with -Xlint:deprecation for details.
  984. [INFO]
  985. [INFO] --- maven-surefire-plugin:2.22.2:test (default-test) @ openmrs-web ---
  986. [INFO]
  987. [INFO] -------------------------------------------------------
  988. [INFO] T E S T S
  989. [INFO] -------------------------------------------------------
  990. [INFO] Running org.openmrs.module.filter.ModuleFilterDefinitionTest
  991. [INFO] Tests run: 4, Failures: 0, Errors: 0, Skipped: 0, Time elapsed: 0.823 s - in org.openmrs.modul
  992. e.filter.ModuleFilterDefinitionTest
  993. [INFO] Running org.openmrs.module.web.WebModuleUtilTest
  994. [INFO] Tests run: 9, Failures: 0, Errors: 0, Skipped: 0, Time elapsed: 4.773 s - in org.openmrs.modul
  995. e.web.WebModuleUtilTest
  996. [INFO] Running org.openmrs.web.context.AltAuthSchemeContextTest
  997. [INFO] Tests run: 1, Failures: 0, Errors: 0, Skipped: 0, Time elapsed: 14.951 s - in org.openmrs.web.
  998. context.AltAuthSchemeContextTest
  999. [INFO] Running org.openmrs.web.filter.startuperror.StartupErrorFilterTest
  1000. [INFO] Tests run: 3, Failures: 0, Errors: 0, Skipped: 0, Time elapsed: 2.8 s - in org.openmrs.web.fil
  1001. ter.startuperror.StartupErrorFilterTest
  1002. [INFO] Running org.openmrs.web.filter.update.GZIPFilterTest
  1003. [INFO] Tests run: 1, Failures: 0, Errors: 0, Skipped: 0, Time elapsed: 0.132 s - in org.openmrs.web.f
  1004. ilter.update.GZIPFilterTest
  1005. [INFO] Running org.openmrs.web.filter.update.UpdateFilterModelTest
  1006. [INFO] Tests run: 6, Failures: 0, Errors: 0, Skipped: 0, Time elapsed: 2.402 s - in org.openmrs.web.f
  1007. ilter.update.UpdateFilterModelTest
  1008. [INFO] Running org.openmrs.web.filter.update.UpdateFilterTest
  1009. [INFO] Tests run: 5, Failures: 0, Errors: 0, Skipped: 0, Time elapsed: 0.244 s - in org.openmrs.web.f
  1010. ilter.update.UpdateFilterTest
  1011. [INFO] Running org.openmrs.web.filter.update.util.FilterUtilTest
  1012. [WARNING] Tests run: 2, Failures: 0, Errors: 0, Skipped: 2, Time elapsed: 0.001 s - in org.openmrs.we
  1013. b.filter.update.util.FilterUtilTest
  1014. [INFO] Running org.openmrs.web.WebDaemonTest
  1015. [INFO] Tests run: 1, Failures: 0, Errors: 0, Skipped: 0, Time elapsed: 0.003 s - in org.openmrs.web.W
  1016. ebDaemonTest
  1017. [INFO] Running org.openmrs.web.WebUtilTest
  1018. [INFO] Tests run: 14, Failures: 0, Errors: 0, Skipped: 0, Time elapsed: 0.001 s - in org.openmrs.web.
  1019. WebUtilTest
  1020. [INFO]
  1021. [INFO] Results:
  1022. [INFO]
  1023. [WARNING] Tests run: 46, Failures: 0, Errors: 0, Skipped: 2
  1024. [INFO]
  1025. [INFO]
  1026. [INFO] --- maven-jar-plugin:2.3.2:jar (default-jar) @ openmrs-web ---
  1027. [INFO] Building jar: C:\Users\barba\IdeaProjects\openmrs-core\web\target\openmrs-web-2.4.0-SNAPSHOT.j
  1028. ar
  1029. [INFO]
  1030. [INFO] --- maven-jar-plugin:2.3.2:test-jar (default) @ openmrs-web ---
  1031. [INFO] Building jar: C:\Users\barba\IdeaProjects\openmrs-core\web\target\openmrs-web-2.4.0-SNAPSHOT-t
  1032. ests.jar
  1033. [INFO]
  1034. [INFO] --- license-maven-plugin:3.0:check (default) @ openmrs-web ---
  1035. [INFO] Checking licenses...
  1036. [INFO]
  1037. [INFO] --- maven-install-plugin:2.4:install (default-install) @ openmrs-web ---
  1038. [INFO] Installing C:\Users\barba\IdeaProjects\openmrs-core\web\target\openmrs-web-2.4.0-SNAPSHOT.jar
  1039. to C:\Users\barba\.m2\repository\org\openmrs\web\openmrs-web\2.4.0-SNAPSHOT\openmrs-web-2.4.0-SNAPSHO
  1040. T.jar
  1041. [INFO] Installing C:\Users\barba\IdeaProjects\openmrs-core\web\pom.xml to C:\Users\barba\.m2\reposito
  1042. ry\org\openmrs\web\openmrs-web\2.4.0-SNAPSHOT\openmrs-web-2.4.0-SNAPSHOT.pom
  1043. [INFO] Installing C:\Users\barba\IdeaProjects\openmrs-core\web\target\openmrs-web-2.4.0-SNAPSHOT-test
  1044. s.jar to C:\Users\barba\.m2\repository\org\openmrs\web\openmrs-web\2.4.0-SNAPSHOT\openmrs-web-2.4.0-S
  1045. NAPSHOT-tests.jar
  1046. [INFO]
  1047. [INFO] -------------------< org.openmrs.web:openmrs-webapp >-------------------
  1048. [INFO] Building openmrs-webapp 2.4.0-SNAPSHOT [6/7]
  1049. [INFO] --------------------------------[ war ]---------------------------------
  1050. [INFO]
  1051. [INFO] --- maven-clean-plugin:2.5:clean (default-clean) @ openmrs-webapp ---
  1052. [INFO] Deleting C:\Users\barba\IdeaProjects\openmrs-core\webapp\target
  1053. [INFO]
  1054. [INFO] --- buildnumber-maven-plugin:1.1:create (default) @ openmrs-webapp ---
  1055. [INFO]
  1056. [INFO] --- build-helper-maven-plugin:1.5:parse-version (parse-version) @ openmrs-webapp ---
  1057. [INFO]
  1058. [INFO] --- maven-resources-plugin:2.4:resources (default-resources) @ openmrs-webapp ---
  1059. [INFO] Using 'UTF-8' encoding to copy filtered resources.
  1060. [INFO] Copying 2 resources
  1061. [INFO] Copying 1 resource to ../jetty
  1062. [INFO]
  1063. [INFO] --- maven-antrun-plugin:1.4:run (default) @ openmrs-webapp ---
  1064. project.artifactId
  1065. [INFO] Executing tasks
  1066. [unzip] Expanding: C:\Users\barba\IdeaProjects\openmrs-core\webapp\src\main\resources\liquibase-d
  1067. emo-data.zip into C:\Users\barba\IdeaProjects\openmrs-core\webapp\target\classes
  1068. [INFO] Executed tasks
  1069. [INFO]
  1070. [INFO] --- maven-compiler-plugin:3.8.1:compile (default-compile) @ openmrs-webapp ---
  1071. [INFO] No sources to compile
  1072. [INFO]
  1073. [INFO] --- maven-resources-plugin:2.4:testResources (default-testResources) @ openmrs-webapp ---
  1074. [INFO] Using 'UTF-8' encoding to copy filtered resources.
  1075. [INFO] Copying 1 resource
  1076. [INFO]
  1077. [INFO] --- maven-compiler-plugin:3.8.1:testCompile (default-testCompile) @ openmrs-webapp ---
  1078. [INFO] Changes detected - recompiling the module!
  1079. [INFO] Compiling 3 source files to C:\Users\barba\IdeaProjects\openmrs-core\webapp\target\test-classe
  1080. s
  1081. [INFO]
  1082. [INFO] --- maven-surefire-plugin:2.22.2:test (default-test) @ openmrs-webapp ---
  1083. [INFO]
  1084. [INFO] -------------------------------------------------------
  1085. [INFO] T E S T S
  1086. [INFO] -------------------------------------------------------
  1087. [INFO] Running org.openmrs.MessagePropertiesFilesTest
  1088. [INFO] Tests run: 0, Failures: 0, Errors: 0, Skipped: 0, Time elapsed: 0.048 s - in org.openmrs.Messa
  1089. gePropertiesFilesTest
  1090. [INFO]
  1091. [INFO] Results:
  1092. [INFO]
  1093. [INFO] Tests run: 0, Failures: 0, Errors: 0, Skipped: 0
  1094. [INFO]
  1095. [INFO]
  1096. [INFO] --- maven-war-plugin:2.4:war (default-war) @ openmrs-webapp ---
  1097. WARNING: An illegal reflective access operation has occurred
  1098. WARNING: Illegal reflective access by com.thoughtworks.xstream.converters.collections.TreeMapConverte
  1099. r (file:/C:/Users/barba/.m2/repository/com/thoughtworks/xstream/xstream/1.4.2/xstream-1.4.2.jar) to f
  1100. ield java.util.TreeMap.comparator
  1101. WARNING: Please consider reporting this to the maintainers of com.thoughtworks.xstream.converters.col
  1102. lections.TreeMapConverter
  1103. WARNING: Use --illegal-access=warn to enable warnings of further illegal reflective access operations
  1104.  
  1105. WARNING: All illegal access operations will be denied in a future release
  1106. [INFO] Packaging webapp
  1107. [INFO] Assembling webapp [openmrs-webapp] in [C:\Users\barba\IdeaProjects\openmrs-core\webapp\target\
  1108. openmrs]
  1109. [INFO] Processing war project
  1110. [INFO] Copying webapp webResources [C:\Users\barba\IdeaProjects\openmrs-core\webapp\src/main/webapp]
  1111. to [C:\Users\barba\IdeaProjects\openmrs-core\webapp\target\openmrs]
  1112. [INFO] Copying webapp resources [C:\Users\barba\IdeaProjects\openmrs-core\webapp\src\main\webapp]
  1113. [INFO] Webapp assembled in [1050 msecs]
  1114. [INFO] Building war: C:\Users\barba\IdeaProjects\openmrs-core\webapp\target\openmrs.war
  1115. [INFO]
  1116. [INFO] --- maven-jar-plugin:2.3.2:test-jar (default) @ openmrs-webapp ---
  1117. [INFO] Building jar: C:\Users\barba\IdeaProjects\openmrs-core\webapp\target\openmrs-tests.jar
  1118. [INFO]
  1119. [INFO] --- license-maven-plugin:3.0:check (default) @ openmrs-webapp ---
  1120. [INFO] Checking licenses...
  1121. [INFO]
  1122. [INFO] --- maven-install-plugin:2.4:install (default-install) @ openmrs-webapp ---
  1123. [INFO] Installing C:\Users\barba\IdeaProjects\openmrs-core\webapp\target\openmrs.war to C:\Users\barb
  1124. a\.m2\repository\org\openmrs\web\openmrs-webapp\2.4.0-SNAPSHOT\openmrs-webapp-2.4.0-SNAPSHOT.war
  1125. [INFO] Installing C:\Users\barba\IdeaProjects\openmrs-core\webapp\pom.xml to C:\Users\barba\.m2\repos
  1126. itory\org\openmrs\web\openmrs-webapp\2.4.0-SNAPSHOT\openmrs-webapp-2.4.0-SNAPSHOT.pom
  1127. [INFO] Installing C:\Users\barba\IdeaProjects\openmrs-core\webapp\target\openmrs-tests.jar to C:\User
  1128. s\barba\.m2\repository\org\openmrs\web\openmrs-webapp\2.4.0-SNAPSHOT\openmrs-webapp-2.4.0-SNAPSHOT-te
  1129. sts.jar
  1130. [INFO]
  1131. [INFO] --------------< org.openmrs.liquibase:openmrs-liquibase >---------------
  1132. [INFO] Building openmrs-liquibase 2.4.0-SNAPSHOT [7/7]
  1133. [INFO] --------------------------------[ jar ]---------------------------------
  1134. [INFO]
  1135. [INFO] --- maven-clean-plugin:2.5:clean (default-clean) @ openmrs-liquibase ---
  1136. [INFO] Deleting C:\Users\barba\IdeaProjects\openmrs-core\liquibase\target
  1137. [INFO]
  1138. [INFO] --- buildnumber-maven-plugin:1.1:create (default) @ openmrs-liquibase ---
  1139. [INFO]
  1140. [INFO] --- build-helper-maven-plugin:1.5:parse-version (parse-version) @ openmrs-liquibase ---
  1141. [INFO]
  1142. [INFO] --- maven-resources-plugin:2.4:resources (default-resources) @ openmrs-liquibase ---
  1143. [INFO] Using 'UTF-8' encoding to copy filtered resources.
  1144. [INFO] skip non existing resourceDirectory C:\Users\barba\IdeaProjects\openmrs-core\liquibase\src\mai
  1145. n\resources
  1146. [INFO]
  1147. [INFO] --- maven-compiler-plugin:3.8.1:compile (default-compile) @ openmrs-liquibase ---
  1148. [INFO] No sources to compile
  1149. [INFO]
  1150. [INFO] --- maven-resources-plugin:2.4:testResources (default-testResources) @ openmrs-liquibase ---
  1151. [INFO] Using 'UTF-8' encoding to copy filtered resources.
  1152. [INFO] skip non existing resourceDirectory C:\Users\barba\IdeaProjects\openmrs-core\liquibase\src\tes
  1153. t\resources
  1154. [INFO]
  1155. [INFO] --- maven-compiler-plugin:3.8.1:testCompile (default-testCompile) @ openmrs-liquibase ---
  1156. [INFO] No sources to compile
  1157. [INFO]
  1158. [INFO] --- maven-surefire-plugin:2.22.2:test (default-test) @ openmrs-liquibase ---
  1159. [INFO] No tests to run.
  1160. [INFO]
  1161. [INFO] --- maven-jar-plugin:2.3.2:jar (default-jar) @ openmrs-liquibase ---
  1162. [WARNING] JAR will be empty - no content was marked for inclusion!
  1163. [INFO] Building jar: C:\Users\barba\IdeaProjects\openmrs-core\liquibase\target\openmrs-liquibase-2.4.
  1164. 0-SNAPSHOT.jar
  1165. [INFO]
  1166. [INFO] --- maven-jar-plugin:2.3.2:test-jar (default) @ openmrs-liquibase ---
  1167. [WARNING] JAR will be empty - no content was marked for inclusion!
  1168. [INFO] Building jar: C:\Users\barba\IdeaProjects\openmrs-core\liquibase\target\openmrs-liquibase-2.4.
  1169. 0-SNAPSHOT-tests.jar
  1170. [INFO]
  1171. [INFO] --- license-maven-plugin:3.0:check (default) @ openmrs-liquibase ---
  1172. [INFO] Checking licenses...
  1173. [INFO]
  1174. [INFO] --- maven-install-plugin:2.4:install (default-install) @ openmrs-liquibase ---
  1175. [INFO] Installing C:\Users\barba\IdeaProjects\openmrs-core\liquibase\target\openmrs-liquibase-2.4.0-S
  1176. NAPSHOT.jar to C:\Users\barba\.m2\repository\org\openmrs\liquibase\openmrs-liquibase\2.4.0-SNAPSHOT\o
  1177. penmrs-liquibase-2.4.0-SNAPSHOT.jar
  1178. [INFO] Installing C:\Users\barba\IdeaProjects\openmrs-core\liquibase\pom.xml to C:\Users\barba\.m2\re
  1179. pository\org\openmrs\liquibase\openmrs-liquibase\2.4.0-SNAPSHOT\openmrs-liquibase-2.4.0-SNAPSHOT.pom
  1180. [INFO] Installing C:\Users\barba\IdeaProjects\openmrs-core\liquibase\target\openmrs-liquibase-2.4.0-S
  1181. NAPSHOT-tests.jar to C:\Users\barba\.m2\repository\org\openmrs\liquibase\openmrs-liquibase\2.4.0-SNAP
  1182. SHOT\openmrs-liquibase-2.4.0-SNAPSHOT-tests.jar
  1183. [INFO]
  1184. [INFO] ------------------------< org.openmrs:openmrs >-------------------------
  1185. [INFO] Building OpenMRS 2.4.0-SNAPSHOT [8/7]
  1186. [INFO] --------------------------------[ pom ]---------------------------------
  1187. [WARNING] The POM for org.eclipse.m2e:lifecycle-mapping:jar:1.0.0 is missing, no dependency informati
  1188. on available
  1189. [WARNING] Failed to retrieve plugin descriptor for org.eclipse.m2e:lifecycle-mapping:1.0.0: Plugin or
  1190. g.eclipse.m2e:lifecycle-mapping:1.0.0 or one of its dependencies could not be resolved: Failure to fi
  1191. nd org.eclipse.m2e:lifecycle-mapping:jar:1.0.0 in http://mavenrepo.openmrs.org/nexus/content/reposito
  1192. ries/public was cached in the local repository, resolution will not be reattempted until the update i
  1193. nterval of openmrs-repo has elapsed or updates are forced
  1194. [INFO]
  1195. [INFO] --- openmrs-sdk-maven-plugin:3.13.6:run (default-cli) @ openmrs ---
  1196.  
  1197. Checking if port 8080 is in use... [free]
  1198.  
  1199. Forking a new process... (use -Dfork=false to prevent forking)
  1200.  
  1201. OpenJDK 64-Bit Server VM warning: Ignoring option MaxPermSize; support was removed in 8.0
  1202. Apache Maven 3.6.3 (cecedd343002696d0abb50b32b541b8a6ba2883f)
  1203. Maven home: C:\Program Files\apache-maven-3.6.3\bin\..
  1204. Java version: 13.0.1, vendor: AdoptOpenJDK, runtime: C:\Program Files\AdoptOpenJDK\jdk-13.0.1.9-hotsp
  1205. ot
  1206. Default locale: pl_PL, platform encoding: Cp1250
  1207. OS name: "windows 10", version: "10.0", arch: "amd64", family: "windows"
  1208. [INFO] Scanning for projects...
  1209. [INFO] ------------------------------------------------------------------------
  1210. [INFO] Reactor Build Order:
  1211. [INFO]
  1212. [INFO] OpenMRS [pom]
  1213. [INFO] openmrs-tools [jar]
  1214. [INFO] openmrs-test [pom]
  1215. [INFO] openmrs-api [jar]
  1216. [INFO] openmrs-web [jar]
  1217. [INFO] openmrs-webapp [war]
  1218. [INFO] openmrs-liquibase [jar]
  1219. [INFO]
  1220. [INFO] ------------------------< org.openmrs:openmrs >-------------------------
  1221. [INFO] Building OpenMRS 2.4.0-SNAPSHOT [1/7]
  1222. [INFO] --------------------------------[ pom ]---------------------------------
  1223. [INFO]
  1224. [INFO] --- openmrs-sdk-maven-plugin:3.13.6:run-tomcat (default-cli) @ openmrs ---
  1225.  
  1226.  
  1227. Using JAVA_HOME: C:\Program Files\AdoptOpenJDK\jdk-13.0.1.9-hotspot
  1228.  
  1229. Using MAVEN_OPTS: -Xmx768m -XX:MaxPermSize=512m
  1230.  
  1231. Starting Tomcat...
  1232.  
  1233. cze 22, 2020 7:37:07 AM org.apache.coyote.AbstractProtocol init
  1234. INFO: Initializing ProtocolHandler ["http-bio-8080"]
  1235. cze 22, 2020 7:37:07 AM org.apache.catalina.core.StandardService startInternal
  1236. INFO: Starting service [Tomcat]
  1237. cze 22, 2020 7:37:07 AM org.apache.catalina.core.StandardEngine startInternal
  1238. INFO: Starting Servlet Engine: Apache Tomcat/7.0.100
  1239. WARNING: An illegal reflective access operation has occurred
  1240. WARNING: Illegal reflective access by org.apache.catalina.loader.WebappClassLoaderBase$1 (file:/C:/Us
  1241. ers/barba/.m2/repository/org/apache/tomcat/embed/tomcat-embed-core/7.0.100/tomcat-embed-core-7.0.100.
  1242. jar) to method java.lang.ClassLoader.registerAsParallelCapable()
  1243. WARNING: Please consider reporting this to the maintainers of org.apache.catalina.loader.WebappClassL
  1244. oaderBase$1
  1245. WARNING: Use --illegal-access=warn to enable warnings of further illegal reflective access operations
  1246.  
  1247. WARNING: All illegal access operations will be denied in a future release
  1248. cze 22, 2020 7:37:08 AM org.apache.catalina.startup.TldConfig execute
  1249. INFO: At least one JAR was scanned for TLDs yet contained no TLDs. Enable debug logging for this logg
  1250. er for a complete list of JARs that were scanned but no TLDs were found in them. Skipping unneeded JA
  1251. Rs during scanning can improve startup time and JSP compilation time.
  1252. cze 22, 2020 7:37:08 AM org.apache.catalina.util.SessionIdGeneratorBase createSecureRandom
  1253. WARNING: Creation of SecureRandom instance for session ID generation using [SHA1PRNG] took [213] mill
  1254. iseconds.
  1255. cze 22, 2020 7:37:09 AM org.apache.catalina.startup.ContextConfig getDefaultWebXmlFragment
  1256. INFO: No global web.xml found
  1257. cze 22, 2020 7:37:09 AM org.apache.catalina.deploy.WebXml setVersion
  1258. WARNING: Unknown version string [4.0]. Default version will be used.
  1259. cze 22, 2020 7:37:12 AM org.apache.catalina.startup.TaglibUriRule body
  1260. INFO: TLD skipped. URI: http://java.sun.com/jstl/core_rt is already defined
  1261. cze 22, 2020 7:37:12 AM org.apache.catalina.startup.TaglibUriRule body
  1262. INFO: TLD skipped. URI: http://java.sun.com/jstl/core is already defined
  1263. cze 22, 2020 7:37:12 AM org.apache.catalina.startup.TaglibUriRule body
  1264. INFO: TLD skipped. URI: http://java.sun.com/jsp/jstl/core is already defined
  1265. cze 22, 2020 7:37:12 AM org.apache.catalina.startup.TaglibUriRule body
  1266. INFO: TLD skipped. URI: http://java.sun.com/jstl/fmt_rt is already defined
  1267. cze 22, 2020 7:37:12 AM org.apache.catalina.startup.TaglibUriRule body
  1268. INFO: TLD skipped. URI: http://java.sun.com/jstl/fmt is already defined
  1269. cze 22, 2020 7:37:12 AM org.apache.catalina.startup.TaglibUriRule body
  1270. INFO: TLD skipped. URI: http://java.sun.com/jsp/jstl/fmt is already defined
  1271. cze 22, 2020 7:37:12 AM org.apache.catalina.startup.TaglibUriRule body
  1272. INFO: TLD skipped. URI: http://java.sun.com/jsp/jstl/functions is already defined
  1273. cze 22, 2020 7:37:12 AM org.apache.catalina.startup.TaglibUriRule body
  1274. INFO: TLD skipped. URI: http://jakarta.apache.org/taglibs/standard/permittedTaglibs is already define
  1275. d
  1276. cze 22, 2020 7:37:12 AM org.apache.catalina.startup.TaglibUriRule body
  1277. INFO: TLD skipped. URI: http://jakarta.apache.org/taglibs/standard/scriptfree is already defined
  1278. cze 22, 2020 7:37:12 AM org.apache.catalina.startup.TaglibUriRule body
  1279. INFO: TLD skipped. URI: http://java.sun.com/jstl/sql_rt is already defined
  1280. cze 22, 2020 7:37:12 AM org.apache.catalina.startup.TaglibUriRule body
  1281. INFO: TLD skipped. URI: http://java.sun.com/jstl/sql is already defined
  1282. cze 22, 2020 7:37:12 AM org.apache.catalina.startup.TaglibUriRule body
  1283. INFO: TLD skipped. URI: http://java.sun.com/jsp/jstl/sql is already defined
  1284. cze 22, 2020 7:37:12 AM org.apache.catalina.startup.TaglibUriRule body
  1285. INFO: TLD skipped. URI: http://java.sun.com/jstl/xml_rt is already defined
  1286. cze 22, 2020 7:37:12 AM org.apache.catalina.startup.TaglibUriRule body
  1287. INFO: TLD skipped. URI: http://java.sun.com/jstl/xml is already defined
  1288. cze 22, 2020 7:37:12 AM org.apache.catalina.startup.TaglibUriRule body
  1289. INFO: TLD skipped. URI: http://java.sun.com/jsp/jstl/xml is already defined
  1290. cze 22, 2020 7:37:12 AM org.apache.catalina.startup.TldConfig execute
  1291. INFO: At least one JAR was scanned for TLDs yet contained no TLDs. Enable debug logging for this logg
  1292. er for a complete list of JARs that were scanned but no TLDs were found in them. Skipping unneeded JA
  1293. Rs during scanning can improve startup time and JSP compilation time.
  1294. SLF4J: Class path contains multiple SLF4J bindings.
  1295. SLF4J: Found binding in [jar:file:/C:/Users/barba/openmrs/openMRS_server/tmp/openmrs/WEB-INF/lib/log4
  1296. j-slf4j-impl-2.13.3.jar!/org/slf4j/impl/StaticLoggerBinder.class]
  1297. SLF4J: Found binding in [jar:file:/C:/Users/barba/.m2/repository/org/slf4j/slf4j-simple/1.6.2/slf4j-s
  1298. imple-1.6.2.jar!/org/slf4j/impl/StaticLoggerBinder.class]
  1299. SLF4J: See http://www.slf4j.org/codes.html#multiple_bindings for an explanation.
  1300. SLF4J: Actual binding is of type [org.apache.logging.slf4j.Log4jLoggerFactory]
  1301. WARN - OpenmrsUtil.getRuntimePropertiesFilePathName(2122) |2020-06-22T07:37:13,972| Unable to find a
  1302. runtime properties file at C:\Users\barba\IdeaProjects\openmrs-core\openmrs-runtime.properties
  1303. WARN - OpenmrsUtil.getRuntimePropertiesFilePathName(2150) |2020-06-22T07:37:13,996| Unable to find pr
  1304. operties file: C:\Users\barba\openmrs\openMRS_server\openmrs-runtime.properties
  1305. WARN - OpenmrsUtil.getRuntimeProperties(2083) |2020-06-22T07:37:13,996| Unable to find a runtime prop
  1306. erties file. Initial setup is needed. View the webapp to run the setup wizard.
  1307. WARN - OpenmrsUtil.getRuntimePropertiesFilePathName(2122) |2020-06-22T07:37:14,274| Unable to find a
  1308. runtime properties file at C:\Users\barba\IdeaProjects\openmrs-core\openmrs-runtime.properties
  1309. WARN - OpenmrsUtil.getRuntimePropertiesFilePathName(2150) |2020-06-22T07:37:14,274| Unable to find pr
  1310. operties file: C:\Users\barba\openmrs\openMRS_server\openmrs-runtime.properties
  1311. WARN - OpenmrsUtil.getRuntimeProperties(2083) |2020-06-22T07:37:14,274| Unable to find a runtime prop
  1312. erties file. Initial setup is needed. View the webapp to run the setup wizard.
  1313.  
  1314. OpenMRS is ready for you at http://localhost:8080/openmrs/
  1315. cze 22, 2020 7:37:14 AM org.apache.coyote.AbstractProtocol start
  1316. INFO: Starting ProtocolHandler ["http-bio-8080"]
  1317. WARN - OpenmrsUtil.getRuntimePropertiesFilePathName(2122) |2020-06-22T07:39:50,781| Unable to find a
  1318. runtime properties file at C:\Users\barba\IdeaProjects\openmrs-core\openmrs-runtime.properties
  1319. WARN - OpenmrsUtil.getRuntimePropertiesFilePathName(2150) |2020-06-22T07:39:50,782| Unable to find pr
  1320. operties file: C:\Users\barba\openmrs\openMRS_server\openmrs-runtime.properties
  1321. Loading class `com.mysql.jdbc.Driver'. This is deprecated. The new driver class is `com.mysql.cj.jdbc
  1322. .Driver'. The driver is automatically registered via the SPI and manual loading of the driver class i
  1323. s generally unnecessary.
  1324. WARN - InitializationFilter.verifyConnection(1006) |2020-06-22T07:40:07,146| Error while checking the
  1325. connection user account
  1326. java.sql.SQLNonTransientConnectionException: Could not create connection to database server. Attempte
  1327. d reconnect 3 times. Giving up.
  1328. at com.mysql.cj.jdbc.exceptions.SQLError.createSQLException(SQLError.java:110) ~[mysql-connec
  1329. tor-java-8.0.20.jar:8.0.20]
  1330. at com.mysql.cj.jdbc.exceptions.SQLError.createSQLException(SQLError.java:97) ~[mysql-connect
  1331. or-java-8.0.20.jar:8.0.20]
  1332. at com.mysql.cj.jdbc.exceptions.SQLError.createSQLException(SQLError.java:89) ~[mysql-connect
  1333. or-java-8.0.20.jar:8.0.20]
  1334. at com.mysql.cj.jdbc.exceptions.SQLError.createSQLException(SQLError.java:63) ~[mysql-connect
  1335. or-java-8.0.20.jar:8.0.20]
  1336. at com.mysql.cj.jdbc.exceptions.SQLError.createSQLException(SQLError.java:73) ~[mysql-connect
  1337. or-java-8.0.20.jar:8.0.20]
  1338. at com.mysql.cj.jdbc.ConnectionImpl.connectWithRetries(ConnectionImpl.java:906) ~[mysql-conne
  1339. ctor-java-8.0.20.jar:8.0.20]
  1340. at com.mysql.cj.jdbc.ConnectionImpl.createNewIO(ConnectionImpl.java:831) ~[mysql-connector-ja
  1341. va-8.0.20.jar:8.0.20]
  1342. at com.mysql.cj.jdbc.ConnectionImpl.<init>(ConnectionImpl.java:456) ~[mysql-connector-java-8.
  1343. 0.20.jar:8.0.20]
  1344. at com.mysql.cj.jdbc.ConnectionImpl.getInstance(ConnectionImpl.java:246) ~[mysql-connector-ja
  1345. va-8.0.20.jar:8.0.20]
  1346. at com.mysql.cj.jdbc.NonRegisteringDriver.connect(NonRegisteringDriver.java:197) ~[mysql-conn
  1347. ector-java-8.0.20.jar:8.0.20]
  1348. at java.sql.DriverManager.getConnection(DriverManager.java:677) ~[java.sql:?]
  1349. at java.sql.DriverManager.getConnection(DriverManager.java:228) ~[java.sql:?]
  1350. at org.openmrs.web.filter.initialization.InitializationFilter.verifyConnection(Initialization
  1351. Filter.java:996) [openmrs-web-2.4.0-SNAPSHOT.jar:?]
  1352. at org.openmrs.web.filter.initialization.InitializationFilter.access$400(InitializationFilter
  1353. .java:85) [openmrs-web-2.4.0-SNAPSHOT.jar:?]
  1354. at org.openmrs.web.filter.initialization.InitializationFilter$InitializationCompletion$1.run(
  1355. InitializationFilter.java:1516) [openmrs-web-2.4.0-SNAPSHOT.jar:?]
  1356. at java.lang.Thread.run(Thread.java:830) [?:?]
  1357. Caused by: com.mysql.cj.exceptions.CJCommunicationsException: Communications link failure
  1358.  
  1359. The last packet sent successfully to the server was 0 milliseconds ago. The driver has not received a
  1360. ny packets from the server.
  1361. at jdk.internal.reflect.NativeConstructorAccessorImpl.newInstance0(Native Method) ~[?:?]
  1362. at jdk.internal.reflect.NativeConstructorAccessorImpl.newInstance(NativeConstructorAccessorIm
  1363. pl.java:62) ~[?:?]
  1364. at jdk.internal.reflect.DelegatingConstructorAccessorImpl.newInstance(DelegatingConstructorAc
  1365. cessorImpl.java:45) ~[?:?]
  1366. at java.lang.reflect.Constructor.newInstanceWithCaller(Constructor.java:500) ~[?:?]
  1367. at java.lang.reflect.Constructor.newInstance(Constructor.java:481) ~[?:?]
  1368. at com.mysql.cj.exceptions.ExceptionFactory.createException(ExceptionFactory.java:61) ~[mysql
  1369. -connector-java-8.0.20.jar:8.0.20]
  1370. at com.mysql.cj.exceptions.ExceptionFactory.createException(ExceptionFactory.java:105) ~[mysq
  1371. l-connector-java-8.0.20.jar:8.0.20]
  1372. at com.mysql.cj.exceptions.ExceptionFactory.createException(ExceptionFactory.java:151) ~[mysq
  1373. l-connector-java-8.0.20.jar:8.0.20]
  1374. at com.mysql.cj.exceptions.ExceptionFactory.createCommunicationsException(ExceptionFactory.ja
  1375. va:167) ~[mysql-connector-java-8.0.20.jar:8.0.20]
  1376. at com.mysql.cj.protocol.a.NativeSocketConnection.connect(NativeSocketConnection.java:91) ~[m
  1377. ysql-connector-java-8.0.20.jar:8.0.20]
  1378. at com.mysql.cj.NativeSession.connect(NativeSession.java:144) ~[mysql-connector-java-8.0.20.j
  1379. ar:8.0.20]
  1380. at com.mysql.cj.jdbc.ConnectionImpl.connectWithRetries(ConnectionImpl.java:850) ~[mysql-conne
  1381. ctor-java-8.0.20.jar:8.0.20]
  1382. ... 10 more
  1383. Caused by: java.net.ConnectException: Connection refused: connect
  1384. at sun.nio.ch.Net.connect0(Native Method) ~[?:?]
  1385. at sun.nio.ch.Net.connect(Net.java:493) ~[?:?]
  1386. at sun.nio.ch.Net.connect(Net.java:482) ~[?:?]
  1387. at sun.nio.ch.NioSocketImpl.connect(NioSocketImpl.java:588) ~[?:?]
  1388. at java.net.SocksSocketImpl.connect(SocksSocketImpl.java:339) ~[?:?]
  1389. at java.net.Socket.connect(Socket.java:603) ~[?:?]
  1390. at com.mysql.cj.protocol.StandardSocketFactory.connect(StandardSocketFactory.java:155) ~[mysq
  1391. l-connector-java-8.0.20.jar:8.0.20]
  1392. at com.mysql.cj.protocol.a.NativeSocketConnection.connect(NativeSocketConnection.java:65) ~[m
  1393. ysql-connector-java-8.0.20.jar:8.0.20]
  1394. at com.mysql.cj.NativeSession.connect(NativeSession.java:144) ~[mysql-connector-java-8.0.20.j
  1395. ar:8.0.20]
  1396. at com.mysql.cj.jdbc.ConnectionImpl.connectWithRetries(ConnectionImpl.java:850) ~[mysql-conne
  1397. ctor-java-8.0.20.jar:8.0.20]
  1398. ... 10 more
  1399. WARN - OpenmrsUtil.getRuntimePropertiesFilePathName(2122) |2020-06-22T07:40:07,490| Unable to find a
  1400. runtime properties file at C:\Users\barba\IdeaProjects\openmrs-core\openmrs-runtime.properties
  1401. WARN - OpenmrsUtil.getRuntimePropertiesFilePathName(2150) |2020-06-22T07:40:07,491| Unable to find pr
  1402. operties file: C:\Users\barba\openmrs\openMRS_server\openmrs-runtime.properties
  1403. WARN - InitializationFilter.verifyConnection(1006) |2020-06-22T07:40:23,514| Error while checking the
  1404. connection user account
  1405. java.sql.SQLNonTransientConnectionException: Could not create connection to database server. Attempte
  1406. d reconnect 3 times. Giving up.
  1407. at com.mysql.cj.jdbc.exceptions.SQLError.createSQLException(SQLError.java:110) ~[mysql-connec
  1408. tor-java-8.0.20.jar:8.0.20]
  1409. at com.mysql.cj.jdbc.exceptions.SQLError.createSQLException(SQLError.java:97) ~[mysql-connect
  1410. or-java-8.0.20.jar:8.0.20]
  1411. at com.mysql.cj.jdbc.exceptions.SQLError.createSQLException(SQLError.java:89) ~[mysql-connect
  1412. or-java-8.0.20.jar:8.0.20]
  1413. at com.mysql.cj.jdbc.exceptions.SQLError.createSQLException(SQLError.java:63) ~[mysql-connect
  1414. or-java-8.0.20.jar:8.0.20]
  1415. at com.mysql.cj.jdbc.exceptions.SQLError.createSQLException(SQLError.java:73) ~[mysql-connect
  1416. or-java-8.0.20.jar:8.0.20]
  1417. at com.mysql.cj.jdbc.ConnectionImpl.connectWithRetries(ConnectionImpl.java:906) ~[mysql-conne
  1418. ctor-java-8.0.20.jar:8.0.20]
  1419. at com.mysql.cj.jdbc.ConnectionImpl.createNewIO(ConnectionImpl.java:831) ~[mysql-connector-ja
  1420. va-8.0.20.jar:8.0.20]
  1421. at com.mysql.cj.jdbc.ConnectionImpl.<init>(ConnectionImpl.java:456) ~[mysql-connector-java-8.
  1422. 0.20.jar:8.0.20]
  1423. at com.mysql.cj.jdbc.ConnectionImpl.getInstance(ConnectionImpl.java:246) ~[mysql-connector-ja
  1424. va-8.0.20.jar:8.0.20]
  1425. at com.mysql.cj.jdbc.NonRegisteringDriver.connect(NonRegisteringDriver.java:197) ~[mysql-conn
  1426. ector-java-8.0.20.jar:8.0.20]
  1427. at java.sql.DriverManager.getConnection(DriverManager.java:677) ~[java.sql:?]
  1428. at java.sql.DriverManager.getConnection(DriverManager.java:228) ~[java.sql:?]
  1429. at org.openmrs.web.filter.initialization.InitializationFilter.verifyConnection(Initialization
  1430. Filter.java:996) [openmrs-web-2.4.0-SNAPSHOT.jar:?]
  1431. at org.openmrs.web.filter.initialization.InitializationFilter.access$400(InitializationFilter
  1432. .java:85) [openmrs-web-2.4.0-SNAPSHOT.jar:?]
  1433. at org.openmrs.web.filter.initialization.InitializationFilter$InitializationCompletion$1.run(
  1434. InitializationFilter.java:1516) [openmrs-web-2.4.0-SNAPSHOT.jar:?]
  1435. at java.lang.Thread.run(Thread.java:830) [?:?]
  1436. Caused by: com.mysql.cj.exceptions.CJCommunicationsException: Communications link failure
  1437.  
  1438. The last packet sent successfully to the server was 0 milliseconds ago. The driver has not received a
  1439. ny packets from the server.
  1440. at jdk.internal.reflect.NativeConstructorAccessorImpl.newInstance0(Native Method) ~[?:?]
  1441. at jdk.internal.reflect.NativeConstructorAccessorImpl.newInstance(NativeConstructorAccessorIm
  1442. pl.java:62) ~[?:?]
  1443. at jdk.internal.reflect.DelegatingConstructorAccessorImpl.newInstance(DelegatingConstructorAc
  1444. cessorImpl.java:45) ~[?:?]
  1445. at java.lang.reflect.Constructor.newInstanceWithCaller(Constructor.java:500) ~[?:?]
  1446. at java.lang.reflect.Constructor.newInstance(Constructor.java:481) ~[?:?]
  1447. at com.mysql.cj.exceptions.ExceptionFactory.createException(ExceptionFactory.java:61) ~[mysql
  1448. -connector-java-8.0.20.jar:8.0.20]
  1449. at com.mysql.cj.exceptions.ExceptionFactory.createException(ExceptionFactory.java:105) ~[mysq
  1450. l-connector-java-8.0.20.jar:8.0.20]
  1451. at com.mysql.cj.exceptions.ExceptionFactory.createException(ExceptionFactory.java:151) ~[mysq
  1452. l-connector-java-8.0.20.jar:8.0.20]
  1453. at com.mysql.cj.exceptions.ExceptionFactory.createCommunicationsException(ExceptionFactory.ja
  1454. va:167) ~[mysql-connector-java-8.0.20.jar:8.0.20]
  1455. at com.mysql.cj.protocol.a.NativeSocketConnection.connect(NativeSocketConnection.java:91) ~[m
  1456. ysql-connector-java-8.0.20.jar:8.0.20]
  1457. at com.mysql.cj.NativeSession.connect(NativeSession.java:144) ~[mysql-connector-java-8.0.20.j
  1458. ar:8.0.20]
  1459. at com.mysql.cj.jdbc.ConnectionImpl.connectWithRetries(ConnectionImpl.java:850) ~[mysql-conne
  1460. ctor-java-8.0.20.jar:8.0.20]
  1461. ... 10 more
  1462. Caused by: java.net.ConnectException: Connection refused: connect
  1463. at sun.nio.ch.Net.connect0(Native Method) ~[?:?]
  1464. at sun.nio.ch.Net.connect(Net.java:493) ~[?:?]
  1465. at sun.nio.ch.Net.connect(Net.java:482) ~[?:?]
  1466. at sun.nio.ch.NioSocketImpl.connect(NioSocketImpl.java:588) ~[?:?]
  1467. at java.net.SocksSocketImpl.connect(SocksSocketImpl.java:339) ~[?:?]
  1468. at java.net.Socket.connect(Socket.java:603) ~[?:?]
  1469. at com.mysql.cj.protocol.StandardSocketFactory.connect(StandardSocketFactory.java:155) ~[mysq
  1470. l-connector-java-8.0.20.jar:8.0.20]
  1471. at com.mysql.cj.protocol.a.NativeSocketConnection.connect(NativeSocketConnection.java:65) ~[m
  1472. ysql-connector-java-8.0.20.jar:8.0.20]
  1473. at com.mysql.cj.NativeSession.connect(NativeSession.java:144) ~[mysql-connector-java-8.0.20.j
  1474. ar:8.0.20]
  1475. at com.mysql.cj.jdbc.ConnectionImpl.connectWithRetries(ConnectionImpl.java:850) ~[mysql-conne
  1476. ctor-java-8.0.20.jar:8.0.20]
  1477. ... 10 more
  1478. WARN - OpenmrsUtil.getRuntimePropertiesFilePathName(2122) |2020-06-22T07:40:23,690| Unable to find a
  1479. runtime properties file at C:\Users\barba\IdeaProjects\openmrs-core\openmrs-runtime.properties
  1480. WARN - OpenmrsUtil.getRuntimePropertiesFilePathName(2150) |2020-06-22T07:40:23,691| Unable to find pr
  1481. operties file: C:\Users\barba\openmrs\openMRS_server\openmrs-runtime.properties
  1482. WARN - InitializationFilter.verifyConnection(1006) |2020-06-22T07:40:39,723| Error while checking the
  1483. connection user account
  1484. java.sql.SQLNonTransientConnectionException: Could not create connection to database server. Attempte
  1485. d reconnect 3 times. Giving up.
  1486. at com.mysql.cj.jdbc.exceptions.SQLError.createSQLException(SQLError.java:110) ~[mysql-connec
  1487. tor-java-8.0.20.jar:8.0.20]
  1488. at com.mysql.cj.jdbc.exceptions.SQLError.createSQLException(SQLError.java:97) ~[mysql-connect
  1489. or-java-8.0.20.jar:8.0.20]
  1490. at com.mysql.cj.jdbc.exceptions.SQLError.createSQLException(SQLError.java:89) ~[mysql-connect
  1491. or-java-8.0.20.jar:8.0.20]
  1492. at com.mysql.cj.jdbc.exceptions.SQLError.createSQLException(SQLError.java:63) ~[mysql-connect
  1493. or-java-8.0.20.jar:8.0.20]
  1494. at com.mysql.cj.jdbc.exceptions.SQLError.createSQLException(SQLError.java:73) ~[mysql-connect
  1495. or-java-8.0.20.jar:8.0.20]
  1496. at com.mysql.cj.jdbc.ConnectionImpl.connectWithRetries(ConnectionImpl.java:906) ~[mysql-conne
  1497. ctor-java-8.0.20.jar:8.0.20]
  1498. at com.mysql.cj.jdbc.ConnectionImpl.createNewIO(ConnectionImpl.java:831) ~[mysql-connector-ja
  1499. va-8.0.20.jar:8.0.20]
  1500. at com.mysql.cj.jdbc.ConnectionImpl.<init>(ConnectionImpl.java:456) ~[mysql-connector-java-8.
  1501. 0.20.jar:8.0.20]
  1502. at com.mysql.cj.jdbc.ConnectionImpl.getInstance(ConnectionImpl.java:246) ~[mysql-connector-ja
  1503. va-8.0.20.jar:8.0.20]
  1504. at com.mysql.cj.jdbc.NonRegisteringDriver.connect(NonRegisteringDriver.java:197) ~[mysql-conn
  1505. ector-java-8.0.20.jar:8.0.20]
  1506. at java.sql.DriverManager.getConnection(DriverManager.java:677) ~[java.sql:?]
  1507. at java.sql.DriverManager.getConnection(DriverManager.java:228) ~[java.sql:?]
  1508. at org.openmrs.web.filter.initialization.InitializationFilter.verifyConnection(Initialization
  1509. Filter.java:996) [openmrs-web-2.4.0-SNAPSHOT.jar:?]
  1510. at org.openmrs.web.filter.initialization.InitializationFilter.access$400(InitializationFilter
  1511. .java:85) [openmrs-web-2.4.0-SNAPSHOT.jar:?]
  1512. at org.openmrs.web.filter.initialization.InitializationFilter$InitializationCompletion$1.run(
  1513. InitializationFilter.java:1516) [openmrs-web-2.4.0-SNAPSHOT.jar:?]
  1514. at java.lang.Thread.run(Thread.java:830) [?:?]
  1515. Caused by: com.mysql.cj.exceptions.CJCommunicationsException: Communications link failure
  1516.  
  1517. The last packet sent successfully to the server was 0 milliseconds ago. The driver has not received a
  1518. ny packets from the server.
  1519. at jdk.internal.reflect.NativeConstructorAccessorImpl.newInstance0(Native Method) ~[?:?]
  1520. at jdk.internal.reflect.NativeConstructorAccessorImpl.newInstance(NativeConstructorAccessorIm
  1521. pl.java:62) ~[?:?]
  1522. at jdk.internal.reflect.DelegatingConstructorAccessorImpl.newInstance(DelegatingConstructorAc
  1523. cessorImpl.java:45) ~[?:?]
  1524. at java.lang.reflect.Constructor.newInstanceWithCaller(Constructor.java:500) ~[?:?]
  1525. at java.lang.reflect.Constructor.newInstance(Constructor.java:481) ~[?:?]
  1526. at com.mysql.cj.exceptions.ExceptionFactory.createException(ExceptionFactory.java:61) ~[mysql
  1527. -connector-java-8.0.20.jar:8.0.20]
  1528. at com.mysql.cj.exceptions.ExceptionFactory.createException(ExceptionFactory.java:105) ~[mysq
  1529. l-connector-java-8.0.20.jar:8.0.20]
  1530. at com.mysql.cj.exceptions.ExceptionFactory.createException(ExceptionFactory.java:151) ~[mysq
  1531. l-connector-java-8.0.20.jar:8.0.20]
  1532. at com.mysql.cj.exceptions.ExceptionFactory.createCommunicationsException(ExceptionFactory.ja
  1533. va:167) ~[mysql-connector-java-8.0.20.jar:8.0.20]
  1534. at com.mysql.cj.protocol.a.NativeSocketConnection.connect(NativeSocketConnection.java:91) ~[m
  1535. ysql-connector-java-8.0.20.jar:8.0.20]
  1536. at com.mysql.cj.NativeSession.connect(NativeSession.java:144) ~[mysql-connector-java-8.0.20.j
  1537. ar:8.0.20]
  1538. at com.mysql.cj.jdbc.ConnectionImpl.connectWithRetries(ConnectionImpl.java:850) ~[mysql-conne
  1539. ctor-java-8.0.20.jar:8.0.20]
  1540. ... 10 more
  1541. Caused by: java.net.ConnectException: Connection refused: connect
  1542. at sun.nio.ch.Net.connect0(Native Method) ~[?:?]
  1543. at sun.nio.ch.Net.connect(Net.java:493) ~[?:?]
  1544. at sun.nio.ch.Net.connect(Net.java:482) ~[?:?]
  1545. at sun.nio.ch.NioSocketImpl.connect(NioSocketImpl.java:588) ~[?:?]
  1546. at java.net.SocksSocketImpl.connect(SocksSocketImpl.java:339) ~[?:?]
  1547. at java.net.Socket.connect(Socket.java:603) ~[?:?]
  1548. at com.mysql.cj.protocol.StandardSocketFactory.connect(StandardSocketFactory.java:155) ~[mysq
  1549. l-connector-java-8.0.20.jar:8.0.20]
  1550. at com.mysql.cj.protocol.a.NativeSocketConnection.connect(NativeSocketConnection.java:65) ~[m
  1551. ysql-connector-java-8.0.20.jar:8.0.20]
  1552. at com.mysql.cj.NativeSession.connect(NativeSession.java:144) ~[mysql-connector-java-8.0.20.j
  1553. ar:8.0.20]
  1554. at com.mysql.cj.jdbc.ConnectionImpl.connectWithRetries(ConnectionImpl.java:850) ~[mysql-conne
  1555. ctor-java-8.0.20.jar:8.0.20]
  1556. ... 10 more
  1557. WARN - OpenmrsUtil.getRuntimePropertiesFilePathName(2122) |2020-06-22T07:40:39,886| Unable to find a
  1558. runtime properties file at C:\Users\barba\IdeaProjects\openmrs-core\openmrs-runtime.properties
  1559. WARN - OpenmrsUtil.getRuntimePropertiesFilePathName(2150) |2020-06-22T07:40:39,887| Unable to find pr
  1560. operties file: C:\Users\barba\openmrs\openMRS_server\openmrs-runtime.properties
  1561. WARN - InitializationFilter.verifyConnection(1006) |2020-06-22T07:40:55,908| Error while checking the
  1562. connection user account
  1563. java.sql.SQLNonTransientConnectionException: Could not create connection to database server. Attempte
  1564. d reconnect 3 times. Giving up.
  1565. at com.mysql.cj.jdbc.exceptions.SQLError.createSQLException(SQLError.java:110) ~[mysql-connec
  1566. tor-java-8.0.20.jar:8.0.20]
  1567. at com.mysql.cj.jdbc.exceptions.SQLError.createSQLException(SQLError.java:97) ~[mysql-connect
  1568. or-java-8.0.20.jar:8.0.20]
  1569. at com.mysql.cj.jdbc.exceptions.SQLError.createSQLException(SQLError.java:89) ~[mysql-connect
  1570. or-java-8.0.20.jar:8.0.20]
  1571. at com.mysql.cj.jdbc.exceptions.SQLError.createSQLException(SQLError.java:63) ~[mysql-connect
  1572. or-java-8.0.20.jar:8.0.20]
  1573. at com.mysql.cj.jdbc.exceptions.SQLError.createSQLException(SQLError.java:73) ~[mysql-connect
  1574. or-java-8.0.20.jar:8.0.20]
  1575. at com.mysql.cj.jdbc.ConnectionImpl.connectWithRetries(ConnectionImpl.java:906) ~[mysql-conne
  1576. ctor-java-8.0.20.jar:8.0.20]
  1577. at com.mysql.cj.jdbc.ConnectionImpl.createNewIO(ConnectionImpl.java:831) ~[mysql-connector-ja
  1578. va-8.0.20.jar:8.0.20]
  1579. at com.mysql.cj.jdbc.ConnectionImpl.<init>(ConnectionImpl.java:456) ~[mysql-connector-java-8.
  1580. 0.20.jar:8.0.20]
  1581. at com.mysql.cj.jdbc.ConnectionImpl.getInstance(ConnectionImpl.java:246) ~[mysql-connector-ja
  1582. va-8.0.20.jar:8.0.20]
  1583. at com.mysql.cj.jdbc.NonRegisteringDriver.connect(NonRegisteringDriver.java:197) ~[mysql-conn
  1584. ector-java-8.0.20.jar:8.0.20]
  1585. at java.sql.DriverManager.getConnection(DriverManager.java:677) ~[java.sql:?]
  1586. at java.sql.DriverManager.getConnection(DriverManager.java:228) ~[java.sql:?]
  1587. at org.openmrs.web.filter.initialization.InitializationFilter.verifyConnection(Initialization
  1588. Filter.java:996) [openmrs-web-2.4.0-SNAPSHOT.jar:?]
  1589. at org.openmrs.web.filter.initialization.InitializationFilter.access$400(InitializationFilter
  1590. .java:85) [openmrs-web-2.4.0-SNAPSHOT.jar:?]
  1591. at org.openmrs.web.filter.initialization.InitializationFilter$InitializationCompletion$1.run(
  1592. InitializationFilter.java:1516) [openmrs-web-2.4.0-SNAPSHOT.jar:?]
  1593. at java.lang.Thread.run(Thread.java:830) [?:?]
  1594. Caused by: com.mysql.cj.exceptions.CJCommunicationsException: Communications link failure
  1595.  
  1596. The last packet sent successfully to the server was 0 milliseconds ago. The driver has not received a
  1597. ny packets from the server.
  1598. at jdk.internal.reflect.NativeConstructorAccessorImpl.newInstance0(Native Method) ~[?:?]
  1599. at jdk.internal.reflect.NativeConstructorAccessorImpl.newInstance(NativeConstructorAccessorIm
  1600. pl.java:62) ~[?:?]
  1601. at jdk.internal.reflect.DelegatingConstructorAccessorImpl.newInstance(DelegatingConstructorAc
  1602. cessorImpl.java:45) ~[?:?]
  1603. at java.lang.reflect.Constructor.newInstanceWithCaller(Constructor.java:500) ~[?:?]
  1604. at java.lang.reflect.Constructor.newInstance(Constructor.java:481) ~[?:?]
  1605. at com.mysql.cj.exceptions.ExceptionFactory.createException(ExceptionFactory.java:61) ~[mysql
  1606. -connector-java-8.0.20.jar:8.0.20]
  1607. at com.mysql.cj.exceptions.ExceptionFactory.createException(ExceptionFactory.java:105) ~[mysq
  1608. l-connector-java-8.0.20.jar:8.0.20]
  1609. at com.mysql.cj.exceptions.ExceptionFactory.createException(ExceptionFactory.java:151) ~[mysq
  1610. l-connector-java-8.0.20.jar:8.0.20]
  1611. at com.mysql.cj.exceptions.ExceptionFactory.createCommunicationsException(ExceptionFactory.ja
  1612. va:167) ~[mysql-connector-java-8.0.20.jar:8.0.20]
  1613. at com.mysql.cj.protocol.a.NativeSocketConnection.connect(NativeSocketConnection.java:91) ~[m
  1614. ysql-connector-java-8.0.20.jar:8.0.20]
  1615. at com.mysql.cj.NativeSession.connect(NativeSession.java:144) ~[mysql-connector-java-8.0.20.j
  1616. ar:8.0.20]
  1617. at com.mysql.cj.jdbc.ConnectionImpl.connectWithRetries(ConnectionImpl.java:850) ~[mysql-conne
  1618. ctor-java-8.0.20.jar:8.0.20]
  1619. ... 10 more
  1620. Caused by: java.net.ConnectException: Connection refused: connect
  1621. at sun.nio.ch.Net.connect0(Native Method) ~[?:?]
  1622. at sun.nio.ch.Net.connect(Net.java:493) ~[?:?]
  1623. at sun.nio.ch.Net.connect(Net.java:482) ~[?:?]
  1624. at sun.nio.ch.NioSocketImpl.connect(NioSocketImpl.java:588) ~[?:?]
  1625. at java.net.SocksSocketImpl.connect(SocksSocketImpl.java:339) ~[?:?]
  1626. at java.net.Socket.connect(Socket.java:603) ~[?:?]
  1627. at com.mysql.cj.protocol.StandardSocketFactory.connect(StandardSocketFactory.java:155) ~[mysq
  1628. l-connector-java-8.0.20.jar:8.0.20]
  1629. at com.mysql.cj.protocol.a.NativeSocketConnection.connect(NativeSocketConnection.java:65) ~[m
  1630. ysql-connector-java-8.0.20.jar:8.0.20]
  1631. at com.mysql.cj.NativeSession.connect(NativeSession.java:144) ~[mysql-connector-java-8.0.20.j
  1632. ar:8.0.20]
  1633. at com.mysql.cj.jdbc.ConnectionImpl.connectWithRetries(ConnectionImpl.java:850) ~[mysql-conne
  1634. ctor-java-8.0.20.jar:8.0.20]
  1635. ... 10 more
  1636. WARN - OpenmrsUtil.getRuntimePropertiesFilePathName(2122) |2020-06-22T07:40:56,083| Unable to find a
  1637. runtime properties file at C:\Users\barba\IdeaProjects\openmrs-core\openmrs-runtime.properties
  1638. WARN - OpenmrsUtil.getRuntimePropertiesFilePathName(2150) |2020-06-22T07:40:56,084| Unable to find pr
  1639. operties file: C:\Users\barba\openmrs\openMRS_server\openmrs-runtime.properties
  1640. WARN - InitializationFilter.verifyConnection(1006) |2020-06-22T07:41:12,109| Error while checking the
  1641. connection user account
  1642. java.sql.SQLNonTransientConnectionException: Could not create connection to database server. Attempte
  1643. d reconnect 3 times. Giving up.
  1644. at com.mysql.cj.jdbc.exceptions.SQLError.createSQLException(SQLError.java:110) ~[mysql-connec
  1645. tor-java-8.0.20.jar:8.0.20]
  1646. at com.mysql.cj.jdbc.exceptions.SQLError.createSQLException(SQLError.java:97) ~[mysql-connect
  1647. or-java-8.0.20.jar:8.0.20]
  1648. at com.mysql.cj.jdbc.exceptions.SQLError.createSQLException(SQLError.java:89) ~[mysql-connect
  1649. or-java-8.0.20.jar:8.0.20]
  1650. at com.mysql.cj.jdbc.exceptions.SQLError.createSQLException(SQLError.java:63) ~[mysql-connect
  1651. or-java-8.0.20.jar:8.0.20]
  1652. at com.mysql.cj.jdbc.exceptions.SQLError.createSQLException(SQLError.java:73) ~[mysql-connect
  1653. or-java-8.0.20.jar:8.0.20]
  1654. at com.mysql.cj.jdbc.ConnectionImpl.connectWithRetries(ConnectionImpl.java:906) ~[mysql-conne
  1655. ctor-java-8.0.20.jar:8.0.20]
  1656. at com.mysql.cj.jdbc.ConnectionImpl.createNewIO(ConnectionImpl.java:831) ~[mysql-connector-ja
  1657. va-8.0.20.jar:8.0.20]
  1658. at com.mysql.cj.jdbc.ConnectionImpl.<init>(ConnectionImpl.java:456) ~[mysql-connector-java-8.
  1659. 0.20.jar:8.0.20]
  1660. at com.mysql.cj.jdbc.ConnectionImpl.getInstance(ConnectionImpl.java:246) ~[mysql-connector-ja
  1661. va-8.0.20.jar:8.0.20]
  1662. at com.mysql.cj.jdbc.NonRegisteringDriver.connect(NonRegisteringDriver.java:197) ~[mysql-conn
  1663. ector-java-8.0.20.jar:8.0.20]
  1664. at java.sql.DriverManager.getConnection(DriverManager.java:677) ~[java.sql:?]
  1665. at java.sql.DriverManager.getConnection(DriverManager.java:228) ~[java.sql:?]
  1666. at org.openmrs.web.filter.initialization.InitializationFilter.verifyConnection(Initialization
  1667. Filter.java:996) [openmrs-web-2.4.0-SNAPSHOT.jar:?]
  1668. at org.openmrs.web.filter.initialization.InitializationFilter.access$400(InitializationFilter
  1669. .java:85) [openmrs-web-2.4.0-SNAPSHOT.jar:?]
  1670. at org.openmrs.web.filter.initialization.InitializationFilter$InitializationCompletion$1.run(
  1671. InitializationFilter.java:1516) [openmrs-web-2.4.0-SNAPSHOT.jar:?]
  1672. at java.lang.Thread.run(Thread.java:830) [?:?]
  1673. Caused by: com.mysql.cj.exceptions.CJCommunicationsException: Communications link failure
  1674.  
  1675. The last packet sent successfully to the server was 0 milliseconds ago. The driver has not received a
  1676. ny packets from the server.
  1677. at jdk.internal.reflect.NativeConstructorAccessorImpl.newInstance0(Native Method) ~[?:?]
  1678. at jdk.internal.reflect.NativeConstructorAccessorImpl.newInstance(NativeConstructorAccessorIm
  1679. pl.java:62) ~[?:?]
  1680. at jdk.internal.reflect.DelegatingConstructorAccessorImpl.newInstance(DelegatingConstructorAc
  1681. cessorImpl.java:45) ~[?:?]
  1682. at java.lang.reflect.Constructor.newInstanceWithCaller(Constructor.java:500) ~[?:?]
  1683. at java.lang.reflect.Constructor.newInstance(Constructor.java:481) ~[?:?]
  1684. at com.mysql.cj.exceptions.ExceptionFactory.createException(ExceptionFactory.java:61) ~[mysql
  1685. -connector-java-8.0.20.jar:8.0.20]
  1686. at com.mysql.cj.exceptions.ExceptionFactory.createException(ExceptionFactory.java:105) ~[mysq
  1687. l-connector-java-8.0.20.jar:8.0.20]
  1688. at com.mysql.cj.exceptions.ExceptionFactory.createException(ExceptionFactory.java:151) ~[mysq
  1689. l-connector-java-8.0.20.jar:8.0.20]
  1690. at com.mysql.cj.exceptions.ExceptionFactory.createCommunicationsException(ExceptionFactory.ja
  1691. va:167) ~[mysql-connector-java-8.0.20.jar:8.0.20]
  1692. at com.mysql.cj.protocol.a.NativeSocketConnection.connect(NativeSocketConnection.java:91) ~[m
  1693. ysql-connector-java-8.0.20.jar:8.0.20]
  1694. at com.mysql.cj.NativeSession.connect(NativeSession.java:144) ~[mysql-connector-java-8.0.20.j
  1695. ar:8.0.20]
  1696. at com.mysql.cj.jdbc.ConnectionImpl.connectWithRetries(ConnectionImpl.java:850) ~[mysql-conne
  1697. ctor-java-8.0.20.jar:8.0.20]
  1698. ... 10 more
  1699. Caused by: java.net.ConnectException: Connection refused: connect
  1700. at sun.nio.ch.Net.connect0(Native Method) ~[?:?]
  1701. at sun.nio.ch.Net.connect(Net.java:493) ~[?:?]
  1702. at sun.nio.ch.Net.connect(Net.java:482) ~[?:?]
  1703. at sun.nio.ch.NioSocketImpl.connect(NioSocketImpl.java:588) ~[?:?]
  1704. at java.net.SocksSocketImpl.connect(SocksSocketImpl.java:339) ~[?:?]
  1705. at java.net.Socket.connect(Socket.java:603) ~[?:?]
  1706. at com.mysql.cj.protocol.StandardSocketFactory.connect(StandardSocketFactory.java:155) ~[mysq
  1707. l-connector-java-8.0.20.jar:8.0.20]
  1708. at com.mysql.cj.protocol.a.NativeSocketConnection.connect(NativeSocketConnection.java:65) ~[m
  1709. ysql-connector-java-8.0.20.jar:8.0.20]
  1710. at com.mysql.cj.NativeSession.connect(NativeSession.java:144) ~[mysql-connector-java-8.0.20.j
  1711. ar:8.0.20]
  1712. at com.mysql.cj.jdbc.ConnectionImpl.connectWithRetries(ConnectionImpl.java:850) ~[mysql-conne
  1713. ctor-java-8.0.20.jar:8.0.20]
  1714. ... 10 more
  1715. WARN - OpenmrsUtil.getRuntimePropertiesFilePathName(2122) |2020-06-22T07:41:12,282| Unable to find a
  1716. runtime properties file at C:\Users\barba\IdeaProjects\openmrs-core\openmrs-runtime.properties
  1717. WARN - OpenmrsUtil.getRuntimePropertiesFilePathName(2150) |2020-06-22T07:41:12,283| Unable to find pr
  1718. operties file: C:\Users\barba\openmrs\openMRS_server\openmrs-runtime.properties
  1719. WARN - InitializationFilter.verifyConnection(1006) |2020-06-22T07:41:28,305| Error while checking the
  1720. connection user account
  1721. java.sql.SQLNonTransientConnectionException: Could not create connection to database server. Attempte
  1722. d reconnect 3 times. Giving up.
  1723. at com.mysql.cj.jdbc.exceptions.SQLError.createSQLException(SQLError.java:110) ~[mysql-connec
  1724. tor-java-8.0.20.jar:8.0.20]
  1725. at com.mysql.cj.jdbc.exceptions.SQLError.createSQLException(SQLError.java:97) ~[mysql-connect
  1726. or-java-8.0.20.jar:8.0.20]
  1727. at com.mysql.cj.jdbc.exceptions.SQLError.createSQLException(SQLError.java:89) ~[mysql-connect
  1728. or-java-8.0.20.jar:8.0.20]
  1729. at com.mysql.cj.jdbc.exceptions.SQLError.createSQLException(SQLError.java:63) ~[mysql-connect
  1730. or-java-8.0.20.jar:8.0.20]
  1731. at com.mysql.cj.jdbc.exceptions.SQLError.createSQLException(SQLError.java:73) ~[mysql-connect
  1732. or-java-8.0.20.jar:8.0.20]
  1733. at com.mysql.cj.jdbc.ConnectionImpl.connectWithRetries(ConnectionImpl.java:906) ~[mysql-conne
  1734. ctor-java-8.0.20.jar:8.0.20]
  1735. at com.mysql.cj.jdbc.ConnectionImpl.createNewIO(ConnectionImpl.java:831) ~[mysql-connector-ja
  1736. va-8.0.20.jar:8.0.20]
  1737. at com.mysql.cj.jdbc.ConnectionImpl.<init>(ConnectionImpl.java:456) ~[mysql-connector-java-8.
  1738. 0.20.jar:8.0.20]
  1739. at com.mysql.cj.jdbc.ConnectionImpl.getInstance(ConnectionImpl.java:246) ~[mysql-connector-ja
  1740. va-8.0.20.jar:8.0.20]
  1741. at com.mysql.cj.jdbc.NonRegisteringDriver.connect(NonRegisteringDriver.java:197) ~[mysql-conn
  1742. ector-java-8.0.20.jar:8.0.20]
  1743. at java.sql.DriverManager.getConnection(DriverManager.java:677) ~[java.sql:?]
  1744. at java.sql.DriverManager.getConnection(DriverManager.java:228) ~[java.sql:?]
  1745. at org.openmrs.web.filter.initialization.InitializationFilter.verifyConnection(Initialization
  1746. Filter.java:996) [openmrs-web-2.4.0-SNAPSHOT.jar:?]
  1747. at org.openmrs.web.filter.initialization.InitializationFilter.access$400(InitializationFilter
  1748. .java:85) [openmrs-web-2.4.0-SNAPSHOT.jar:?]
  1749. at org.openmrs.web.filter.initialization.InitializationFilter$InitializationCompletion$1.run(
  1750. InitializationFilter.java:1516) [openmrs-web-2.4.0-SNAPSHOT.jar:?]
  1751. at java.lang.Thread.run(Thread.java:830) [?:?]
  1752. Caused by: com.mysql.cj.exceptions.CJCommunicationsException: Communications link failure
  1753.  
  1754. The last packet sent successfully to the server was 0 milliseconds ago. The driver has not received a
  1755. ny packets from the server.
  1756. at jdk.internal.reflect.GeneratedConstructorAccessor41.newInstance(Unknown Source) ~[?:?]
  1757. at jdk.internal.reflect.DelegatingConstructorAccessorImpl.newInstance(DelegatingConstructorAc
  1758. cessorImpl.java:45) ~[?:?]
  1759. at java.lang.reflect.Constructor.newInstanceWithCaller(Constructor.java:500) ~[?:?]
  1760. at java.lang.reflect.Constructor.newInstance(Constructor.java:481) ~[?:?]
  1761. at com.mysql.cj.exceptions.ExceptionFactory.createException(ExceptionFactory.java:61) ~[mysql
  1762. -connector-java-8.0.20.jar:8.0.20]
  1763. at com.mysql.cj.exceptions.ExceptionFactory.createException(ExceptionFactory.java:105) ~[mysq
  1764. l-connector-java-8.0.20.jar:8.0.20]
  1765. at com.mysql.cj.exceptions.ExceptionFactory.createException(ExceptionFactory.java:151) ~[mysq
  1766. l-connector-java-8.0.20.jar:8.0.20]
  1767. at com.mysql.cj.exceptions.ExceptionFactory.createCommunicationsException(ExceptionFactory.ja
  1768. va:167) ~[mysql-connector-java-8.0.20.jar:8.0.20]
  1769. at com.mysql.cj.protocol.a.NativeSocketConnection.connect(NativeSocketConnection.java:91) ~[m
  1770. ysql-connector-java-8.0.20.jar:8.0.20]
  1771. at com.mysql.cj.NativeSession.connect(NativeSession.java:144) ~[mysql-connector-java-8.0.20.j
  1772. ar:8.0.20]
  1773. at com.mysql.cj.jdbc.ConnectionImpl.connectWithRetries(ConnectionImpl.java:850) ~[mysql-conne
  1774. ctor-java-8.0.20.jar:8.0.20]
  1775. ... 10 more
  1776. Caused by: java.net.ConnectException: Connection refused: connect
  1777. at sun.nio.ch.Net.connect0(Native Method) ~[?:?]
  1778. at sun.nio.ch.Net.connect(Net.java:493) ~[?:?]
  1779. at sun.nio.ch.Net.connect(Net.java:482) ~[?:?]
  1780. at sun.nio.ch.NioSocketImpl.connect(NioSocketImpl.java:588) ~[?:?]
  1781. at java.net.SocksSocketImpl.connect(SocksSocketImpl.java:339) ~[?:?]
  1782. at java.net.Socket.connect(Socket.java:603) ~[?:?]
  1783. at com.mysql.cj.protocol.StandardSocketFactory.connect(StandardSocketFactory.java:155) ~[mysq
  1784. l-connector-java-8.0.20.jar:8.0.20]
  1785. at com.mysql.cj.protocol.a.NativeSocketConnection.connect(NativeSocketConnection.java:65) ~[m
  1786. ysql-connector-java-8.0.20.jar:8.0.20]
  1787. at com.mysql.cj.NativeSession.connect(NativeSession.java:144) ~[mysql-connector-java-8.0.20.j
  1788. ar:8.0.20]
  1789. at com.mysql.cj.jdbc.ConnectionImpl.connectWithRetries(ConnectionImpl.java:850) ~[mysql-conne
  1790. ctor-java-8.0.20.jar:8.0.20]
  1791. ... 10 more
  1792. WARN - OpenmrsUtil.getRuntimePropertiesFilePathName(2122) |2020-06-22T07:41:28,488| Unable to find a
  1793. runtime properties file at C:\Users\barba\IdeaProjects\openmrs-core\openmrs-runtime.properties
  1794. WARN - OpenmrsUtil.getRuntimePropertiesFilePathName(2150) |2020-06-22T07:41:28,488| Unable to find pr
  1795. operties file: C:\Users\barba\openmrs\openMRS_server\openmrs-runtime.properties
Advertisement
RAW Paste Data Copied
Advertisement