Guest User

URDE build log

a guest
Dec 21st, 2016
21
Never
Not a member of Pastebin yet? Sign Up, it unlocks many cool features!
  1. 1>------ Build started: Project: ZERO_CHECK, Configuration: Debug x64 ------
  2. 1> Checking Build System
  3. 1> CMake does not need to re-run because C:/Users/Alumno/Desktop/urde/urde-build/CMakeFiles/generate.stamp is up-to-date.
  4. 1> CMake does not need to re-run because C:/Users/Alumno/Desktop/urde/urde-build/hecl/CMakeFiles/generate.stamp is up-to-date.
  5. 1> CMake does not need to re-run because C:/Users/Alumno/Desktop/urde/urde-build/hecl/bintoc/CMakeFiles/generate.stamp is up-to-date.
  6. 1> CMake does not need to re-run because C:/Users/Alumno/Desktop/urde/urde-build/hecl/extern/CMakeFiles/generate.stamp is up-to-date.
  7. 1> CMake does not need to re-run because C:/Users/Alumno/Desktop/urde/urde-build/hecl/extern/boo/CMakeFiles/generate.stamp is up-to-date.
  8. 1> CMake does not need to re-run because C:/Users/Alumno/Desktop/urde/urde-build/hecl/extern/boo/logvisor/CMakeFiles/generate.stamp is up-to-date.
  9. 1> CMake does not need to re-run because C:/Users/Alumno/Desktop/urde/urde-build/hecl/extern/boo/soxr/CMakeFiles/generate.stamp is up-to-date.
  10. 1> CMake does not need to re-run because C:/Users/Alumno/Desktop/urde/urde-build/hecl/extern/boo/soxr/src/CMakeFiles/generate.stamp is up-to-date.
  11. 1> CMake does not need to re-run because C:/Users/Alumno/Desktop/urde/urde-build/hecl/extern/boo/glslang/glslang/CMakeFiles/generate.stamp is up-to-date.
  12. 1> CMake does not need to re-run because C:/Users/Alumno/Desktop/urde/urde-build/hecl/extern/boo/glslang/glslang/OSDependent/Windows/CMakeFiles/generate.stamp is up-to-date.
  13. 1> CMake does not need to re-run because C:/Users/Alumno/Desktop/urde/urde-build/hecl/extern/boo/glslang/hlsl/CMakeFiles/generate.stamp is up-to-date.
  14. 1> CMake does not need to re-run because C:/Users/Alumno/Desktop/urde/urde-build/hecl/extern/boo/glslang/OGLCompilersDLL/CMakeFiles/generate.stamp is up-to-date.
  15. 1> CMake does not need to re-run because C:/Users/Alumno/Desktop/urde/urde-build/hecl/extern/boo/glslang/SPIRV/CMakeFiles/generate.stamp is up-to-date.
  16. 1> CMake does not need to re-run because C:/Users/Alumno/Desktop/urde/urde-build/hecl/extern/boo/glslang/StandAlone/CMakeFiles/generate.stamp is up-to-date.
  17. 1> CMake does not need to re-run because C:/Users/Alumno/Desktop/urde/urde-build/hecl/extern/boo/test/CMakeFiles/generate.stamp is up-to-date.
  18. 1> CMake does not need to re-run because C:/Users/Alumno/Desktop/urde/urde-build/hecl/extern/libSquish/CMakeFiles/generate.stamp is up-to-date.
  19. 1> CMake does not need to re-run because C:/Users/Alumno/Desktop/urde/urde-build/hecl/extern/xxhash/CMakeFiles/generate.stamp is up-to-date.
  20. 1> CMake does not need to re-run because C:/Users/Alumno/Desktop/urde/urde-build/hecl/extern/athena/CMakeFiles/generate.stamp is up-to-date.
  21. 1> CMake does not need to re-run because C:/Users/Alumno/Desktop/urde/urde-build/hecl/extern/athena/extern/CMakeFiles/generate.stamp is up-to-date.
  22. 1> CMake does not need to re-run because C:/Users/Alumno/Desktop/urde/urde-build/hecl/extern/athena/extern/lzo/CMakeFiles/generate.stamp is up-to-date.
  23. 1> CMake does not need to re-run because C:/Users/Alumno/Desktop/urde/urde-build/hecl/extern/athena/extern/zlib/CMakeFiles/generate.stamp is up-to-date.
  24. 1> CMake does not need to re-run because C:/Users/Alumno/Desktop/urde/urde-build/hecl/extern/athena/extern/yaml/CMakeFiles/generate.stamp is up-to-date.
  25. 1> CMake does not need to re-run because C:/Users/Alumno/Desktop/urde/urde-build/hecl/extern/athena/extern/easy-ecc/CMakeFiles/generate.stamp is up-to-date.
  26. 1> CMake does not need to re-run because C:/Users/Alumno/Desktop/urde/urde-build/hecl/extern/athena/atdna/CMakeFiles/generate.stamp is up-to-date.
  27. 1> CMake does not need to re-run because C:/Users/Alumno/Desktop/urde/urde-build/hecl/extern/libpng/CMakeFiles/generate.stamp is up-to-date.
  28. 1> CMake does not need to re-run because C:/Users/Alumno/Desktop/urde/urde-build/hecl/extern/libjpeg-turbo/CMakeFiles/generate.stamp is up-to-date.
  29. 1> CMake does not need to re-run because C:/Users/Alumno/Desktop/urde/urde-build/hecl/lib/CMakeFiles/generate.stamp is up-to-date.
  30. 1> CMake does not need to re-run because C:/Users/Alumno/Desktop/urde/urde-build/hecl/lib/Blender/CMakeFiles/generate.stamp is up-to-date.
  31. 1> CMake does not need to re-run because C:/Users/Alumno/Desktop/urde/urde-build/hecl/lib/Backend/CMakeFiles/generate.stamp is up-to-date.
  32. 1> CMake does not need to re-run because C:/Users/Alumno/Desktop/urde/urde-build/hecl/lib/Frontend/CMakeFiles/generate.stamp is up-to-date.
  33. 1> CMake does not need to re-run because C:/Users/Alumno/Desktop/urde/urde-build/hecl/lib/Runtime/CMakeFiles/generate.stamp is up-to-date.
  34. 1> CMake does not need to re-run because C:/Users/Alumno/Desktop/urde/urde-build/hecl/blender/CMakeFiles/generate.stamp is up-to-date.
  35. 1> CMake does not need to re-run because C:/Users/Alumno/Desktop/urde/urde-build/hecl/driver/CMakeFiles/generate.stamp is up-to-date.
  36. 1> CMake does not need to re-run because C:/Users/Alumno/Desktop/urde/urde-build/hecl/test/CMakeFiles/generate.stamp is up-to-date.
  37. 1> CMake does not need to re-run because C:/Users/Alumno/Desktop/urde/urde-build/amuse/CMakeFiles/generate.stamp is up-to-date.
  38. 1> CMake does not need to re-run because C:/Users/Alumno/Desktop/urde/urde-build/amuse/AudioUnit/CMakeFiles/generate.stamp is up-to-date.
  39. 1> CMake does not need to re-run because C:/Users/Alumno/Desktop/urde/urde-build/amuse/VST/CMakeFiles/generate.stamp is up-to-date.
  40. 1> CMake does not need to re-run because C:/Users/Alumno/Desktop/urde/urde-build/specter/CMakeFiles/generate.stamp is up-to-date.
  41. 1> CMake does not need to re-run because C:/Users/Alumno/Desktop/urde/urde-build/specter/freetype2/CMakeFiles/generate.stamp is up-to-date.
  42. 1> CMake does not need to re-run because C:/Users/Alumno/Desktop/urde/urde-build/specter/zeus/CMakeFiles/generate.stamp is up-to-date.
  43. 1> CMake does not need to re-run because C:/Users/Alumno/Desktop/urde/urde-build/specter/zeus/test/CMakeFiles/generate.stamp is up-to-date.
  44. 1> CMake does not need to re-run because C:/Users/Alumno/Desktop/urde/urde-build/specter/resources/fonts/CMakeFiles/generate.stamp is up-to-date.
  45. 1> CMake does not need to re-run because C:/Users/Alumno/Desktop/urde/urde-build/nod/CMakeFiles/generate.stamp is up-to-date.
  46. 1> CMake does not need to re-run because C:/Users/Alumno/Desktop/urde/urde-build/nod/lib/CMakeFiles/generate.stamp is up-to-date.
  47. 1> CMake does not need to re-run because C:/Users/Alumno/Desktop/urde/urde-build/nod/driver/CMakeFiles/generate.stamp is up-to-date.
  48. 1> CMake does not need to re-run because C:/Users/Alumno/Desktop/urde/urde-build/DataSpec/CMakeFiles/generate.stamp is up-to-date.
  49. 1> CMake does not need to re-run because C:/Users/Alumno/Desktop/urde/urde-build/kabufuda/CMakeFiles/generate.stamp is up-to-date.
  50. 1> CMake does not need to re-run because C:/Users/Alumno/Desktop/urde/urde-build/kabufuda/test/CMakeFiles/generate.stamp is up-to-date.
  51. 1> CMake does not need to re-run because C:/Users/Alumno/Desktop/urde/urde-build/Editor/CMakeFiles/generate.stamp is up-to-date.
  52. 1> CMake does not need to re-run because C:/Users/Alumno/Desktop/urde/urde-build/Editor/locale/CMakeFiles/generate.stamp is up-to-date.
  53. 1> CMake does not need to re-run because C:/Users/Alumno/Desktop/urde/urde-build/Editor/icons/CMakeFiles/generate.stamp is up-to-date.
  54. 1> CMake does not need to re-run because C:/Users/Alumno/Desktop/urde/urde-build/Editor/badging/CMakeFiles/generate.stamp is up-to-date.
  55. 1> CMake does not need to re-run because C:/Users/Alumno/Desktop/urde/urde-build/Runtime/CMakeFiles/generate.stamp is up-to-date.
  56. 1> CMake does not need to re-run because C:/Users/Alumno/Desktop/urde/urde-build/Runtime/Audio/CMakeFiles/generate.stamp is up-to-date.
  57. 1> CMake does not need to re-run because C:/Users/Alumno/Desktop/urde/urde-build/Runtime/Character/CMakeFiles/generate.stamp is up-to-date.
  58. 1> CMake does not need to re-run because C:/Users/Alumno/Desktop/urde/urde-build/Runtime/Graphics/CMakeFiles/generate.stamp is up-to-date.
  59. 1> CMake does not need to re-run because C:/Users/Alumno/Desktop/urde/urde-build/Runtime/Collision/CMakeFiles/generate.stamp is up-to-date.
  60. 1> CMake does not need to re-run because C:/Users/Alumno/Desktop/urde/urde-build/Runtime/Camera/CMakeFiles/generate.stamp is up-to-date.
  61. 1> CMake does not need to re-run because C:/Users/Alumno/Desktop/urde/urde-build/Runtime/World/CMakeFiles/generate.stamp is up-to-date.
  62. 1> CMake does not need to re-run because C:/Users/Alumno/Desktop/urde/urde-build/Runtime/Weapon/CMakeFiles/generate.stamp is up-to-date.
  63. 1> CMake does not need to re-run because C:/Users/Alumno/Desktop/urde/urde-build/Runtime/AutoMapper/CMakeFiles/generate.stamp is up-to-date.
  64. 1> CMake does not need to re-run because C:/Users/Alumno/Desktop/urde/urde-build/Runtime/GuiSys/CMakeFiles/generate.stamp is up-to-date.
  65. 1> CMake does not need to re-run because C:/Users/Alumno/Desktop/urde/urde-build/Runtime/Input/CMakeFiles/generate.stamp is up-to-date.
  66. 1> CMake does not need to re-run because C:/Users/Alumno/Desktop/urde/urde-build/Runtime/Particle/CMakeFiles/generate.stamp is up-to-date.
  67. 1> CMake does not need to re-run because C:/Users/Alumno/Desktop/urde/urde-build/Runtime/MP1/CMakeFiles/generate.stamp is up-to-date.
  68. 1> CMake does not need to re-run because C:/Users/Alumno/Desktop/urde/urde-build/Runtime/MP2/CMakeFiles/generate.stamp is up-to-date.
  69. 1> CMake does not need to re-run because C:/Users/Alumno/Desktop/urde/urde-build/Runtime/MP3/CMakeFiles/generate.stamp is up-to-date.
  70. 1> CMake does not need to re-run because C:/Users/Alumno/Desktop/urde/urde-build/mpcksum/CMakeFiles/generate.stamp is up-to-date.
  71. 2>------ Build started: Project: png, Configuration: Debug x64 ------
  72. 3>------ Build started: Project: z, Configuration: Debug x64 ------
  73. 4>------ Build started: Project: atdna, Configuration: Debug x64 ------
  74. 5>------ Build started: Project: bintoc, Configuration: Debug x64 ------
  75. 2> Building Custom Rule C:/Users/Alumno/Desktop/urde/urde/hecl/extern/libpng/CMakeLists.txt
  76. 2> CMake does not need to re-run because C:\Users\Alumno\Desktop\urde\urde-build\hecl\extern\libpng\CMakeFiles\generate.stamp is up-to-date.
  77. 2> png.c
  78. 2> pngerror.c
  79. 2> pngget.c
  80. 2> pngmem.c
  81. 4> Building Custom Rule C:/Users/Alumno/Desktop/urde/urde/hecl/extern/athena/atdna/CMakeLists.txt
  82. 4> CMake does not need to re-run because C:\Users\Alumno\Desktop\urde\urde-build\hecl\extern\athena\atdna\CMakeFiles\generate.stamp is up-to-date.
  83. 3> Building Custom Rule C:/Users/Alumno/Desktop/urde/urde/hecl/extern/athena/extern/zlib/CMakeLists.txt
  84. 3> CMake does not need to re-run because C:\Users\Alumno\Desktop\urde\urde-build\hecl\extern\athena\extern\zlib\CMakeFiles\generate.stamp is up-to-date.
  85. 4> main.cpp
  86. 3> adler32.c
  87. 3> compress.c
  88. 3> crc32.c
  89. 3> deflate.c
  90. 5> Building Custom Rule C:/Users/Alumno/Desktop/urde/urde/hecl/bintoc/CMakeLists.txt
  91. 5> CMake does not need to re-run because C:\Users\Alumno\Desktop\urde\urde-build\hecl\bintoc\CMakeFiles\generate.stamp is up-to-date.
  92. 5> bintoc.c
  93. 4>C:\Program Files\LLVM\include\llvm/ADT/StringRef.h(593): warning C4141: 'inline': used more than once
  94. 4>C:\Program Files\LLVM\include\llvm/ADT/StringRef.h(598): warning C4141: 'inline': used more than once
  95. 3> infback.c
  96. 3> inffast.c
  97. 3> inflate.c
  98. 3> inftrees.c
  99. 3> trees.c
  100. 3> uncompr.c
  101. 3> zutil.c
  102. 3> z.vcxproj -> C:\Users\Alumno\Desktop\urde\urde-build\hecl\extern\athena\extern\zlib\Debug\z.lib
  103. 6>------ Build started: Project: RuntimeCommon, Configuration: Debug x64 ------
  104. 6> Building Custom Rule C:/Users/Alumno/Desktop/urde/urde/Runtime/CMakeLists.txt
  105. 6> CMake does not need to re-run because C:\Users\Alumno\Desktop\urde\urde-build\Runtime\CMakeFiles\generate.stamp is up-to-date.
  106. 5> bintoc.vcxproj -> C:\Users\Alumno\Desktop\urde\urde-build\hecl\bintoc\Debug\bintoc.exe
  107. 7>------ Build started: Project: HLSL, Configuration: Debug x64 ------
  108. 6> RetroTypes.cpp
  109. 6> ProjectResourceFactoryBase.cpp
  110. 6> ProjectResourceFactoryMP1.cpp
  111. 6> CTweaks.cpp
  112. 7> Building Custom Rule C:/Users/Alumno/Desktop/urde/urde/hecl/extern/boo/glslang/hlsl/CMakeLists.txt
  113. 4>C:\Program Files\LLVM\include\clang/AST/DeclCXX.h(133): warning C4291: 'void *clang::Decl::operator new(size_t,const clang::ASTContext &,clang::DeclContext *,size_t)': no matching operator delete found; memory will not be freed if initialization throws an exception
  114. 7> CMake does not need to re-run because C:\Users\Alumno\Desktop\urde\urde-build\hecl\extern\boo\glslang\hlsl\CMakeFiles\generate.stamp is up-to-date.
  115. 4> C:\Program Files\LLVM\include\clang/AST/DeclBase.h(326): note: see declaration of 'clang::Decl::operator new'
  116. 4>C:\Program Files\LLVM\include\clang/AST/DeclCXX.h(2866): warning C4291: 'void *clang::Decl::operator new(size_t,const clang::ASTContext &,clang::DeclContext *,size_t)': no matching operator delete found; memory will not be freed if initialization throws an exception
  117. 4> C:\Program Files\LLVM\include\clang/AST/DeclBase.h(326): note: see declaration of 'clang::Decl::operator new'
  118. 4>C:\Program Files\LLVM\include\clang/AST/DeclTemplate.h(1506): warning C4291: 'void *clang::Decl::operator new(size_t,const clang::ASTContext &,clang::DeclContext *,size_t)': no matching operator delete found; memory will not be freed if initialization throws an exception
  119. 4> C:\Program Files\LLVM\include\clang/AST/DeclBase.h(326): note: see declaration of 'clang::Decl::operator new'
  120. 4>C:\Program Files\LLVM\include\clang/AST/DeclTemplate.h(2341): warning C4291: 'void *clang::Decl::operator new(size_t,const clang::ASTContext &,clang::DeclContext *,size_t)': no matching operator delete found; memory will not be freed if initialization throws an exception
  121. 4> C:\Program Files\LLVM\include\clang/AST/DeclBase.h(326): note: see declaration of 'clang::Decl::operator new'
  122. 2> pngpread.c
  123. 2> pngread.c
  124. 2> pngrio.c
  125. 2> pngrtran.c
  126. 2> pngrutil.c
  127. 2> pngset.c
  128. 2> pngtrans.c
  129. 2> pngwio.c
  130. 2> pngwrite.c
  131. 2> pngwtran.c
  132. 2> pngwutil.c
  133. 2> png.vcxproj -> C:\Users\Alumno\Desktop\urde\urde-build\hecl\extern\libpng\Debug\png.lib
  134. 8>------ Build started: Project: packbadge, Configuration: Debug x64 ------
  135. 8> Building Custom Rule C:/Users/Alumno/Desktop/urde/urde/Editor/badging/CMakeLists.txt
  136. 8> CMake does not need to re-run because C:\Users\Alumno\Desktop\urde\urde-build\Editor\badging\CMakeFiles\generate.stamp is up-to-date.
  137. 8> packbadge.c
  138. 8> packbadge.vcxproj -> C:\Users\Alumno\Desktop\urde\urde-build\Editor\badging\Debug\packbadge.exe
  139. 9>------ Build started: Project: lzo2, Configuration: Debug x64 ------
  140. 9> Building Custom Rule C:/Users/Alumno/Desktop/urde/urde/hecl/extern/athena/extern/lzo/CMakeLists.txt
  141. 9> CMake does not need to re-run because C:\Users\Alumno\Desktop\urde\urde-build\hecl\extern\athena\extern\lzo\CMakeFiles\generate.stamp is up-to-date.
  142. 9> lzo1.c
  143. 9> lzo1_99.c
  144. 9> lzo1a.c
  145. 9> lzo1a_99.c
  146. 9> lzo1b_1.c
  147. 9> lzo1b_2.c
  148. 9> lzo1b_3.c
  149. 9> lzo1b_4.c
  150. 9> lzo1b_5.c
  151. 9> lzo1b_6.c
  152. 9> lzo1b_7.c
  153. 9> lzo1b_8.c
  154. 9> lzo1b_9.c
  155. 9> lzo1b_99.c
  156. 9> lzo1b_9x.c
  157. 9> lzo1b_cc.c
  158. 9> lzo1b_d1.c
  159. 9> lzo1b_d2.c
  160. 9> lzo1b_rr.c
  161. 9> lzo1b_xx.c
  162. 9> lzo1c_1.c
  163. 9> lzo1c_2.c
  164. 9> lzo1c_3.c
  165. 9> lzo1c_4.c
  166. 9> lzo1c_5.c
  167. 9> lzo1c_6.c
  168. 9> lzo1c_7.c
  169. 9> lzo1c_8.c
  170. 9> lzo1c_9.c
  171. 9> lzo1c_99.c
  172. 9> lzo1c_9x.c
  173. 9> lzo1c_cc.c
  174. 9> lzo1c_d1.c
  175. 9> lzo1c_d2.c
  176. 9> lzo1c_rr.c
  177. 9> lzo1c_xx.c
  178. 9> lzo1f_1.c
  179. 9> lzo1f_9x.c
  180. 9> lzo1f_d1.c
  181. 9> lzo1f_d2.c
  182. 9> lzo1x_1.c
  183. 9> lzo1x_1k.c
  184. 9> lzo1x_1l.c
  185. 9> lzo1x_1o.c
  186. 9> lzo1x_9x.c
  187. 9> lzo1x_d1.c
  188. 9> lzo1x_d2.c
  189. 9> lzo1x_d3.c
  190. 9> lzo1x_o.c
  191. 9> lzo1y_1.c
  192. 6> CInGameTweakManager.cpp
  193. 9> lzo1y_9x.c
  194. 9> lzo1y_d1.c
  195. 9> lzo1y_d2.c
  196. 9> lzo1y_d3.c
  197. 6> CTweakAutoMapper.cpp
  198. 9> lzo1y_o.c
  199. 9> lzo1z_9x.c
  200. 9> lzo1z_d1.c
  201. 9> lzo1z_d2.c
  202. 9> lzo1z_d3.c
  203. 9> lzo2a_9x.c
  204. 9> lzo2a_d1.c
  205. 9> lzo2a_d2.c
  206. 9> lzo_crc.c
  207. 9> lzo_init.c
  208. 9> lzo_ptr.c
  209. 9> lzo_str.c
  210. 9> lzo_util.c
  211. 9> lzo2.vcxproj -> C:\Users\Alumno\Desktop\urde\urde-build\hecl\extern\athena\extern\lzo\Debug\lzo2.lib
  212. 10>------ Build started: Project: OGLCompiler, Configuration: Debug x64 ------
  213. 10> Building Custom Rule C:/Users/Alumno/Desktop/urde/urde/hecl/extern/boo/glslang/OGLCompilersDLL/CMakeLists.txt
  214. 10> CMake does not need to re-run because C:\Users\Alumno\Desktop\urde\urde-build\hecl\extern\boo\glslang\OGLCompilersDLL\CMakeFiles\generate.stamp is up-to-date.
  215. 10> InitializeDll.cpp
  216. 7> hlslAttributes.cpp
  217. 4>C:\Program Files\LLVM\include\clang/Sema/AttributeList.h(640): warning C4291: 'void *operator new(size_t,void *) throw()': no matching operator delete found; memory will not be freed if initialization throws an exception
  218. 7> hlslParseHelper.cpp
  219. 4> C:\Program Files (x86)\Microsoft Visual Studio 14.0\VC\include\vcruntime_new.h(86): note: see declaration of 'operator new'
  220. 7> hlslScanContext.cpp
  221. 4>C:\Program Files\LLVM\include\clang/Sema/AttributeList.h(658): warning C4291: 'void *operator new(size_t,void *) throw()': no matching operator delete found; memory will not be freed if initialization throws an exception
  222. 7> hlslOpMap.cpp
  223. 4> C:\Program Files (x86)\Microsoft Visual Studio 14.0\VC\include\vcruntime_new.h(86): note: see declaration of 'operator new'
  224. 7> hlslTokenStream.cpp
  225. 4>C:\Program Files\LLVM\include\clang/Sema/AttributeList.h(672): warning C4291: 'void *operator new(size_t,void *) throw()': no matching operator delete found; memory will not be freed if initialization throws an exception
  226. 7> hlslGrammar.cpp
  227. 4> C:\Program Files (x86)\Microsoft Visual Studio 14.0\VC\include\vcruntime_new.h(86): note: see declaration of 'operator new'
  228. 7> hlslParseables.cpp
  229. 4>C:\Program Files\LLVM\include\clang/Sema/AttributeList.h(686): warning C4291: 'void *operator new(size_t,void *) throw()': no matching operator delete found; memory will not be freed if initialization throws an exception
  230. 4> C:\Program Files (x86)\Microsoft Visual Studio 14.0\VC\include\vcruntime_new.h(86): note: see declaration of 'operator new'
  231. 4>C:\Program Files\LLVM\include\clang/Sema/AttributeList.h(696): warning C4291: 'void *operator new(size_t,void *) throw()': no matching operator delete found; memory will not be freed if initialization throws an exception
  232. 4> C:\Program Files (x86)\Microsoft Visual Studio 14.0\VC\include\vcruntime_new.h(86): note: see declaration of 'operator new'
  233. 4>C:\Program Files\LLVM\include\clang/Sema/AttributeList.h(708): warning C4291: 'void *operator new(size_t,void *) throw()': no matching operator delete found; memory will not be freed if initialization throws an exception
  234. 4> C:\Program Files (x86)\Microsoft Visual Studio 14.0\VC\include\vcruntime_new.h(86): note: see declaration of 'operator new'
  235. 4>C:\Program Files\LLVM\include\llvm/Support/AlignOf.h(42): warning C4624: 'llvm::detail::AlignmentCalcImpl<T,false>': destructor was implicitly defined as deleted because a base class destructor is inaccessible or deleted
  236. 4> with
  237. 4> [
  238. 4> T=clang::Decl
  239. 4> ]
  240. 4> C:\Program Files\LLVM\include\llvm/Support/AlignOf.h(83): note: see reference to class template instantiation 'llvm::detail::AlignmentCalcImpl<T,false>' being compiled
  241. 4> with
  242. 4> [
  243. 4> T=clang::Decl
  244. 4> ]
  245. 4> C:\Program Files\LLVM\include\llvm/Support/PointerLikeTypeTraits.h(46): note: see reference to class template instantiation 'llvm::AlignOf<T>' being compiled
  246. 4> with
  247. 4> [
  248. 4> T=clang::Decl
  249. 4> ]
  250. 4> C:\Program Files\LLVM\include\llvm/ADT/SmallPtrSet.h(330): note: see reference to class template instantiation 'llvm::PointerLikeTypeTraits<PointerTy>' being compiled
  251. 4> with
  252. 4> [
  253. 4> PointerTy=clang::Decl *
  254. 4> ]
  255. 4> C:\Program Files\LLVM\include\llvm/ADT/SmallPtrSet.h(329): note: while compiling class template member function 'llvm::SmallPtrSetImplBase::size_type llvm::SmallPtrSetImpl<PtrType>::count(PtrType) const'
  256. 4> with
  257. 4> [
  258. 4> PtrType=clang::Decl *
  259. 4> ]
  260. 4> C:\Program Files\LLVM\include\clang/Sema/Scope.h(310): note: see reference to function template instantiation 'llvm::SmallPtrSetImplBase::size_type llvm::SmallPtrSetImpl<PtrType>::count(PtrType) const' being compiled
  261. 4> with
  262. 4> [
  263. 4> PtrType=clang::Decl *
  264. 4> ]
  265. 4> C:\Program Files\LLVM\include\llvm/ADT/SmallPtrSet.h(353): note: see reference to class template instantiation 'llvm::SmallPtrSetImpl<PtrType>' being compiled
  266. 4> with
  267. 4> [
  268. 4> PtrType=clang::Decl *
  269. 4> ]
  270. 4> C:\Program Files\LLVM\include\clang/Sema/Scope.h(183): note: see reference to class template instantiation 'llvm::SmallPtrSet<clang::Decl *,32>' being compiled
  271. 10> OGLCompiler.vcxproj -> C:\Users\Alumno\Desktop\urde\urde-build\hecl\extern\boo\glslang\OGLCompilersDLL\Debug\OGLCompiler.lib
  272. 11>------ Build started: Project: OSDependent, Configuration: Debug x64 ------
  273. 11> Building Custom Rule C:/Users/Alumno/Desktop/urde/urde/hecl/extern/boo/glslang/glslang/OSDependent/Windows/CMakeLists.txt
  274. 11> CMake does not need to re-run because C:\Users\Alumno\Desktop\urde\urde-build\hecl\extern\boo\glslang\glslang\OSDependent\Windows\CMakeFiles\generate.stamp is up-to-date.
  275. 11> ossource.cpp
  276. 11> OSDependent.vcxproj -> C:\Users\Alumno\Desktop\urde\urde-build\hecl\extern\boo\glslang\glslang\OSDependent\Windows\Debug\OSDependent.lib
  277. 12>------ Build started: Project: nod, Configuration: Debug x64 ------
  278. 12> Building Custom Rule C:/Users/Alumno/Desktop/urde/urde/nod/lib/CMakeLists.txt
  279. 12> CMake does not need to re-run because C:\Users\Alumno\Desktop\urde\urde-build\nod\lib\CMakeFiles\generate.stamp is up-to-date.
  280. 12> aes.cpp
  281. 12> DiscBase.cpp
  282. 12> DiscGCN.cpp
  283. 12> DiscIOISO.cpp
  284. 12> DiscIOWBFS.cpp
  285. 12> DiscWii.cpp
  286. 12> DirectoryEnumerator.cpp
  287. 12> nod.cpp
  288. 6> CTweakPlayer.cpp
  289. 6>C:\Program Files (x86)\Microsoft Visual Studio 14.0\VC\include\memory(1199): error C2027: use of undefined type 'urde::CStringTable' (compiling source file C:\Users\Alumno\Desktop\urde\urde\Runtime\MP1\CTweaks.cpp)
  290. 12> FileIOWin32.cpp
  291. 6> c:\users\alumno\desktop\urde\urde\runtime\World/CWorldTransManager.hpp(16): note: see declaration of 'urde::CStringTable' (compiling source file C:\Users\Alumno\Desktop\urde\urde\Runtime\MP1\CTweaks.cpp)
  292. 6> C:\Program Files (x86)\Microsoft Visual Studio 14.0\VC\include\memory(1198): note: while compiling class template member function 'void std::default_delete<_Ty>::operator ()(_Ty *) noexcept const'
  293. 6> with
  294. 6> [
  295. 6> _Ty=urde::CStringTable
  296. 6> ] (compiling source file C:\Users\Alumno\Desktop\urde\urde\Runtime\MP1\CTweaks.cpp)
  297. 6> c:\users\alumno\desktop\urde\urde\runtime\IObj.hpp(32): note: see reference to function template instantiation 'void std::default_delete<_Ty>::operator ()(_Ty *) noexcept const' being compiled
  298. 6> with
  299. 6> [
  300. 6> _Ty=urde::CStringTable
  301. 6> ] (compiling source file C:\Users\Alumno\Desktop\urde\urde\Runtime\MP1\CTweaks.cpp)
  302. 6> c:\users\alumno\desktop\urde\urde\runtime\IObj.hpp(32): note: see reference to class template instantiation 'std::default_delete<_Ty>' being compiled
  303. 6> with
  304. 6> [
  305. 6> _Ty=urde::CStringTable
  306. 6> ] (compiling source file C:\Users\Alumno\Desktop\urde\urde\Runtime\MP1\CTweaks.cpp)
  307. 6> c:\users\alumno\desktop\urde\urde\runtime\IObj.hpp(32): note: while compiling class template member function 'urde::TObjOwnerDerivedFromIObj<T>::~TObjOwnerDerivedFromIObj(void)'
  308. 6> with
  309. 6> [
  310. 6> T=urde::CStringTable
  311. 6> ] (compiling source file C:\Users\Alumno\Desktop\urde\urde\Runtime\MP1\CTweaks.cpp)
  312. 6> c:\users\alumno\desktop\urde\urde\runtime\CToken.hpp(121): note: see reference to class template instantiation 'urde::TObjOwnerDerivedFromIObj<T>' being compiled
  313. 6> with
  314. 6> [
  315. 6> T=urde::CStringTable
  316. 6> ] (compiling source file C:\Users\Alumno\Desktop\urde\urde\Runtime\MP1\CTweaks.cpp)
  317. 6> c:\users\alumno\desktop\urde\urde\runtime\CToken.hpp(120): note: while compiling class template member function 'urde::CStringTable *urde::TToken<T>::GetObj(void)'
  318. 6> with
  319. 6> [
  320. 6> T=urde::CStringTable
  321. 6> ] (compiling source file C:\Users\Alumno\Desktop\urde\urde\Runtime\MP1\CTweaks.cpp)
  322. 6> c:\users\alumno\desktop\urde\urde\runtime\CToken.hpp(148): note: see reference to function template instantiation 'urde::CStringTable *urde::TToken<T>::GetObj(void)' being compiled
  323. 6> with
  324. 6> [
  325. 6> T=urde::CStringTable
  326. 6> ] (compiling source file C:\Users\Alumno\Desktop\urde\urde\Runtime\MP1\CTweaks.cpp)
  327. 6> c:\users\alumno\desktop\urde\urde\runtime\CToken.hpp(138): note: see reference to class template instantiation 'urde::TToken<T>' being compiled
  328. 6> with
  329. 6> [
  330. 6> T=urde::CStringTable
  331. 6> ] (compiling source file C:\Users\Alumno\Desktop\urde\urde\Runtime\MP1\CTweaks.cpp)
  332. 6> c:\users\alumno\desktop\urde\urde\runtime\CToken.hpp(165): note: see reference to class template instantiation 'urde::TCachedToken<T>' being compiled
  333. 6> with
  334. 6> [
  335. 6> T=urde::CStringTable
  336. 6> ] (compiling source file C:\Users\Alumno\Desktop\urde\urde\Runtime\MP1\CTweaks.cpp)
  337. 6> C:\Users\Alumno\Desktop\urde\urde\Runtime\CMemoryCardSys.hpp(28): note: see reference to class template instantiation 'urde::TLockedToken<urde::CStringTable>' being compiled (compiling source file C:\Users\Alumno\Desktop\urde\urde\Runtime\MP1\CTweaks.cpp)
  338. 6>C:\Program Files (x86)\Microsoft Visual Studio 14.0\VC\include\memory(1200): error C2338: can't delete an incomplete type (compiling source file C:\Users\Alumno\Desktop\urde\urde\Runtime\MP1\CTweaks.cpp)
  339. 6>C:\Program Files (x86)\Microsoft Visual Studio 14.0\VC\include\memory(1201): warning C4150: deletion of pointer to incomplete type 'urde::CStringTable'; no destructor called (compiling source file C:\Users\Alumno\Desktop\urde\urde\Runtime\MP1\CTweaks.cpp)
  340. 6> c:\users\alumno\desktop\urde\urde\runtime\World/CWorldTransManager.hpp(16): note: see declaration of 'urde::CStringTable' (compiling source file C:\Users\Alumno\Desktop\urde\urde\Runtime\MP1\CTweaks.cpp)
  341. 6> CTweakGui.cpp
  342. 6> CGBASupport.cpp
  343. 12> sha1.c
  344. 12> nod.vcxproj -> C:\Users\Alumno\Desktop\urde\urde-build\nod\lib\Debug\nod.lib
  345. 13>------ Build started: Project: amuse, Configuration: Debug x64 ------
  346. 13> Building Custom Rule C:/Users/Alumno/Desktop/urde/urde/amuse/CMakeLists.txt
  347. 13> CMake does not need to re-run because C:\Users\Alumno\Desktop\urde\urde-build\amuse\CMakeFiles\generate.stamp is up-to-date.
  348. 13> AudioGroup.cpp
  349. 13> AudioGroupData.cpp
  350. 13> AudioGroupPool.cpp
  351. 13> AudioGroupProject.cpp
  352. 6> CNESEmulator.cpp
  353. 6> CMainFlow.cpp
  354. 6> CMFGame.cpp
  355. 6> CPlayMovie.cpp
  356. 13> AudioGroupSampleDirectory.cpp
  357. 6> CFrontEndUI.cpp
  358. 13> DirectoryEnumerator.cpp
  359. 13> Emitter.cpp
  360. 13> Engine.cpp
  361. 13> Envelope.cpp
  362. 13> Listener.cpp
  363. 13> Sequencer.cpp
  364. 13> SoundMacroState.cpp
  365. 6> CSlideShow.cpp
  366. 13> SongConverter.cpp
  367. 13> SongState.cpp
  368. 13> Voice.cpp
  369. 6>c:\users\alumno\desktop\urde\urde\runtime\mp1\CSaveUI.hpp(23): warning C4099: 'urde::MP1::CSaveUI': type name first seen using 'class' now seen using 'struct' (compiling source file C:\Users\Alumno\Desktop\urde\urde\Runtime\MP1\CFrontEndUI.cpp)
  370. 6> c:\users\alumno\desktop\urde\urde\runtime\mp1\CSaveUI.hpp(22): note: see declaration of 'urde::MP1::CSaveUI' (compiling source file C:\Users\Alumno\Desktop\urde\urde\Runtime\MP1\CFrontEndUI.cpp)
  371. 13> Submix.cpp
  372. 6>C:\Users\Alumno\Desktop\urde\urde\Runtime\MP1\CFrontEndUI.cpp(909): error C2398: Element '1': conversion from 'int' to 'float' requires a narrowing conversion
  373. 6> CNewIntroBoss.cpp
  374. 13> Studio.cpp
  375. 13> EffectReverb.cpp
  376. 13> EffectChorus.cpp
  377. 13> EffectDelay.cpp
  378. 13>C:\Users\Alumno\Desktop\urde\urde\amuse\lib\EffectChorus.cpp(141): warning C4838: conversion from 'double' to 'const float' requires a narrowing conversion
  379. 6>C:\Program Files (x86)\Microsoft Visual Studio 14.0\VC\include\memory(1199): error C2027: use of undefined type 'urde::CStringTable' (compiling source file C:\Users\Alumno\Desktop\urde\urde\Runtime\MP1\CMFGame.cpp)
  380. 6> C:\Users\Alumno\Desktop\urde\urde\Runtime\CMemoryCardSys.hpp(18): note: see declaration of 'urde::CStringTable' (compiling source file C:\Users\Alumno\Desktop\urde\urde\Runtime\MP1\CMFGame.cpp)
  381. 6> C:\Program Files (x86)\Microsoft Visual Studio 14.0\VC\include\memory(1198): note: while compiling class template member function 'void std::default_delete<_Ty>::operator ()(_Ty *) noexcept const'
  382. 6> with
  383. 6> [
  384. 6> _Ty=urde::CStringTable
  385. 6> ] (compiling source file C:\Users\Alumno\Desktop\urde\urde\Runtime\MP1\CMFGame.cpp)
  386. 6> c:\users\alumno\desktop\urde\urde\runtime\IObj.hpp(32): note: see reference to function template instantiation 'void std::default_delete<_Ty>::operator ()(_Ty *) noexcept const' being compiled
  387. 6> with
  388. 6> [
  389. 6> _Ty=urde::CStringTable
  390. 6> ] (compiling source file C:\Users\Alumno\Desktop\urde\urde\Runtime\MP1\CMFGame.cpp)
  391. 6> c:\users\alumno\desktop\urde\urde\runtime\IObj.hpp(32): note: see reference to class template instantiation 'std::default_delete<_Ty>' being compiled
  392. 6> with
  393. 6> [
  394. 6> _Ty=urde::CStringTable
  395. 6> ] (compiling source file C:\Users\Alumno\Desktop\urde\urde\Runtime\MP1\CMFGame.cpp)
  396. 6> c:\users\alumno\desktop\urde\urde\runtime\IObj.hpp(32): note: while compiling class template member function 'urde::TObjOwnerDerivedFromIObj<T>::~TObjOwnerDerivedFromIObj(void)'
  397. 6> with
  398. 6> [
  399. 6> T=urde::CStringTable
  400. 6> ] (compiling source file C:\Users\Alumno\Desktop\urde\urde\Runtime\MP1\CMFGame.cpp)
  401. 6> c:\users\alumno\desktop\urde\urde\runtime\CToken.hpp(121): note: see reference to class template instantiation 'urde::TObjOwnerDerivedFromIObj<T>' being compiled
  402. 6> with
  403. 6> [
  404. 6> T=urde::CStringTable
  405. 6> ] (compiling source file C:\Users\Alumno\Desktop\urde\urde\Runtime\MP1\CMFGame.cpp)
  406. 6> c:\users\alumno\desktop\urde\urde\runtime\CToken.hpp(120): note: while compiling class template member function 'urde::CStringTable *urde::TToken<T>::GetObj(void)'
  407. 6> with
  408. 6> [
  409. 6> T=urde::CStringTable
  410. 6> ] (compiling source file C:\Users\Alumno\Desktop\urde\urde\Runtime\MP1\CMFGame.cpp)
  411. 6> c:\users\alumno\desktop\urde\urde\runtime\CToken.hpp(148): note: see reference to function template instantiation 'urde::CStringTable *urde::TToken<T>::GetObj(void)' being compiled
  412. 6> with
  413. 6> [
  414. 6> T=urde::CStringTable
  415. 6> ] (compiling source file C:\Users\Alumno\Desktop\urde\urde\Runtime\MP1\CMFGame.cpp)
  416. 6> c:\users\alumno\desktop\urde\urde\runtime\CToken.hpp(138): note: see reference to class template instantiation 'urde::TToken<T>' being compiled
  417. 6> with
  418. 6> [
  419. 6> T=urde::CStringTable
  420. 6> ] (compiling source file C:\Users\Alumno\Desktop\urde\urde\Runtime\MP1\CMFGame.cpp)
  421. 6> c:\users\alumno\desktop\urde\urde\runtime\CToken.hpp(165): note: see reference to class template instantiation 'urde::TCachedToken<T>' being compiled
  422. 6> with
  423. 6> [
  424. 6> T=urde::CStringTable
  425. 6> ] (compiling source file C:\Users\Alumno\Desktop\urde\urde\Runtime\MP1\CMFGame.cpp)
  426. 6> c:\users\alumno\desktop\urde\urde\runtime\World/CWorldTransManager.hpp(58): note: see reference to class template instantiation 'urde::TLockedToken<urde::CStringTable>' being compiled (compiling source file C:\Users\Alumno\Desktop\urde\urde\Runtime\MP1\CMFGame.cpp)
  427. 6>C:\Program Files (x86)\Microsoft Visual Studio 14.0\VC\include\memory(1200): error C2338: can't delete an incomplete type (compiling source file C:\Users\Alumno\Desktop\urde\urde\Runtime\MP1\CMFGame.cpp)
  428. 6>C:\Program Files (x86)\Microsoft Visual Studio 14.0\VC\include\memory(1201): warning C4150: deletion of pointer to incomplete type 'urde::CStringTable'; no destructor called (compiling source file C:\Users\Alumno\Desktop\urde\urde\Runtime\MP1\CMFGame.cpp)
  429. 6> C:\Users\Alumno\Desktop\urde\urde\Runtime\CMemoryCardSys.hpp(18): note: see declaration of 'urde::CStringTable' (compiling source file C:\Users\Alumno\Desktop\urde\urde\Runtime\MP1\CMFGame.cpp)
  430. 6>C:\Program Files (x86)\Microsoft Visual Studio 14.0\VC\include\memory(1199): error C2027: use of undefined type 'urde::CStringTable' (compiling source file C:\Users\Alumno\Desktop\urde\urde\Runtime\MP1\CMainFlow.cpp)
  431. 6> c:\users\alumno\desktop\urde\urde\runtime\mp1\CFrontEndUI.hpp(26): note: see declaration of 'urde::CStringTable' (compiling source file C:\Users\Alumno\Desktop\urde\urde\Runtime\MP1\CMainFlow.cpp)
  432. 6> C:\Program Files (x86)\Microsoft Visual Studio 14.0\VC\include\memory(1198): note: while compiling class template member function 'void std::default_delete<_Ty>::operator ()(_Ty *) noexcept const'
  433. 6> with
  434. 6> [
  435. 6> _Ty=urde::CStringTable
  436. 6> ] (compiling source file C:\Users\Alumno\Desktop\urde\urde\Runtime\MP1\CMainFlow.cpp)
  437. 6> c:\users\alumno\desktop\urde\urde\runtime\IObj.hpp(32): note: see reference to function template instantiation 'void std::default_delete<_Ty>::operator ()(_Ty *) noexcept const' being compiled
  438. 6> with
  439. 6> [
  440. 6> _Ty=urde::CStringTable
  441. 6> ] (compiling source file C:\Users\Alumno\Desktop\urde\urde\Runtime\MP1\CMainFlow.cpp)
  442. 6> c:\users\alumno\desktop\urde\urde\runtime\IObj.hpp(32): note: see reference to class template instantiation 'std::default_delete<_Ty>' being compiled
  443. 6> with
  444. 6> [
  445. 6> _Ty=urde::CStringTable
  446. 6> ] (compiling source file C:\Users\Alumno\Desktop\urde\urde\Runtime\MP1\CMainFlow.cpp)
  447. 6> c:\users\alumno\desktop\urde\urde\runtime\IObj.hpp(32): note: while compiling class template member function 'urde::TObjOwnerDerivedFromIObj<T>::~TObjOwnerDerivedFromIObj(void)'
  448. 6> with
  449. 6> [
  450. 6> T=urde::CStringTable
  451. 6> ] (compiling source file C:\Users\Alumno\Desktop\urde\urde\Runtime\MP1\CMainFlow.cpp)
  452. 6> c:\users\alumno\desktop\urde\urde\runtime\CToken.hpp(121): note: see reference to class template instantiation 'urde::TObjOwnerDerivedFromIObj<T>' being compiled
  453. 6> with
  454. 6> [
  455. 6> T=urde::CStringTable
  456. 6> ] (compiling source file C:\Users\Alumno\Desktop\urde\urde\Runtime\MP1\CMainFlow.cpp)
  457. 6> c:\users\alumno\desktop\urde\urde\runtime\CToken.hpp(120): note: while compiling class template member function 'urde::CStringTable *urde::TToken<T>::GetObj(void)'
  458. 6> with
  459. 6> [
  460. 6> T=urde::CStringTable
  461. 6> ] (compiling source file C:\Users\Alumno\Desktop\urde\urde\Runtime\MP1\CMainFlow.cpp)
  462. 6> c:\users\alumno\desktop\urde\urde\runtime\CToken.hpp(148): note: see reference to function template instantiation 'urde::CStringTable *urde::TToken<T>::GetObj(void)' being compiled
  463. 6> with
  464. 6> [
  465. 6> T=urde::CStringTable
  466. 6> ] (compiling source file C:\Users\Alumno\Desktop\urde\urde\Runtime\MP1\CMainFlow.cpp)
  467. 6> c:\users\alumno\desktop\urde\urde\runtime\CToken.hpp(138): note: see reference to class template instantiation 'urde::TToken<T>' being compiled
  468. 6> with
  469. 6> [
  470. 6> T=urde::CStringTable
  471. 6> ] (compiling source file C:\Users\Alumno\Desktop\urde\urde\Runtime\MP1\CMainFlow.cpp)
  472. 6> c:\users\alumno\desktop\urde\urde\runtime\CToken.hpp(165): note: see reference to class template instantiation 'urde::TCachedToken<T>' being compiled
  473. 6> with
  474. 6> [
  475. 6> T=urde::CStringTable
  476. 6> ] (compiling source file C:\Users\Alumno\Desktop\urde\urde\Runtime\MP1\CMainFlow.cpp)
  477. 6> C:\Users\Alumno\Desktop\urde\urde\Runtime\CMemoryCardSys.hpp(28): note: see reference to class template instantiation 'urde::TLockedToken<urde::CStringTable>' being compiled (compiling source file C:\Users\Alumno\Desktop\urde\urde\Runtime\MP1\CMainFlow.cpp)
  478. 6>C:\Program Files (x86)\Microsoft Visual Studio 14.0\VC\include\memory(1200): error C2338: can't delete an incomplete type (compiling source file C:\Users\Alumno\Desktop\urde\urde\Runtime\MP1\CMainFlow.cpp)
  479. 6>C:\Program Files (x86)\Microsoft Visual Studio 14.0\VC\include\memory(1201): warning C4150: deletion of pointer to incomplete type 'urde::CStringTable'; no destructor called (compiling source file C:\Users\Alumno\Desktop\urde\urde\Runtime\MP1\CMainFlow.cpp)
  480. 6> c:\users\alumno\desktop\urde\urde\runtime\mp1\CFrontEndUI.hpp(26): note: see declaration of 'urde::CStringTable' (compiling source file C:\Users\Alumno\Desktop\urde\urde\Runtime\MP1\CMainFlow.cpp)
  481. 13> SurroundProfiles.cpp
  482. 6> CBeetle.cpp
  483. 6> CWarWasp.cpp
  484. 13> ContainerRegistry.cpp
  485. 13> BooBackend.cpp
  486. 6>C:\Program Files (x86)\Microsoft Visual Studio 14.0\VC\include\memory(1199): error C2027: use of undefined type 'urde::CStringTable' (compiling source file C:\Users\Alumno\Desktop\urde\urde\Runtime\MP1\CSlideShow.cpp)
  487. 6> c:\users\alumno\desktop\urde\urde\runtime\World/CWorldTransManager.hpp(16): note: see declaration of 'urde::CStringTable' (compiling source file C:\Users\Alumno\Desktop\urde\urde\Runtime\MP1\CSlideShow.cpp)
  488. 6> C:\Program Files (x86)\Microsoft Visual Studio 14.0\VC\include\memory(1198): note: while compiling class template member function 'void std::default_delete<_Ty>::operator ()(_Ty *) noexcept const'
  489. 6> with
  490. 6> [
  491. 6> _Ty=urde::CStringTable
  492. 6> ] (compiling source file C:\Users\Alumno\Desktop\urde\urde\Runtime\MP1\CSlideShow.cpp)
  493. 6> c:\users\alumno\desktop\urde\urde\runtime\IObj.hpp(32): note: see reference to function template instantiation 'void std::default_delete<_Ty>::operator ()(_Ty *) noexcept const' being compiled
  494. 6> with
  495. 6> [
  496. 6> _Ty=urde::CStringTable
  497. 6> ] (compiling source file C:\Users\Alumno\Desktop\urde\urde\Runtime\MP1\CSlideShow.cpp)
  498. 6> c:\users\alumno\desktop\urde\urde\runtime\IObj.hpp(32): note: see reference to class template instantiation 'std::default_delete<_Ty>' being compiled
  499. 6> with
  500. 6> [
  501. 6> _Ty=urde::CStringTable
  502. 6> ] (compiling source file C:\Users\Alumno\Desktop\urde\urde\Runtime\MP1\CSlideShow.cpp)
  503. 6> c:\users\alumno\desktop\urde\urde\runtime\IObj.hpp(32): note: while compiling class template member function 'urde::TObjOwnerDerivedFromIObj<T>::~TObjOwnerDerivedFromIObj(void)'
  504. 6> with
  505. 6> [
  506. 6> T=urde::CStringTable
  507. 6> ] (compiling source file C:\Users\Alumno\Desktop\urde\urde\Runtime\MP1\CSlideShow.cpp)
  508. 6> C:\Users\Alumno\Desktop\urde\urde\Runtime\CToken.hpp(121): note: see reference to class template instantiation 'urde::TObjOwnerDerivedFromIObj<T>' being compiled
  509. 6> with
  510. 6> [
  511. 6> T=urde::CStringTable
  512. 6> ] (compiling source file C:\Users\Alumno\Desktop\urde\urde\Runtime\MP1\CSlideShow.cpp)
  513. 6> C:\Users\Alumno\Desktop\urde\urde\Runtime\CToken.hpp(120): note: while compiling class template member function 'urde::CStringTable *urde::TToken<T>::GetObj(void)'
  514. 6> with
  515. 6> [
  516. 6> T=urde::CStringTable
  517. 6> ] (compiling source file C:\Users\Alumno\Desktop\urde\urde\Runtime\MP1\CSlideShow.cpp)
  518. 6> C:\Users\Alumno\Desktop\urde\urde\Runtime\CToken.hpp(148): note: see reference to function template instantiation 'urde::CStringTable *urde::TToken<T>::GetObj(void)' being compiled
  519. 6> with
  520. 6> [
  521. 6> T=urde::CStringTable
  522. 6> ] (compiling source file C:\Users\Alumno\Desktop\urde\urde\Runtime\MP1\CSlideShow.cpp)
  523. 6> C:\Users\Alumno\Desktop\urde\urde\Runtime\CToken.hpp(138): note: see reference to class template instantiation 'urde::TToken<T>' being compiled
  524. 6> with
  525. 6> [
  526. 6> T=urde::CStringTable
  527. 6> ] (compiling source file C:\Users\Alumno\Desktop\urde\urde\Runtime\MP1\CSlideShow.cpp)
  528. 6> C:\Users\Alumno\Desktop\urde\urde\Runtime\CToken.hpp(165): note: see reference to class template instantiation 'urde::TCachedToken<T>' being compiled
  529. 6> with
  530. 6> [
  531. 6> T=urde::CStringTable
  532. 6> ] (compiling source file C:\Users\Alumno\Desktop\urde\urde\Runtime\MP1\CSlideShow.cpp)
  533. 6> C:\Users\Alumno\Desktop\urde\urde\Runtime\CMemoryCardSys.hpp(28): note: see reference to class template instantiation 'urde::TLockedToken<urde::CStringTable>' being compiled (compiling source file C:\Users\Alumno\Desktop\urde\urde\Runtime\MP1\CSlideShow.cpp)
  534. 6>C:\Program Files (x86)\Microsoft Visual Studio 14.0\VC\include\memory(1200): error C2338: can't delete an incomplete type (compiling source file C:\Users\Alumno\Desktop\urde\urde\Runtime\MP1\CSlideShow.cpp)
  535. 6>C:\Program Files (x86)\Microsoft Visual Studio 14.0\VC\include\memory(1201): warning C4150: deletion of pointer to incomplete type 'urde::CStringTable'; no destructor called (compiling source file C:\Users\Alumno\Desktop\urde\urde\Runtime\MP1\CSlideShow.cpp)
  536. 6> c:\users\alumno\desktop\urde\urde\runtime\World/CWorldTransManager.hpp(16): note: see declaration of 'urde::CStringTable' (compiling source file C:\Users\Alumno\Desktop\urde\urde\Runtime\MP1\CSlideShow.cpp)
  537. 6> CSpacePirate.cpp
  538. 6> CSaveUI.cpp
  539. 13> VolumeLUT.c
  540. 13> DSPCodec.c
  541. 13> N64MusyXCodec.c
  542. 6> CMemoryCardDriver.cpp
  543. 13> amuse.vcxproj -> C:\Users\Alumno\Desktop\urde\urde-build\amuse\Debug\amuse.lib
  544. 14>------ Build started: Project: SPIRV, Configuration: Debug x64 ------
  545. 6> MP1.cpp
  546. 6>c:\users\alumno\desktop\urde\urde\runtime\mp1\CSaveUI.hpp(23): warning C4099: 'urde::MP1::CSaveUI': type name first seen using 'class' now seen using 'struct' (compiling source file C:\Users\Alumno\Desktop\urde\urde\Runtime\MP1\CSaveUI.cpp)
  547. 6> c:\users\alumno\desktop\urde\urde\runtime\mp1\CSaveUI.hpp(22): note: see declaration of 'urde::MP1::CSaveUI' (compiling source file C:\Users\Alumno\Desktop\urde\urde\Runtime\MP1\CSaveUI.cpp)
  548. 15>------ Build started: Project: SPVRemapper, Configuration: Debug x64 ------
  549. 15> Building Custom Rule C:/Users/Alumno/Desktop/urde/urde/hecl/extern/boo/glslang/SPIRV/CMakeLists.txt
  550. 15> CMake does not need to re-run because C:\Users\Alumno\Desktop\urde\urde-build\hecl\extern\boo\glslang\SPIRV\CMakeFiles\generate.stamp is up-to-date.
  551. 15> SPVRemapper.cpp
  552. 15> doc.cpp
  553. 6> CAudioSys.cpp
  554. 6>C:\Program Files (x86)\Microsoft Visual Studio 14.0\VC\include\memory(1199): error C2027: use of undefined type 'urde::CStringTable' (compiling source file C:\Users\Alumno\Desktop\urde\urde\Runtime\MP1\CMemoryCardDriver.cpp)
  555. 6> C:\Users\Alumno\Desktop\urde\urde\Runtime\GameGlobalObjects.hpp(30): note: see declaration of 'urde::CStringTable' (compiling source file C:\Users\Alumno\Desktop\urde\urde\Runtime\MP1\CMemoryCardDriver.cpp)
  556. 6> C:\Program Files (x86)\Microsoft Visual Studio 14.0\VC\include\memory(1198): note: while compiling class template member function 'void std::default_delete<_Ty>::operator ()(_Ty *) noexcept const'
  557. 6> with
  558. 6> [
  559. 6> _Ty=urde::CStringTable
  560. 6> ] (compiling source file C:\Users\Alumno\Desktop\urde\urde\Runtime\MP1\CMemoryCardDriver.cpp)
  561. 6> c:\users\alumno\desktop\urde\urde\runtime\IObj.hpp(32): note: see reference to function template instantiation 'void std::default_delete<_Ty>::operator ()(_Ty *) noexcept const' being compiled
  562. 6> with
  563. 6> [
  564. 6> _Ty=urde::CStringTable
  565. 6> ] (compiling source file C:\Users\Alumno\Desktop\urde\urde\Runtime\MP1\CMemoryCardDriver.cpp)
  566. 6> c:\users\alumno\desktop\urde\urde\runtime\IObj.hpp(32): note: see reference to class template instantiation 'std::default_delete<_Ty>' being compiled
  567. 6> with
  568. 6> [
  569. 6> _Ty=urde::CStringTable
  570. 6> ] (compiling source file C:\Users\Alumno\Desktop\urde\urde\Runtime\MP1\CMemoryCardDriver.cpp)
  571. 6> c:\users\alumno\desktop\urde\urde\runtime\IObj.hpp(32): note: while compiling class template member function 'urde::TObjOwnerDerivedFromIObj<T>::~TObjOwnerDerivedFromIObj(void)'
  572. 6> with
  573. 6> [
  574. 6> T=urde::CStringTable
  575. 6> ] (compiling source file C:\Users\Alumno\Desktop\urde\urde\Runtime\MP1\CMemoryCardDriver.cpp)
  576. 6> c:\users\alumno\desktop\urde\urde\runtime\CToken.hpp(121): note: see reference to class template instantiation 'urde::TObjOwnerDerivedFromIObj<T>' being compiled
  577. 6> with
  578. 6> [
  579. 6> T=urde::CStringTable
  580. 6> ] (compiling source file C:\Users\Alumno\Desktop\urde\urde\Runtime\MP1\CMemoryCardDriver.cpp)
  581. 6> c:\users\alumno\desktop\urde\urde\runtime\CToken.hpp(120): note: while compiling class template member function 'urde::CStringTable *urde::TToken<T>::GetObj(void)'
  582. 6> with
  583. 6> [
  584. 6> T=urde::CStringTable
  585. 6> ] (compiling source file C:\Users\Alumno\Desktop\urde\urde\Runtime\MP1\CMemoryCardDriver.cpp)
  586. 6> c:\users\alumno\desktop\urde\urde\runtime\CToken.hpp(148): note: see reference to function template instantiation 'urde::CStringTable *urde::TToken<T>::GetObj(void)' being compiled
  587. 6> with
  588. 6> [
  589. 6> T=urde::CStringTable
  590. 6> ] (compiling source file C:\Users\Alumno\Desktop\urde\urde\Runtime\MP1\CMemoryCardDriver.cpp)
  591. 6> c:\users\alumno\desktop\urde\urde\runtime\CToken.hpp(138): note: see reference to class template instantiation 'urde::TToken<T>' being compiled
  592. 6> with
  593. 6> [
  594. 6> T=urde::CStringTable
  595. 6> ] (compiling source file C:\Users\Alumno\Desktop\urde\urde\Runtime\MP1\CMemoryCardDriver.cpp)
  596. 6> c:\users\alumno\desktop\urde\urde\runtime\CToken.hpp(165): note: see reference to class template instantiation 'urde::TCachedToken<T>' being compiled
  597. 6> with
  598. 6> [
  599. 6> T=urde::CStringTable
  600. 6> ] (compiling source file C:\Users\Alumno\Desktop\urde\urde\Runtime\MP1\CMemoryCardDriver.cpp)
  601. 6> C:\Users\Alumno\Desktop\urde\urde\Runtime\CMemoryCardSys.hpp(28): note: see reference to class template instantiation 'urde::TLockedToken<urde::CStringTable>' being compiled (compiling source file C:\Users\Alumno\Desktop\urde\urde\Runtime\MP1\CMemoryCardDriver.cpp)
  602. 6>C:\Program Files (x86)\Microsoft Visual Studio 14.0\VC\include\memory(1200): error C2338: can't delete an incomplete type (compiling source file C:\Users\Alumno\Desktop\urde\urde\Runtime\MP1\CMemoryCardDriver.cpp)
  603. 6>C:\Program Files (x86)\Microsoft Visual Studio 14.0\VC\include\memory(1201): warning C4150: deletion of pointer to incomplete type 'urde::CStringTable'; no destructor called (compiling source file C:\Users\Alumno\Desktop\urde\urde\Runtime\MP1\CMemoryCardDriver.cpp)
  604. 6> C:\Users\Alumno\Desktop\urde\urde\Runtime\GameGlobalObjects.hpp(30): note: see declaration of 'urde::CStringTable' (compiling source file C:\Users\Alumno\Desktop\urde\urde\Runtime\MP1\CMemoryCardDriver.cpp)
  605. 6> CAudioStateWin.cpp
  606. 6> CAudioGroupSet.cpp
  607. 6>c:\users\alumno\desktop\urde\urde\runtime\mp1\csaveui.cpp(19): error C4716: 'urde::MP1::CSaveUI::Update': must return a value
  608. 6>C:\Program Files (x86)\Microsoft Visual Studio 14.0\VC\include\memory(1199): error C2027: use of undefined type 'urde::CStringTable' (compiling source file C:\Users\Alumno\Desktop\urde\urde\Runtime\MP1\MP1.cpp)
  609. 6> C:\Users\Alumno\Desktop\urde\urde\Runtime\GameGlobalObjects.hpp(30): note: see declaration of 'urde::CStringTable' (compiling source file C:\Users\Alumno\Desktop\urde\urde\Runtime\MP1\MP1.cpp)
  610. 6> C:\Program Files (x86)\Microsoft Visual Studio 14.0\VC\include\memory(1198): note: while compiling class template member function 'void std::default_delete<_Ty>::operator ()(_Ty *) noexcept const'
  611. 6> with
  612. 6> [
  613. 6> _Ty=urde::CStringTable
  614. 6> ] (compiling source file C:\Users\Alumno\Desktop\urde\urde\Runtime\MP1\MP1.cpp)
  615. 6> c:\users\alumno\desktop\urde\urde\runtime\IObj.hpp(32): note: see reference to function template instantiation 'void std::default_delete<_Ty>::operator ()(_Ty *) noexcept const' being compiled
  616. 6> with
  617. 6> [
  618. 6> _Ty=urde::CStringTable
  619. 6> ] (compiling source file C:\Users\Alumno\Desktop\urde\urde\Runtime\MP1\MP1.cpp)
  620. 6> c:\users\alumno\desktop\urde\urde\runtime\IObj.hpp(32): note: see reference to class template instantiation 'std::default_delete<_Ty>' being compiled
  621. 6> with
  622. 6> [
  623. 6> _Ty=urde::CStringTable
  624. 6> ] (compiling source file C:\Users\Alumno\Desktop\urde\urde\Runtime\MP1\MP1.cpp)
  625. 6> c:\users\alumno\desktop\urde\urde\runtime\IObj.hpp(32): note: while compiling class template member function 'urde::TObjOwnerDerivedFromIObj<T>::~TObjOwnerDerivedFromIObj(void)'
  626. 6> with
  627. 6> [
  628. 6> T=urde::CStringTable
  629. 6> ] (compiling source file C:\Users\Alumno\Desktop\urde\urde\Runtime\MP1\MP1.cpp)
  630. 6> c:\users\alumno\desktop\urde\urde\runtime\CToken.hpp(121): note: see reference to class template instantiation 'urde::TObjOwnerDerivedFromIObj<T>' being compiled
  631. 6> with
  632. 6> [
  633. 6> T=urde::CStringTable
  634. 6> ] (compiling source file C:\Users\Alumno\Desktop\urde\urde\Runtime\MP1\MP1.cpp)
  635. 6> c:\users\alumno\desktop\urde\urde\runtime\CToken.hpp(120): note: while compiling class template member function 'urde::CStringTable *urde::TToken<T>::GetObj(void)'
  636. 6> with
  637. 6> [
  638. 6> T=urde::CStringTable
  639. 6> ] (compiling source file C:\Users\Alumno\Desktop\urde\urde\Runtime\MP1\MP1.cpp)
  640. 6> c:\users\alumno\desktop\urde\urde\runtime\CToken.hpp(148): note: see reference to function template instantiation 'urde::CStringTable *urde::TToken<T>::GetObj(void)' being compiled
  641. 6> with
  642. 6> [
  643. 6> T=urde::CStringTable
  644. 6> ] (compiling source file C:\Users\Alumno\Desktop\urde\urde\Runtime\MP1\MP1.cpp)
  645. 6> c:\users\alumno\desktop\urde\urde\runtime\CToken.hpp(138): note: see reference to class template instantiation 'urde::TToken<T>' being compiled
  646. 6> with
  647. 6> [
  648. 6> T=urde::CStringTable
  649. 6> ] (compiling source file C:\Users\Alumno\Desktop\urde\urde\Runtime\MP1\MP1.cpp)
  650. 6> c:\users\alumno\desktop\urde\urde\runtime\CToken.hpp(165): note: see reference to class template instantiation 'urde::TCachedToken<T>' being compiled
  651. 6> with
  652. 6> [
  653. 6> T=urde::CStringTable
  654. 6> ] (compiling source file C:\Users\Alumno\Desktop\urde\urde\Runtime\MP1\MP1.cpp)
  655. 6> C:\Users\Alumno\Desktop\urde\urde\Runtime\CMemoryCardSys.hpp(28): note: see reference to class template instantiation 'urde::TLockedToken<urde::CStringTable>' being compiled (compiling source file C:\Users\Alumno\Desktop\urde\urde\Runtime\MP1\MP1.cpp)
  656. 6>C:\Program Files (x86)\Microsoft Visual Studio 14.0\VC\include\memory(1200): error C2338: can't delete an incomplete type (compiling source file C:\Users\Alumno\Desktop\urde\urde\Runtime\MP1\MP1.cpp)
  657. 6>C:\Program Files (x86)\Microsoft Visual Studio 14.0\VC\include\memory(1201): warning C4150: deletion of pointer to incomplete type 'urde::CStringTable'; no destructor called (compiling source file C:\Users\Alumno\Desktop\urde\urde\Runtime\MP1\MP1.cpp)
  658. 6> C:\Users\Alumno\Desktop\urde\urde\Runtime\GameGlobalObjects.hpp(30): note: see declaration of 'urde::CStringTable' (compiling source file C:\Users\Alumno\Desktop\urde\urde\Runtime\MP1\MP1.cpp)
  659. 6> CSfxManager.cpp
  660. 6> CSfxHandle.cpp
  661. 15> SPVRemapper.vcxproj -> C:\Users\Alumno\Desktop\urde\urde-build\hecl\extern\boo\glslang\SPIRV\Debug\SPVRemapper.lib
  662. 16>------ Build started: Project: UrdeBadging, Configuration: Debug x64 ------
  663. 16> Building Custom Rule C:/Users/Alumno/Desktop/urde/urde/Editor/badging/CMakeLists.txt
  664. 16> CMake does not need to re-run because C:\Users\Alumno\Desktop\urde\urde-build\Editor\badging\CMakeFiles\generate.stamp is up-to-date.
  665. 16> Generating badge.bin
  666. 16> Generating badge.c
  667. 16> badge.c
  668. 16> Badging.cpp
  669. 6> CStaticAudioPlayer.cpp
  670. 6> CMapUniverse.cpp
  671. 16> UrdeBadging.vcxproj -> C:\Users\Alumno\Desktop\urde\urde-build\Editor\badging\Debug\UrdeBadging.lib
  672. 17>------ Build started: Project: UrdeIcons, Configuration: Debug x64 ------
  673. 17> Building Custom Rule C:/Users/Alumno/Desktop/urde/urde/Editor/icons/CMakeLists.txt
  674. 17> CMake does not need to re-run because C:\Users\Alumno\Desktop\urde\urde-build\Editor\icons\CMakeFiles\generate.stamp is up-to-date.
  675. 17> Generating icons.bin
  676. 17> -- Inkscape not found; downloading icons to 'C:/Users/Alumno/Desktop/urde/urde-build/Editor/icons/icons.bin'
  677. 6> CMapWorldInfo.cpp
  678. 6>C:\Users\Alumno\Desktop\urde\urde\Runtime\Audio\CStaticAudioPlayer.cpp(64): warning C4018: '<': signed/unsigned mismatch
  679. 6> CMapWorld.cpp
  680. 6> CMapArea.cpp
  681. 17> -- [download 31% complete]
  682. 17> -- [download 63% complete]
  683. 17> -- [download 100% complete]
  684. 17> Generating icons.c
  685. 6> CMappableObject.cpp
  686. 17> icons.cpp
  687. 6> CAutoMapper.cpp
  688. 6> CCameraManager.cpp
  689. 4> Generating code
  690. 6> CGameCamera.cpp
  691. 17> icons.c
  692. 17> UrdeIcons.vcxproj -> C:\Users\Alumno\Desktop\urde\urde-build\Editor\icons\Debug\UrdeIcons.lib
  693. 18>------ Build started: Project: UrdeLocales, Configuration: Debug x64 ------
  694. 6> CFirstPersonCamera.cpp
  695. 18> Building Custom Rule C:/Users/Alumno/Desktop/urde/urde/Editor/locale/CMakeLists.txt
  696. 18> CMake does not need to re-run because C:\Users\Alumno\Desktop\urde\urde-build\Editor\locale\CMakeFiles\generate.stamp is up-to-date.
  697. 18> Generating en_US.c
  698. 18> Generating en_GB.c
  699. 18> Generating ja_JP.c
  700. 18> en_US.c
  701. 18> en_GB.c
  702. 18> ja_JP.c
  703. 18> locale.cpp
  704. 18> UrdeLocales.vcxproj -> C:\Users\Alumno\Desktop\urde\urde-build\Editor\locale\Debug\UrdeLocales.lib
  705. 19>------ Build started: Project: squish, Configuration: Debug x64 ------
  706. 19> Building Custom Rule C:/Users/Alumno/Desktop/urde/urde/hecl/extern/libSquish/CMakeLists.txt
  707. 19> CMake does not need to re-run because C:\Users\Alumno\Desktop\urde\urde-build\hecl\extern\libSquish\CMakeFiles\generate.stamp is up-to-date.
  708. 19> alpha.cpp
  709. 19> clusterfit.cpp
  710. 19> colourblockGCN.cpp
  711. 19> colourblock.cpp
  712. 19> colourfit.cpp
  713. 19> colourset.cpp
  714. 19> maths.cpp
  715. 19> rangefit.cpp
  716. 19> singlecolourfit.cpp
  717. 19> squish.cpp
  718. 4> Finished generating code
  719. 6> CBallCamera.cpp
  720. 19> squish.vcxproj -> C:\Users\Alumno\Desktop\urde\urde-build\hecl\extern\libSquish\Debug\squish.lib
  721. 20>------ Build started: Project: soxr, Configuration: Debug x64 ------
  722. 20> Building Custom Rule C:/Users/Alumno/Desktop/urde/urde/hecl/extern/boo/soxr/src/CMakeLists.txt
  723. 20> CMake does not need to re-run because C:\Users\Alumno\Desktop\urde\urde-build\hecl\extern\boo\soxr\src\CMakeFiles\generate.stamp is up-to-date.
  724. 20> soxr.c
  725. 20> data-io.c
  726. 20> dbesi0.c
  727. 20> filter.c
  728. 20> fft4g64.c
  729. 20> rate32.c
  730. 20> fft4g32.c
  731. 20> rate64.c
  732. 20> rate32s.c
  733. 20> vr32s.c
  734. 20> pffft32s.c
  735. 20> simd.c
  736. 20> soxr.vcxproj -> C:\Users\Alumno\Desktop\urde\urde-build\hecl\extern\boo\soxr\src\Debug\soxr.lib
  737. 21>------ Build started: Project: specter-fonts, Configuration: Debug x64 ------
  738. 21> Building Custom Rule C:/Users/Alumno/Desktop/urde/urde/specter/resources/fonts/CMakeLists.txt
  739. 21> CMake does not need to re-run because C:\Users\Alumno\Desktop\urde\urde-build\specter\resources\fonts\CMakeFiles\generate.stamp is up-to-date.
  740. 21> Generating droidsans-permissive.c
  741. 7> HLSL.vcxproj -> C:\Users\Alumno\Desktop\urde\urde-build\hecl\extern\boo\glslang\hlsl\Debug\HLSL.lib
  742. 22>------ Build started: Project: athena-core, Configuration: Debug x64 ------
  743. 4> atdna.vcxproj -> C:\Users\Alumno\Desktop\urde\urde-build\hecl\extern\athena\atdna\Debug\atdna.exe
  744. 23>------ Build started: Project: RetroDataSpec, Configuration: Debug x64 ------
  745. 22> Building Custom Rule C:/Users/Alumno/Desktop/urde/urde/hecl/extern/athena/CMakeLists.txt
  746. 22> CMake does not need to re-run because C:\Users\Alumno\Desktop\urde\urde-build\hecl\extern\athena\CMakeFiles\generate.stamp is up-to-date.
  747. 23> Building Custom Rule C:/Users/Alumno/Desktop/urde/urde/DataSpec/CMakeLists.txt
  748. 22> Utility.cpp
  749. 22> MemoryReader.cpp
  750. 22> MemoryWriter.cpp
  751. 22> Global.cpp
  752. 23> CMake does not need to re-run because C:\Users\Alumno\Desktop\urde\urde-build\DataSpec\CMakeFiles\generate.stamp is up-to-date.
  753. 23> Generating DNA DNACommon/atdna_CMDL.cpp
  754. 23>C:\Program Files (x86)\MSBuild\Microsoft.Cpp\v4.0\V140\Microsoft.CppCommon.targets(171,5): error MSB6006: "cmd.exe" exited with code -1073741515.
  755. 24>------ Build started: Project: specter, Configuration: Debug x64 ------
  756. 24> Building Custom Rule C:/Users/Alumno/Desktop/urde/urde/specter/CMakeLists.txt
  757. 24> CMake does not need to re-run because C:\Users\Alumno\Desktop\urde\urde-build\specter\CMakeFiles\generate.stamp is up-to-date.
  758. 24> Generating DNA atdna_FontCache.cpp
  759. 24>C:\Program Files (x86)\MSBuild\Microsoft.Cpp\v4.0\V140\Microsoft.CppCommon.targets(171,5): error MSB6006: "cmd.exe" exited with code -1073741515.
  760. 25>------ Build started: Project: athena-libyaml, Configuration: Debug x64 ------
  761. 25> Building Custom Rule C:/Users/Alumno/Desktop/urde/urde/hecl/extern/athena/extern/yaml/CMakeLists.txt
  762. 25> CMake does not need to re-run because C:\Users\Alumno\Desktop\urde\urde-build\hecl\extern\athena\extern\yaml\CMakeFiles\generate.stamp is up-to-date.
  763. 25> api.c
  764. 25> dumper.c
  765. 25> emitter.c
  766. 25> loader.c
  767. 25> parser.c
  768. 25> reader.c
  769. 25> scanner.c
  770. 25> writer.c
  771. 25> athena-libyaml.vcxproj -> C:\Users\Alumno\Desktop\urde\urde-build\hecl\extern\athena\extern\yaml\Debug\athena-libyaml.lib
  772. 22> Checksums.cpp
  773. 26>------ Build started: Project: xxhash, Configuration: Debug x64 ------
  774. 26> Building Custom Rule C:/Users/Alumno/Desktop/urde/urde/hecl/extern/xxhash/CMakeLists.txt
  775. 26> CMake does not need to re-run because C:\Users\Alumno\Desktop\urde\urde-build\hecl\extern\xxhash\CMakeFiles\generate.stamp is up-to-date.
  776. 26> xxhash.c
  777. 22> Compression.cpp
  778. 26> xxhash.vcxproj -> C:\Users\Alumno\Desktop\urde\urde-build\hecl\extern\xxhash\Debug\xxhash.lib
  779. 27>------ Build started: Project: zeus, Configuration: Debug x64 ------
  780. 27> Building Custom Rule C:/Users/Alumno/Desktop/urde/urde/specter/zeus/CMakeLists.txt
  781. 27> CMake does not need to re-run because C:\Users\Alumno\Desktop\urde\urde-build\specter\zeus\CMakeFiles\generate.stamp is up-to-date.
  782. 27> CAxisAngle.cpp
  783. 27> CVector3f.cpp
  784. 27> Math.cpp
  785. 27> CQuaternion.cpp
  786. 21> Generating bmonofont-i18n.c
  787. 22> LZLookupTable.cpp
  788. 22> LZType10.cpp
  789. 22> LZType11.cpp
  790. 27> CMatrix3f.cpp
  791. 22> LZBase.cpp
  792. 22> FileInfo.cpp
  793. 27> CProjection.cpp
  794. 22> Dir.cpp
  795. 27> CPlane.cpp
  796. 27> CTransform.cpp
  797. 22> DNAYaml.cpp
  798. 27> CColor.cpp
  799. 22> FileWriterWin32.cpp
  800. 22> FileReaderWin32.cpp
  801. 27> CVector2f.cpp
  802. 27> CRectangle.cpp
  803. 21> Generating SpecterCurveGlyphs.c
  804. 21> droidsans-permissive.c
  805. 21> bmonofont-i18n.c
  806. 21> SpecterCurveGlyphs.c
  807. 27> CVector4f.cpp
  808. 27> CMatrix4f.cpp
  809. 6> CPathCamera.cpp
  810. 6> CCinematicCamera.cpp
  811. 6> CCameraShakeData.cpp
  812. 6> CCameraFilter.cpp
  813. 27> CAABox.cpp
  814. 21> specter-fonts.vcxproj -> C:\Users\Alumno\Desktop\urde\urde-build\specter\resources\fonts\Debug\specter-fonts.lib
  815. 28>------ Build started: Project: glslang, Configuration: Debug x64 ------
  816. 28> Building Custom Rule C:/Users/Alumno/Desktop/urde/urde/hecl/extern/boo/glslang/glslang/CMakeLists.txt
  817. 28> CMake does not need to re-run because C:\Users\Alumno\Desktop\urde\urde-build\hecl\extern\boo\glslang\glslang\CMakeFiles\generate.stamp is up-to-date.
  818. 28> glslang_tab.cpp
  819. 28> Constant.cpp
  820. 28> iomapper.cpp
  821. 28> InfoSink.cpp
  822. 27> SSELegacy.cpp
  823. 22> win32_largefilewrapper.c
  824. 22> athena-core.vcxproj -> C:\Users\Alumno\Desktop\urde\urde-build\hecl\extern\athena\Debug\athena-core.lib
  825. 29>------ Build started: Project: boo, Configuration: Debug x64 ------
  826. 29> Building Custom Rule C:/Users/Alumno/Desktop/urde/urde/hecl/extern/boo/CMakeLists.txt
  827. 29> CMake does not need to re-run because C:\Users\Alumno\Desktop\urde\urde-build\hecl\extern\boo\CMakeFiles\generate.stamp is up-to-date.
  828. 29> DeviceBase.cpp
  829. 29> CafeProPad.cpp
  830. 29> RevolutionPad.cpp
  831. 29> DolphinSmashAdapter.cpp
  832. 29> DualshockPad.cpp
  833. 29> GenericPad.cpp
  834. 28> Initialize.cpp
  835. 29> DeviceSignature.cpp
  836. 29> DeviceFinder.cpp
  837. 29> WAVOut.cpp
  838. 29> AudioMatrixSSE.cpp
  839. 28> IntermTraverse.cpp
  840. 27>CRectangle.obj : warning LNK4221: This object file does not define any previously undefined public symbols, so it will not be used by any link operation that consumes this library
  841. 27>CPlane.obj : warning LNK4221: This object file does not define any previously undefined public symbols, so it will not be used by any link operation that consumes this library
  842. 27> zeus.vcxproj -> C:\Users\Alumno\Desktop\urde\urde-build\specter\zeus\Debug\zeus.lib
  843. 30>------ Build started: Project: freetype, Configuration: Debug x64 ------
  844. 28> Intermediate.cpp
  845. 29>C:\Users\Alumno\Desktop\urde\urde\hecl\extern\boo\lib\audiodev\AudioMatrixSSE.cpp(23): warning C4838: conversion from 'int' to 'float' requires a narrowing conversion
  846. 28> ParseContextBase.cpp
  847. 29> AudioVoiceEngine.cpp
  848. 29> AudioVoice.cpp
  849. 28> ParseHelper.cpp
  850. 29> AudioSubmix.cpp
  851. 29> MIDIEncoder.cpp
  852. 28> PoolAlloc.cpp
  853. 29> MIDIDecoder.cpp
  854. 31>------ Build started: Project: kabufuda, Configuration: Debug x64 ------
  855. 28> RemoveTree.cpp
  856. 29> MIDICommon.cpp
  857. 28> Scan.cpp
  858. 29> InputDeviceClasses.cpp
  859. 29> GL.cpp
  860. 6> CAssetFactory.cpp
  861. 29> ApplicationWin32.cpp
  862. 6> CCharacterFactory.cpp
  863. 6> CModelData.cpp
  864. 28> ShaderLang.cpp
  865. 29> WindowWin32.cpp
  866. 28> SymbolTable.cpp
  867. 32>------ Build started: Project: glslang-default-resource-limits, Configuration: Debug x64 ------
  868. 29> HIDListenerWinUSB.cpp
  869. 32> Building Custom Rule C:/Users/Alumno/Desktop/urde/urde/hecl/extern/boo/glslang/StandAlone/CMakeLists.txt
  870. 32> CMake does not need to re-run because C:\Users\Alumno\Desktop\urde\urde-build\hecl\extern\boo\glslang\StandAlone\CMakeFiles\generate.stamp is up-to-date.
  871. 32> ResourceLimits.cpp
  872. 28> Versions.cpp
  873. 6> CAnimData.cpp
  874. 32> glslang-default-resource-limits.vcxproj -> C:\Users\Alumno\Desktop\urde\urde-build\hecl\extern\boo\glslang\StandAlone\Debug\glslang-default-resource-limits.lib
  875. 33>------ Build started: Project: hecl-blender-addon, Configuration: Debug x64 ------
  876. 33> Building Custom Rule C:/Users/Alumno/Desktop/urde/urde/hecl/blender/CMakeLists.txt
  877. 33> CMake does not need to re-run because C:\Users\Alumno\Desktop\urde\urde-build\hecl\blender\CMakeFiles\generate.stamp is up-to-date.
  878. 33> Generating hecl_blendershell.c
  879. 33> Generating addon package
  880. 33> "python" no se reconoce como un comando interno o externo,
  881. 33> programa o archivo por lotes ejecutable.
  882. 33>C:\Program Files (x86)\MSBuild\Microsoft.Cpp\v4.0\V140\Microsoft.CppCommon.targets(171,5): error MSB6006: "cmd.exe" exited with code 9009.
  883. 34>------ Build started: Project: hecl-common, Configuration: Debug x64 ------
  884. 28> intermOut.cpp
  885. 28> limits.cpp
  886. 34> Building Custom Rule C:/Users/Alumno/Desktop/urde/urde/hecl/lib/CMakeLists.txt
  887. 34> CMake does not need to re-run because C:\Users\Alumno\Desktop\urde\urde-build\hecl\lib\CMakeFiles\generate.stamp is up-to-date.
  888. 34> Generating DNA atdna_HMDLMeta.cpp
  889. 34>C:\Program Files (x86)\MSBuild\Microsoft.Cpp\v4.0\V140\Microsoft.CppCommon.targets(171,5): error MSB6006: "cmd.exe" exited with code -1073741515.
  890. 35>------ Build started: Project: libjpeg-turbo, Configuration: Debug x64 ------
  891. 35> Building Custom Rule C:/Users/Alumno/Desktop/urde/urde/hecl/extern/libjpeg-turbo/CMakeLists.txt
  892. 35> CMake does not need to re-run because C:\Users\Alumno\Desktop\urde\urde-build\hecl\extern\libjpeg-turbo\CMakeFiles\generate.stamp is up-to-date.
  893. 35> turbojpeg.c
  894. 35> jerror.c
  895. 35> jutils.c
  896. 35> jcparam.c
  897. 35> jcapimin.c
  898. 35> jcomapi.c
  899. 28> linkValidate.cpp
  900. 35> jcapistd.c
  901. 35> jdapistd.c
  902. 35> jdapimin.c
  903. 35> jdhuff.c
  904. 35> jdatadst-tj.c
  905. 35> jdatasrc-tj.c
  906. 35> transupp.c
  907. 35>C:\Users\Alumno\Desktop\urde\urde\hecl\extern\libjpeg-turbo\jdhuff.c(366): warning C4102: 'no_more_bytes': unreferenced label
  908. 35> jdtrans.c
  909. 35> jctrans.c
  910. 35> jcmaster.c
  911. 35> jmemmgr.c
  912. 35> jcmarker.c
  913. 35> jcinit.c
  914. 35> jdmaster.c
  915. 35> jdmarker.c
  916. 35> jdinput.c
  917. 29> HIDDeviceWinUSB.cpp
  918. 35> jdarith.c
  919. 35> jdphuff.c
  920. 35> jdcoefct.c
  921. 35> jcarith.c
  922. 35> jcphuff.c
  923. 28> parseConst.cpp
  924. 35> jchuff.c
  925. 35> jmemnobs.c
  926. 35> jccolor.c
  927. 35> jcsample.c
  928. 35> jcprepct.c
  929. 35> jcdctmgr.c
  930. 29> D3D11.cpp
  931. 35> jccoefct.c
  932. 35> jcmainct.c
  933. 35> jquant1.c
  934. 35> jquant2.c
  935. 35> jdmerge.c
  936. 35> jdcolor.c
  937. 35> jdsample.c
  938. 35> jdpostct.c
  939. 35> jddctmgr.c
  940. 35> jdmainct.c
  941. 28> reflection.cpp
  942. 28> Pp.cpp
  943. 35> jsimd_none.c
  944. 6> CCharAnimTime.cpp
  945. 35> jfdctint.c
  946. 35> jfdctfst.c
  947. 35> jfdctflt.c
  948. 35> jidctred.c
  949. 29>C:\Users\Alumno\Desktop\urde\urde\hecl\extern\boo\lib\win\WindowWin32.cpp(1101): error C2065: 'DEVICE_SCALE_FACTOR_INVALID': undeclared identifier
  950. 29> D3D12.cpp
  951. 35> jidctint.c
  952. 28> PpAtom.cpp
  953. 35> jidctfst.c
  954. 35> jidctflt.c
  955. 35> jaricom.c
  956. 29> WASAPI.cpp
  957. 35> libjpeg-turbo.vcxproj -> C:\Users\Alumno\Desktop\urde\urde-build\hecl\extern\libjpeg-turbo\Debug\libjpeg-turbo.lib
  958. 36>------ Build started: Project: logvisor, Configuration: Debug x64 ------
  959. 36> Building Custom Rule C:/Users/Alumno/Desktop/urde/urde/hecl/extern/boo/logvisor/CMakeLists.txt
  960. 36> CMake does not need to re-run because C:\Users\Alumno\Desktop\urde\urde-build\hecl\extern\boo\logvisor\CMakeFiles\generate.stamp is up-to-date.
  961. 36> logvisor.cpp
  962. 36>C:\Program Files (x86)\Windows Kits\8.1\Include\um\DbgHelp.h(1544): warning C4091: 'typedef ': ignored on left of '' when no variable is declared
  963. 36>C:\Program Files (x86)\Windows Kits\8.1\Include\um\DbgHelp.h(3190): warning C4091: 'typedef ': ignored on left of '' when no variable is declared
  964. 6>C:\Program Files (x86)\Microsoft Visual Studio 14.0\VC\include\memory(1199): error C2027: use of undefined type 'urde::CStringTable' (compiling source file C:\Users\Alumno\Desktop\urde\urde\Runtime\Character\CModelData.cpp)
  965. 6> C:\Users\Alumno\Desktop\urde\urde\Runtime\GameGlobalObjects.hpp(30): note: see declaration of 'urde::CStringTable' (compiling source file C:\Users\Alumno\Desktop\urde\urde\Runtime\Character\CModelData.cpp)
  966. 6> C:\Program Files (x86)\Microsoft Visual Studio 14.0\VC\include\memory(1198): note: while compiling class template member function 'void std::default_delete<_Ty>::operator ()(_Ty *) noexcept const'
  967. 6> with
  968. 6> [
  969. 6> _Ty=urde::CStringTable
  970. 6> ] (compiling source file C:\Users\Alumno\Desktop\urde\urde\Runtime\Character\CModelData.cpp)
  971. 6> c:\users\alumno\desktop\urde\urde\runtime\IObj.hpp(32): note: see reference to function template instantiation 'void std::default_delete<_Ty>::operator ()(_Ty *) noexcept const' being compiled
  972. 6> with
  973. 6> [
  974. 6> _Ty=urde::CStringTable
  975. 6> ] (compiling source file C:\Users\Alumno\Desktop\urde\urde\Runtime\Character\CModelData.cpp)
  976. 6> c:\users\alumno\desktop\urde\urde\runtime\IObj.hpp(32): note: see reference to class template instantiation 'std::default_delete<_Ty>' being compiled
  977. 6> with
  978. 6> [
  979. 6> _Ty=urde::CStringTable
  980. 6> ] (compiling source file C:\Users\Alumno\Desktop\urde\urde\Runtime\Character\CModelData.cpp)
  981. 6> c:\users\alumno\desktop\urde\urde\runtime\IObj.hpp(32): note: while compiling class template member function 'urde::TObjOwnerDerivedFromIObj<T>::~TObjOwnerDerivedFromIObj(void)'
  982. 6> with
  983. 6> [
  984. 6> T=urde::CStringTable
  985. 6> ] (compiling source file C:\Users\Alumno\Desktop\urde\urde\Runtime\Character\CModelData.cpp)
  986. 6> C:\Users\Alumno\Desktop\urde\urde\Runtime\CToken.hpp(121): note: see reference to class template instantiation 'urde::TObjOwnerDerivedFromIObj<T>' being compiled
  987. 6> with
  988. 6> [
  989. 6> T=urde::CStringTable
  990. 6> ] (compiling source file C:\Users\Alumno\Desktop\urde\urde\Runtime\Character\CModelData.cpp)
  991. 6> C:\Users\Alumno\Desktop\urde\urde\Runtime\CToken.hpp(120): note: while compiling class template member function 'urde::CStringTable *urde::TToken<T>::GetObj(void)'
  992. 6> with
  993. 6> [
  994. 6> T=urde::CStringTable
  995. 6> ] (compiling source file C:\Users\Alumno\Desktop\urde\urde\Runtime\Character\CModelData.cpp)
  996. 6> C:\Users\Alumno\Desktop\urde\urde\Runtime\CToken.hpp(148): note: see reference to function template instantiation 'urde::CStringTable *urde::TToken<T>::GetObj(void)' being compiled
  997. 6> with
  998. 6> [
  999. 6> T=urde::CStringTable
  1000. 6> ] (compiling source file C:\Users\Alumno\Desktop\urde\urde\Runtime\Character\CModelData.cpp)
  1001. 6> C:\Users\Alumno\Desktop\urde\urde\Runtime\CToken.hpp(138): note: see reference to class template instantiation 'urde::TToken<T>' being compiled
  1002. 6> with
  1003. 6> [
  1004. 6> T=urde::CStringTable
  1005. 6> ] (compiling source file C:\Users\Alumno\Desktop\urde\urde\Runtime\Character\CModelData.cpp)
  1006. 6> C:\Users\Alumno\Desktop\urde\urde\Runtime\CToken.hpp(165): note: see reference to class template instantiation 'urde::TCachedToken<T>' being compiled
  1007. 6> with
  1008. 6> [
  1009. 6> T=urde::CStringTable
  1010. 6> ] (compiling source file C:\Users\Alumno\Desktop\urde\urde\Runtime\Character\CModelData.cpp)
  1011. 6> C:\Users\Alumno\Desktop\urde\urde\Runtime\CMemoryCardSys.hpp(28): note: see reference to class template instantiation 'urde::TLockedToken<urde::CStringTable>' being compiled (compiling source file C:\Users\Alumno\Desktop\urde\urde\Runtime\Character\CModelData.cpp)
  1012. 6>C:\Program Files (x86)\Microsoft Visual Studio 14.0\VC\include\memory(1200): error C2338: can't delete an incomplete type (compiling source file C:\Users\Alumno\Desktop\urde\urde\Runtime\Character\CModelData.cpp)
  1013. 6>C:\Program Files (x86)\Microsoft Visual Studio 14.0\VC\include\memory(1201): warning C4150: deletion of pointer to incomplete type 'urde::CStringTable'; no destructor called (compiling source file C:\Users\Alumno\Desktop\urde\urde\Runtime\Character\CModelData.cpp)
  1014. 6> C:\Users\Alumno\Desktop\urde\urde\Runtime\GameGlobalObjects.hpp(30): note: see declaration of 'urde::CStringTable' (compiling source file C:\Users\Alumno\Desktop\urde\urde\Runtime\Character\CModelData.cpp)
  1015. 6> IMetaAnim.cpp
  1016. 36> logvisor.vcxproj -> C:\Users\Alumno\Desktop\urde\urde-build\hecl\extern\boo\logvisor\Debug\logvisor.lib
  1017. 37>------ Build started: Project: easy-ecc, Configuration: Debug x64 ------
  1018. 28> PpContext.cpp
  1019. 37> Building Custom Rule C:/Users/Alumno/Desktop/urde/urde/hecl/extern/athena/extern/easy-ecc/CMakeLists.txt
  1020. 37> CMake does not need to re-run because C:\Users\Alumno\Desktop\urde\urde-build\hecl\extern\athena\extern\easy-ecc\CMakeFiles\generate.stamp is up-to-date.
  1021. 6> CLinearAnimationTimeScale.cpp
  1022. 6> CConstantAnimationTimeScale.cpp
  1023. 6> CAnimationDatabaseGame.cpp
  1024. 6> CTransitionDatabaseGame.cpp
  1025. 28> PpMemory.cpp
  1026. 28> PpScanner.cpp
  1027. 28> PpSymbols.cpp
  1028. 28> PpTokens.cpp
  1029. 37> ecc.c
  1030. 29>C:\Program Files (x86)\Microsoft Visual Studio 14.0\VC\include\xmemory0(657): error C2665: 'std::pair<const _Kty,_Ty>::pair': none of the 4 overloads could convert all the argument types
  1031. 29> with
  1032. 29> [
  1033. 29> _Kty=boo::D3D11GraphicsBufferD *,
  1034. 29> _Ty=std::shared_ptr<boo::D3D11GraphicsBufferD>
  1035. 29> ] (compiling source file C:\Users\Alumno\Desktop\urde\urde\hecl\extern\boo\lib\graphicsdev\D3D11.cpp)
  1036. 29> C:\Program Files (x86)\Microsoft Visual Studio 14.0\VC\include\utility(97): note: could be 'std::pair<const _Kty,_Ty>::pair(std::pair<const _Kty,_Ty> &&)'
  1037. 29> with
  1038. 29> [
  1039. 29> _Kty=boo::D3D11GraphicsBufferD *,
  1040. 29> _Ty=std::shared_ptr<boo::D3D11GraphicsBufferD>
  1041. 29> ] (compiling source file C:\Users\Alumno\Desktop\urde\urde\hecl\extern\boo\lib\graphicsdev\D3D11.cpp)
  1042. 29> C:\Program Files (x86)\Microsoft Visual Studio 14.0\VC\include\utility(96): note: or 'std::pair<const _Kty,_Ty>::pair(const std::pair<const _Kty,_Ty> &)'
  1043. 29> with
  1044. 29> [
  1045. 29> _Kty=boo::D3D11GraphicsBufferD *,
  1046. 29> _Ty=std::shared_ptr<boo::D3D11GraphicsBufferD>
  1047. 29> ] (compiling source file C:\Users\Alumno\Desktop\urde\urde\hecl\extern\boo\lib\graphicsdev\D3D11.cpp)
  1048. 29> C:\Program Files (x86)\Microsoft Visual Studio 14.0\VC\include\utility(91): note: or 'std::pair<const _Kty,_Ty>::pair(_Ty1 &,const _Ty2 &)'
  1049. 29> with
  1050. 29> [
  1051. 29> _Kty=boo::D3D11GraphicsBufferD *,
  1052. 29> _Ty=std::shared_ptr<boo::D3D11GraphicsBufferD>,
  1053. 29> _Ty1=boo::D3D11GraphicsBufferD *,
  1054. 29> _Ty2=std::shared_ptr<boo::D3D11GraphicsBufferD>
  1055. 29> ] (compiling source file C:\Users\Alumno\Desktop\urde\urde\hecl\extern\boo\lib\graphicsdev\D3D11.cpp)
  1056. 29> C:\Program Files (x86)\Microsoft Visual Studio 14.0\VC\include\utility(86): note: or 'std::pair<const _Kty,_Ty>::pair(void)'
  1057. 29> with
  1058. 29> [
  1059. 29> _Kty=boo::D3D11GraphicsBufferD *,
  1060. 29> _Ty=std::shared_ptr<boo::D3D11GraphicsBufferD>
  1061. 29> ] (compiling source file C:\Users\Alumno\Desktop\urde\urde\hecl\extern\boo\lib\graphicsdev\D3D11.cpp)
  1062. 29> C:\Program Files (x86)\Microsoft Visual Studio 14.0\VC\include\xmemory0(657): note: while trying to match the argument list '(std::pair<boo::D3D11GraphicsBufferD *,boo::D3D11GraphicsBufferD *>)' (compiling source file C:\Users\Alumno\Desktop\urde\urde\hecl\extern\boo\lib\graphicsdev\D3D11.cpp)
  1063. 29> C:\Program Files (x86)\Microsoft Visual Studio 14.0\VC\include\xmemory0(775): note: see reference to function template instantiation 'void std::allocator<_Other>::construct<_Objty,_Ty>(_Objty *,_Ty &&)' being compiled
  1064. 29> with
  1065. 29> [
  1066. 29> _Other=std::_List_node<std::pair<boo::D3D11GraphicsBufferD *const ,std::shared_ptr<boo::D3D11GraphicsBufferD>>,void *>,
  1067. 29> _Objty=std::pair<boo::D3D11GraphicsBufferD *const ,std::shared_ptr<boo::D3D11GraphicsBufferD>>,
  1068. 29> _Ty=std::pair<boo::D3D11GraphicsBufferD *,boo::D3D11GraphicsBufferD *>
  1069. 29> ] (compiling source file C:\Users\Alumno\Desktop\urde\urde\hecl\extern\boo\lib\graphicsdev\D3D11.cpp)
  1070. 29> C:\Program Files (x86)\Microsoft Visual Studio 14.0\VC\include\xmemory0(775): note: see reference to function template instantiation 'void std::allocator<_Other>::construct<_Objty,_Ty>(_Objty *,_Ty &&)' being compiled
  1071. 29> with
  1072. 29> [
  1073. 29> _Other=std::_List_node<std::pair<boo::D3D11GraphicsBufferD *const ,std::shared_ptr<boo::D3D11GraphicsBufferD>>,void *>,
  1074. 29> _Objty=std::pair<boo::D3D11GraphicsBufferD *const ,std::shared_ptr<boo::D3D11GraphicsBufferD>>,
  1075. 29> _Ty=std::pair<boo::D3D11GraphicsBufferD *,boo::D3D11GraphicsBufferD *>
  1076. 29> ] (compiling source file C:\Users\Alumno\Desktop\urde\urde\hecl\extern\boo\lib\graphicsdev\D3D11.cpp)
  1077. 29> C:\Program Files (x86)\Microsoft Visual Studio 14.0\VC\include\xmemory0(920): note: see reference to function template instantiation 'void std::allocator_traits<_Alloc>::construct<_Ty,std::pair<boo::D3D11GraphicsBufferD *,boo::D3D11GraphicsBufferD *>>(std::allocator<_Other> &,_Objty *,std::pair<boo::D3D11GraphicsBufferD *,boo::D3D11GraphicsBufferD *> &&)' being compiled
  1078. 29> with
  1079. 29> [
  1080. 29> _Alloc=std::allocator<std::_List_node<std::pair<boo::D3D11GraphicsBufferD *const ,std::shared_ptr<boo::D3D11GraphicsBufferD>>,void *>>,
  1081. 29> _Ty=std::pair<boo::D3D11GraphicsBufferD *const ,std::shared_ptr<boo::D3D11GraphicsBufferD>>,
  1082. 29> _Other=std::_List_node<std::pair<boo::D3D11GraphicsBufferD *const ,std::shared_ptr<boo::D3D11GraphicsBufferD>>,void *>,
  1083. 29> _Objty=std::pair<boo::D3D11GraphicsBufferD *const ,std::shared_ptr<boo::D3D11GraphicsBufferD>>
  1084. 29> ] (compiling source file C:\Users\Alumno\Desktop\urde\urde\hecl\extern\boo\lib\graphicsdev\D3D11.cpp)
  1085. 29> C:\Program Files (x86)\Microsoft Visual Studio 14.0\VC\include\xmemory0(920): note: see reference to function template instantiation 'void std::allocator_traits<_Alloc>::construct<_Ty,std::pair<boo::D3D11GraphicsBufferD *,boo::D3D11GraphicsBufferD *>>(std::allocator<_Other> &,_Objty *,std::pair<boo::D3D11GraphicsBufferD *,boo::D3D11GraphicsBufferD *> &&)' being compiled
  1086. 29> with
  1087. 29> [
  1088. 29> _Alloc=std::allocator<std::_List_node<std::pair<boo::D3D11GraphicsBufferD *const ,std::shared_ptr<boo::D3D11GraphicsBufferD>>,void *>>,
  1089. 29> _Ty=std::pair<boo::D3D11GraphicsBufferD *const ,std::shared_ptr<boo::D3D11GraphicsBufferD>>,
  1090. 29> _Other=std::_List_node<std::pair<boo::D3D11GraphicsBufferD *const ,std::shared_ptr<boo::D3D11GraphicsBufferD>>,void *>,
  1091. 29> _Objty=std::pair<boo::D3D11GraphicsBufferD *const ,std::shared_ptr<boo::D3D11GraphicsBufferD>>
  1092. 29> ] (compiling source file C:\Users\Alumno\Desktop\urde\urde\hecl\extern\boo\lib\graphicsdev\D3D11.cpp)
  1093. 29> C:\Program Files (x86)\Microsoft Visual Studio 14.0\VC\include\list(834): note: see reference to function template instantiation 'void std::_Wrap_alloc<std::allocator<_Other>>::construct<_Ty,std::pair<boo::D3D11GraphicsBufferD *,boo::D3D11GraphicsBufferD *>>(_Ty *,std::pair<boo::D3D11GraphicsBufferD *,boo::D3D11GraphicsBufferD *> &&)' being compiled
  1094. 29> with
  1095. 29> [
  1096. 29> _Other=std::_List_node<std::pair<boo::D3D11GraphicsBufferD *const ,std::shared_ptr<boo::D3D11GraphicsBufferD>>,void *>,
  1097. 29> _Ty=std::pair<boo::D3D11GraphicsBufferD *const ,std::shared_ptr<boo::D3D11GraphicsBufferD>>
  1098. 29> ] (compiling source file C:\Users\Alumno\Desktop\urde\urde\hecl\extern\boo\lib\graphicsdev\D3D11.cpp)
  1099. 29> C:\Program Files (x86)\Microsoft Visual Studio 14.0\VC\include\list(834): note: see reference to function template instantiation 'void std::_Wrap_alloc<std::allocator<_Other>>::construct<_Ty,std::pair<boo::D3D11GraphicsBufferD *,boo::D3D11GraphicsBufferD *>>(_Ty *,std::pair<boo::D3D11GraphicsBufferD *,boo::D3D11GraphicsBufferD *> &&)' being compiled
  1100. 29> with
  1101. 29> [
  1102. 29> _Other=std::_List_node<std::pair<boo::D3D11GraphicsBufferD *const ,std::shared_ptr<boo::D3D11GraphicsBufferD>>,void *>,
  1103. 29> _Ty=std::pair<boo::D3D11GraphicsBufferD *const ,std::shared_ptr<boo::D3D11GraphicsBufferD>>
  1104. 29> ] (compiling source file C:\Users\Alumno\Desktop\urde\urde\hecl\extern\boo\lib\graphicsdev\D3D11.cpp)
  1105. 29> C:\Program Files (x86)\Microsoft Visual Studio 14.0\VC\include\list(1062): note: see reference to function template instantiation 'std::_List_node<std::pair<const _Kty,_Ty>,void *> *std::_List_buy<std::pair<const _Kty,_Ty>,_Alloc>::_Buynode<std::pair<boo::D3D11GraphicsBufferD *,boo::D3D11GraphicsBufferD *>>(std::_List_node<std::pair<const _Kty,_Ty>,void *> *,std::_List_node<std::pair<const _Kty,_Ty>,void *> *,std::pair<boo::D3D11GraphicsBufferD *,boo::D3D11GraphicsBufferD *> &&)' being compiled
  1106. 29> with
  1107. 29> [
  1108. 29> _Kty=boo::D3D11GraphicsBufferD *,
  1109. 29> _Ty=std::shared_ptr<boo::D3D11GraphicsBufferD>,
  1110. 29> _Alloc=std::allocator<std::pair<boo::D3D11GraphicsBufferD *const ,std::shared_ptr<boo::D3D11GraphicsBufferD>>>
  1111. 29> ] (compiling source file C:\Users\Alumno\Desktop\urde\urde\hecl\extern\boo\lib\graphicsdev\D3D11.cpp)
  1112. 29> C:\Program Files (x86)\Microsoft Visual Studio 14.0\VC\include\list(1062): note: see reference to function template instantiation 'std::_List_node<std::pair<const _Kty,_Ty>,void *> *std::_List_buy<std::pair<const _Kty,_Ty>,_Alloc>::_Buynode<std::pair<boo::D3D11GraphicsBufferD *,boo::D3D11GraphicsBufferD *>>(std::_List_node<std::pair<const _Kty,_Ty>,void *> *,std::_List_node<std::pair<const _Kty,_Ty>,void *> *,std::pair<boo::D3D11GraphicsBufferD *,boo::D3D11GraphicsBufferD *> &&)' being compiled
  1113. 29> with
  1114. 29> [
  1115. 29> _Kty=boo::D3D11GraphicsBufferD *,
  1116. 29> _Ty=std::shared_ptr<boo::D3D11GraphicsBufferD>,
  1117. 29> _Alloc=std::allocator<std::pair<boo::D3D11GraphicsBufferD *const ,std::shared_ptr<boo::D3D11GraphicsBufferD>>>
  1118. 29> ] (compiling source file C:\Users\Alumno\Desktop\urde\urde\hecl\extern\boo\lib\graphicsdev\D3D11.cpp)
  1119. 29> C:\Program Files (x86)\Microsoft Visual Studio 14.0\VC\include\list(1034): note: see reference to function template instantiation 'void std::list<std::pair<const _Kty,_Ty>,std::allocator<std::pair<const _Kty,_Ty>>>::_Insert<std::pair<boo::D3D11GraphicsBufferD *,boo::D3D11GraphicsBufferD *>>(std::_List_unchecked_const_iterator<std::_List_val<std::_List_simple_types<std::pair<const _Kty,_Ty>>>,std::_Iterator_base0>,std::pair<boo::D3D11GraphicsBufferD *,boo::D3D11GraphicsBufferD *> &&)' being compiled
  1120. 29> with
  1121. 29> [
  1122. 29> _Kty=boo::D3D11GraphicsBufferD *,
  1123. 29> _Ty=std::shared_ptr<boo::D3D11GraphicsBufferD>
  1124. 29> ] (compiling source file C:\Users\Alumno\Desktop\urde\urde\hecl\extern\boo\lib\graphicsdev\D3D11.cpp)
  1125. 29> C:\Program Files (x86)\Microsoft Visual Studio 14.0\VC\include\list(1034): note: see reference to function template instantiation 'void std::list<std::pair<const _Kty,_Ty>,std::allocator<std::pair<const _Kty,_Ty>>>::_Insert<std::pair<boo::D3D11GraphicsBufferD *,boo::D3D11GraphicsBufferD *>>(std::_List_unchecked_const_iterator<std::_List_val<std::_List_simple_types<std::pair<const _Kty,_Ty>>>,std::_Iterator_base0>,std::pair<boo::D3D11GraphicsBufferD *,boo::D3D11GraphicsBufferD *> &&)' being compiled
  1126. 29> with
  1127. 29> [
  1128. 29> _Kty=boo::D3D11GraphicsBufferD *,
  1129. 29> _Ty=std::shared_ptr<boo::D3D11GraphicsBufferD>
  1130. 29> ] (compiling source file C:\Users\Alumno\Desktop\urde\urde\hecl\extern\boo\lib\graphicsdev\D3D11.cpp)
  1131. 29> C:\Program Files (x86)\Microsoft Visual Studio 14.0\VC\include\xhash(270): note: see reference to function template instantiation 'void std::list<std::pair<const _Kty,_Ty>,std::allocator<std::pair<const _Kty,_Ty>>>::emplace_front<std::pair<boo::D3D11GraphicsBufferD *,boo::D3D11GraphicsBufferD *>>(std::pair<boo::D3D11GraphicsBufferD *,boo::D3D11GraphicsBufferD *> &&)' being compiled
  1132. 29> with
  1133. 29> [
  1134. 29> _Kty=boo::D3D11GraphicsBufferD *,
  1135. 29> _Ty=std::shared_ptr<boo::D3D11GraphicsBufferD>
  1136. 29> ] (compiling source file C:\Users\Alumno\Desktop\urde\urde\hecl\extern\boo\lib\graphicsdev\D3D11.cpp)
  1137. 29> C:\Program Files (x86)\Microsoft Visual Studio 14.0\VC\include\xhash(270): note: see reference to function template instantiation 'void std::list<std::pair<const _Kty,_Ty>,std::allocator<std::pair<const _Kty,_Ty>>>::emplace_front<std::pair<boo::D3D11GraphicsBufferD *,boo::D3D11GraphicsBufferD *>>(std::pair<boo::D3D11GraphicsBufferD *,boo::D3D11GraphicsBufferD *> &&)' being compiled
  1138. 29> with
  1139. 29> [
  1140. 29> _Kty=boo::D3D11GraphicsBufferD *,
  1141. 29> _Ty=std::shared_ptr<boo::D3D11GraphicsBufferD>
  1142. 29> ] (compiling source file C:\Users\Alumno\Desktop\urde\urde\hecl\extern\boo\lib\graphicsdev\D3D11.cpp)
  1143. 29> C:\Users\Alumno\Desktop\urde\urde\hecl\extern\boo\lib\graphicsdev\D3D11.cpp(1205): note: see reference to function template instantiation 'std::pair<std::_List_iterator<std::_List_val<std::_List_simple_types<std::pair<const _Kty,_Ty>>>>,bool> std::_Hash<std::_Umap_traits<_Kty,_Ty,std::_Uhash_compare<_Kty,_Hasher,_Keyeq>,_Alloc,false>>::emplace<std::pair<boo::D3D11GraphicsBufferD *,boo::D3D11GraphicsBufferD *>>(std::pair<boo::D3D11GraphicsBufferD *,boo::D3D11GraphicsBufferD *> &&)' being compiled
  1144. 29> with
  1145. 29> [
  1146. 29> _Kty=boo::D3D11GraphicsBufferD *,
  1147. 29> _Ty=std::shared_ptr<boo::D3D11GraphicsBufferD>,
  1148. 29> _Hasher=std::hash<boo::D3D11GraphicsBufferD *>,
  1149. 29> _Keyeq=std::equal_to<boo::D3D11GraphicsBufferD *>,
  1150. 29> _Alloc=std::allocator<std::pair<boo::D3D11GraphicsBufferD *const ,std::shared_ptr<boo::D3D11GraphicsBufferD>>>
  1151. 29> ]
  1152. 29> C:\Users\Alumno\Desktop\urde\urde\hecl\extern\boo\lib\graphicsdev\D3D11.cpp(1205): note: see reference to function template instantiation 'std::pair<std::_List_iterator<std::_List_val<std::_List_simple_types<std::pair<const _Kty,_Ty>>>>,bool> std::_Hash<std::_Umap_traits<_Kty,_Ty,std::_Uhash_compare<_Kty,_Hasher,_Keyeq>,_Alloc,false>>::emplace<std::pair<boo::D3D11GraphicsBufferD *,boo::D3D11GraphicsBufferD *>>(std::pair<boo::D3D11GraphicsBufferD *,boo::D3D11GraphicsBufferD *> &&)' being compiled
  1153. 29> with
  1154. 29> [
  1155. 29> _Kty=boo::D3D11GraphicsBufferD *,
  1156. 29> _Ty=std::shared_ptr<boo::D3D11GraphicsBufferD>,
  1157. 29> _Hasher=std::hash<boo::D3D11GraphicsBufferD *>,
  1158. 29> _Keyeq=std::equal_to<boo::D3D11GraphicsBufferD *>,
  1159. 29> _Alloc=std::allocator<std::pair<boo::D3D11GraphicsBufferD *const ,std::shared_ptr<boo::D3D11GraphicsBufferD>>>
  1160. 29> ]
  1161. 37> easy-ecc.vcxproj -> C:\Users\Alumno\Desktop\urde\urde-build\hecl\extern\athena\extern\easy-ecc\Debug\easy-ecc.lib
  1162. 38>------ Build started: Project: cardtest, Configuration: Debug x64 ------
  1163. 39>------ Build started: Project: soxr-lsr, Configuration: Debug x64 ------
  1164. 39> Building Custom Rule C:/Users/Alumno/Desktop/urde/urde/hecl/extern/boo/soxr/src/CMakeLists.txt
  1165. 39> CMake does not need to re-run because C:\Users\Alumno\Desktop\urde\urde-build\hecl\extern\boo\soxr\src\CMakeFiles\generate.stamp is up-to-date.
  1166. 39> lsr.c
  1167. 38> Building Custom Rule C:/Users/Alumno/Desktop/urde/urde/kabufuda/test/CMakeLists.txt
  1168. 38> CMake does not need to re-run because C:\Users\Alumno\Desktop\urde\urde-build\kabufuda\test\CMakeFiles\generate.stamp is up-to-date.
  1169. 38> main.cpp
  1170. 39> soxr-lsr.vcxproj -> C:\Users\Alumno\Desktop\urde\urde-build\hecl\extern\boo\soxr\src\Debug\soxr-lsr.lib
  1171. 40>------ Build started: Project: mpcksum, Configuration: Debug x64 ------
  1172. 40> Building Custom Rule C:/Users/Alumno/Desktop/urde/urde/mpcksum/CMakeLists.txt
  1173. 40> CMake does not need to re-run because C:\Users\Alumno\Desktop\urde\urde-build\mpcksum\CMakeFiles\generate.stamp is up-to-date.
  1174. 38>c:\users\alumno\desktop\urde\urde\kabufuda\include\kabufuda\Directory.hpp(22): warning C4624: 'kabufuda::Directory::<unnamed-tag>': destructor was implicitly defined as deleted because a base class destructor is inaccessible or deleted
  1175. 40> main.cpp
  1176. 38> cardtest.vcxproj -> C:\Users\Alumno\Desktop\urde\urde-build\kabufuda\test\Debug\cardtest.exe
  1177. 41>------ Build started: Project: packicons, Configuration: Debug x64 ------
  1178. 41> Building Custom Rule C:/Users/Alumno/Desktop/urde/urde/Editor/icons/CMakeLists.txt
  1179. 41> CMake does not need to re-run because C:\Users\Alumno\Desktop\urde\urde-build\Editor\icons\CMakeFiles\generate.stamp is up-to-date.
  1180. 41> packicons.c
  1181. 6> CHierarchyPoseBuilder.cpp
  1182. 40> mpcksum.vcxproj -> C:\Users\Alumno\Desktop\urde\urde-build\mpcksum\Debug\mpcksum.exe
  1183. 41> packicons.vcxproj -> C:\Users\Alumno\Desktop\urde\urde-build\Editor\icons\Debug\packicons.exe
  1184. 42>------ Build started: Project: nodtool, Configuration: Debug x64 ------
  1185. 43>------ Build started: Project: zeustest, Configuration: Debug x64 ------
  1186. 42> Building Custom Rule C:/Users/Alumno/Desktop/urde/urde/nod/driver/CMakeLists.txt
  1187. 42> CMake does not need to re-run because C:\Users\Alumno\Desktop\urde\urde-build\nod\driver\CMakeFiles\generate.stamp is up-to-date.
  1188. 42> main.cpp
  1189. 43> Building Custom Rule C:/Users/Alumno/Desktop/urde/urde/specter/zeus/test/CMakeLists.txt
  1190. 43> CMake does not need to re-run because C:\Users\Alumno\Desktop\urde\urde-build\specter\zeus\test\CMakeFiles\generate.stamp is up-to-date.
  1191. 43> main.cpp
  1192. 28> propagateNoContraction.cpp
  1193. 43> zeustest.vcxproj -> C:\Users\Alumno\Desktop\urde\urde-build\specter\zeus\test\Debug\zeustest.exe
  1194. 44>------ Build started: Project: athena-sakura, Configuration: Debug x64 ------
  1195. 44> Building Custom Rule C:/Users/Alumno/Desktop/urde/urde/hecl/extern/athena/CMakeLists.txt
  1196. 44> CMake does not need to re-run because C:\Users\Alumno\Desktop\urde\urde-build\hecl\extern\athena\CMakeFiles\generate.stamp is up-to-date.
  1197. 6> CPoseAsTransforms.cpp
  1198. 6> CSkinBank.cpp
  1199. 42> nodtool.vcxproj -> C:\Users\Alumno\Desktop\urde\urde-build\nod\driver\Debug\nodtool.exe
  1200. 6> CCharLayoutInfo.cpp
  1201. 44> Sprite.cpp
  1202. 44> SpriteFile.cpp
  1203. 44> SpriteFileReader.cpp
  1204. 44> SpriteFileWriter.cpp
  1205. 28> CodeGen.cpp
  1206. 44> SpriteFrame.cpp
  1207. 28> Link.cpp
  1208. 44> SpritePart.cpp
  1209. 45>------ Build started: Project: athena-wiisave, Configuration: Debug x64 ------
  1210. 44> athena-sakura.vcxproj -> C:\Users\Alumno\Desktop\urde\urde-build\hecl\extern\athena\Debug\athena-sakura.lib
  1211. 46>------ Build started: Project: athena-zelda, Configuration: Debug x64 ------
  1212. 45> Building Custom Rule C:/Users/Alumno/Desktop/urde/urde/hecl/extern/athena/CMakeLists.txt
  1213. 45> CMake does not need to re-run because C:\Users\Alumno\Desktop\urde\urde-build\hecl\extern\athena\CMakeFiles\generate.stamp is up-to-date.
  1214. 45> WiiBanner.cpp
  1215. 45> WiiFile.cpp
  1216. 45> WiiImage.cpp
  1217. 45> WiiSave.cpp
  1218. 46> Building Custom Rule C:/Users/Alumno/Desktop/urde/urde/hecl/extern/athena/CMakeLists.txt
  1219. 46> CMake does not need to re-run because C:\Users\Alumno\Desktop\urde\urde-build\hecl\extern\athena\CMakeFiles\generate.stamp is up-to-date.
  1220. 6> CSegIdList.cpp
  1221. 46> ALTTPFile.cpp
  1222. 46> ALTTPFileReader.cpp
  1223. 46> ALTTPFileWriter.cpp
  1224. 46> ALTTPQuest.cpp
  1225. 28> glslang.vcxproj -> C:\Users\Alumno\Desktop\urde\urde-build\hecl\extern\boo\glslang\glslang\Debug\glslang.lib
  1226. 47>------ Build started: Project: amuseconv, Configuration: Debug x64 ------
  1227. 47> Building Custom Rule C:/Users/Alumno/Desktop/urde/urde/amuse/CMakeLists.txt
  1228. 47> CMake does not need to re-run because C:\Users\Alumno\Desktop\urde\urde-build\amuse\CMakeFiles\generate.stamp is up-to-date.
  1229. 47> amuseconv.cpp
  1230. 6> CSegId.cpp
  1231. 6> CSkinRules.cpp
  1232. 46>C:\Users\Alumno\Desktop\urde\urde\hecl\extern\athena\src\athena\ALTTPFileWriter.cpp(60): warning C4805: '|=': unsafe mix of type 'atUint8' and type 'bool' in operation
  1233. 46>C:\Users\Alumno\Desktop\urde\urde\hecl\extern\athena\src\athena\ALTTPFileWriter.cpp(70): warning C4805: '|=': unsafe mix of type 'atUint8' and type 'bool' in operation
  1234. 46>C:\Users\Alumno\Desktop\urde\urde\hecl\extern\athena\src\athena\ALTTPFileWriter.cpp(129): warning C4805: '|=': unsafe mix of type 'atUint8' and type 'bool' in operation
  1235. 46>C:\Users\Alumno\Desktop\urde\urde\hecl\extern\athena\src\athena\ALTTPFileWriter.cpp(139): warning C4805: '|=': unsafe mix of type 'atUint8' and type 'bool' in operation
  1236. 46>C:\Users\Alumno\Desktop\urde\urde\hecl\extern\athena\src\athena\ALTTPFileWriter.cpp(153): warning C4805: '|=': unsafe mix of type 'atUint8' and type 'bool' in operation
  1237. 46>C:\Users\Alumno\Desktop\urde\urde\hecl\extern\athena\src\athena\ALTTPFileWriter.cpp(167): warning C4805: '|=': unsafe mix of type 'atUint8' and type 'bool' in operation
  1238. 46>C:\Users\Alumno\Desktop\urde\urde\hecl\extern\athena\src\athena\ALTTPFileWriter.cpp(177): warning C4805: '|=': unsafe mix of type 'atUint8' and type 'bool' in operation
  1239. 45> WiiSaveReader.cpp
  1240. 46> MCFile.cpp
  1241. 45> WiiSaveWriter.cpp
  1242. 45> md5.cpp
  1243. 45> sha1.cpp
  1244. 45> aes.cpp
  1245. 46> MCFileReader.cpp
  1246. 46> MCFileWriter.cpp
  1247. 46> MCSlot.cpp
  1248. 46> SkywardSwordFile.cpp
  1249. 46> SkywardSwordFileReader.cpp
  1250. 46> SkywardSwordFileWriter.cpp
  1251. 46> SkywardSwordQuest.cpp
  1252. 46> ZQuestFile.cpp
  1253. 6> CAnimCharacterSet.cpp
  1254. 45> athena-wiisave.vcxproj -> C:\Users\Alumno\Desktop\urde\urde-build\hecl\extern\athena\Debug\athena-wiisave.lib
  1255. 48>------ Build started: Project: amuseplay, Configuration: Debug x64 ------
  1256. 46> ZQuestFileReader.cpp
  1257. 48> Building Custom Rule C:/Users/Alumno/Desktop/urde/urde/amuse/CMakeLists.txt
  1258. 48> CMake does not need to re-run because C:\Users\Alumno\Desktop\urde\urde-build\amuse\CMakeFiles\generate.stamp is up-to-date.
  1259. 48> amuseplay.cpp
  1260. 6> CAnimationSet.cpp
  1261. 46> ZQuestFileWriter.cpp
  1262. 46> athena-zelda.vcxproj -> C:\Users\Alumno\Desktop\urde\urde-build\hecl\extern\athena\Debug\athena-zelda.lib
  1263. 49>------ Build started: Project: amuserender, Configuration: Debug x64 ------
  1264. 49> Building Custom Rule C:/Users/Alumno/Desktop/urde/urde/amuse/CMakeLists.txt
  1265. 6> CCharacterSet.cpp
  1266. 49> CMake does not need to re-run because C:\Users\Alumno\Desktop\urde\urde-build\amuse\CMakeFiles\generate.stamp is up-to-date.
  1267. 49> amuserender.cpp
  1268. 48>LINK : fatal error LNK1104: cannot open file '..\hecl\extern\boo\Debug\boo.lib'
  1269. 50>------ Build started: Project: glslangValidator, Configuration: Debug x64 ------
  1270. 49>C:\Program Files (x86)\Windows Kits\8.1\Include\um\DbgHelp.h(1544): warning C4091: 'typedef ': ignored on left of '' when no variable is declared
  1271. 49>C:\Program Files (x86)\Windows Kits\8.1\Include\um\DbgHelp.h(3190): warning C4091: 'typedef ': ignored on left of '' when no variable is declared
  1272. 47> amuseconv.vcxproj -> C:\Users\Alumno\Desktop\urde\urde-build\amuse\Debug\amuseconv.exe
  1273. 50> Building Custom Rule C:/Users/Alumno/Desktop/urde/urde/hecl/extern/boo/glslang/StandAlone/CMakeLists.txt
  1274. 50> CMake does not need to re-run because C:\Users\Alumno\Desktop\urde\urde-build\hecl\extern\boo\glslang\StandAlone\CMakeFiles\generate.stamp is up-to-date.
  1275. 50> StandAlone.cpp
  1276. 51>------ Build started: Project: hecl, Configuration: Debug x64 ------
  1277. 51> Building Custom Rule C:/Users/Alumno/Desktop/urde/urde/hecl/driver/CMakeLists.txt
  1278. 51> CMake does not need to re-run because C:\Users\Alumno\Desktop\urde\urde-build\hecl\driver\CMakeFiles\generate.stamp is up-to-date.
  1279. 51> main.cpp
  1280. 6> CCharacterInfo.cpp
  1281. 49>LINK : fatal error LNK1104: cannot open file '..\hecl\extern\boo\Debug\boo.lib'
  1282. 52>------ Build started: Project: heclTest, Configuration: Debug x64 ------
  1283. 52> Building Custom Rule C:/Users/Alumno/Desktop/urde/urde/hecl/test/CMakeLists.txt
  1284. 52> CMake does not need to re-run because C:\Users\Alumno\Desktop\urde\urde-build\hecl\test\CMakeFiles\generate.stamp is up-to-date.
  1285. 52> main.cpp
  1286. 6> CPASDatabase.cpp
  1287. 6> CPASAnimState.cpp
  1288. 6> CPASParmInfo.cpp
  1289. 50> glslangValidator.vcxproj -> C:\Users\Alumno\Desktop\urde\urde-build\hecl\extern\boo\glslang\StandAlone\Debug\glslangValidator.exe
  1290. 53>------ Build started: Project: spirv-remap, Configuration: Debug x64 ------
  1291. 52>LINK : fatal error LNK1104: cannot open file '..\lib\Debug\hecl-common.lib'
  1292. 51>LINK : fatal error LNK1104: cannot open file '..\..\DataSpec\Debug\RetroDataSpec.lib'
  1293. 54>------ Build started: Project: booTest, Configuration: Debug x64 ------
  1294. 53> Building Custom Rule C:/Users/Alumno/Desktop/urde/urde/hecl/extern/boo/glslang/StandAlone/CMakeLists.txt
  1295. 53> CMake does not need to re-run because C:\Users\Alumno\Desktop\urde\urde-build\hecl\extern\boo\glslang\StandAlone\CMakeFiles\generate.stamp is up-to-date.
  1296. 53> spirv-remap.cpp
  1297. 54> Building Custom Rule C:/Users/Alumno/Desktop/urde/urde/hecl/extern/boo/test/CMakeLists.txt
  1298. 54> CMake does not need to re-run because C:\Users\Alumno\Desktop\urde\urde-build\hecl\extern\boo\test\CMakeFiles\generate.stamp is up-to-date.
  1299. 6> CPASAnimInfo.cpp
  1300. 54> main.cpp
  1301. 6> CPASAnimParm.cpp
  1302. 53> spirv-remap.vcxproj -> C:\Users\Alumno\Desktop\urde\urde-build\hecl\extern\boo\glslang\StandAlone\Debug\spirv-remap.exe
  1303. 6> CPASAnimParmData.cpp
  1304. 6> CEffectComponent.cpp
  1305. 6> CAnimation.cpp
  1306. 54>LINK : fatal error LNK1104: cannot open file '..\Debug\boo.lib'
  1307. 6> CAnimationManager.cpp
  1308. 6> CTransition.cpp
  1309. 6> CTransitionManager.cpp
  1310. 6> CMetaAnimFactory.cpp
  1311. 6> CMetaAnimPlay.cpp
  1312. 6> CMetaAnimBlend.cpp
  1313. 6> CMetaAnimPhaseBlend.cpp
  1314. 6> CMetaAnimRandom.cpp
  1315. 6> CMetaAnimSequence.cpp
  1316. 6> CMetaTransFactory.cpp
  1317. 6> CMetaTransMetaAnim.cpp
  1318. 6> CMetaTransTrans.cpp
  1319. 6> CMetaTransPhaseTrans.cpp
  1320. 6> CMetaTransSnap.cpp
  1321. 6> CAnimTreeLoopIn.cpp
  1322. 6> CAnimTreeSequence.cpp
  1323. 6> CSequenceHelper.cpp
  1324. 6> CAnimTreeAnimReaderContainer.cpp
  1325. 6> CTreeUtils.cpp
  1326. 6> CAnimTreeBlend.cpp
  1327. 6> CAnimTreeNode.cpp
  1328. 6> CAnimTreeTimeScale.cpp
  1329. 6> CAnimTreeTransition.cpp
  1330. 6> CAnimTreeTweenBase.cpp
  1331. 6> CAnimTreeSingleChild.cpp
  1332. 6> CAnimTreeDoubleChild.cpp
  1333. 6> IAnimReader.cpp
  1334. 6> CPrimitive.cpp
  1335. 6> CHalfTransition.cpp
  1336. 6> CTimeScaleFunctions.cpp
  1337. 6> CParticleData.cpp
  1338. 6> CParticleDatabase.cpp
  1339. 6> CParticleGenInfo.cpp
  1340. 6> CAnimPOIData.cpp
  1341. 6> CPOINode.cpp
  1342. 6> CBoolPOINode.cpp
  1343. 6> CInt32POINode.cpp
  1344. 6> CSoundPOINode.cpp
  1345. 6> CParticlePOINode.cpp
  1346. 6> CAnimSourceReader.cpp
  1347. 6> CAnimSource.cpp
  1348. 6> CFBStreamedAnimReader.cpp
  1349. 6> CFBStreamedCompression.cpp
  1350. 6> CAllFormatsAnimSource.cpp
  1351. 6> CSegStatementSet.cpp
  1352. 6> CAdditiveAnimPlayback.cpp
  1353. 6> CActorLights.cpp
  1354. 6> CBodyState.cpp
  1355. 6> CBodyStateCmdMgr.cpp
  1356. 6> CBodyController.cpp
  1357. 6> CAreaOctTree.cpp
  1358. 6> CollisionUtil.cpp
  1359. 6> CGameCollision.cpp
  1360. 6> CCollisionResponseData.cpp
  1361. 6> CCollisionInfo.cpp
  1362. 6> CCollisionInfoList.cpp
  1363. 6> CCollisionEdge.cpp
  1364. 6> CCollisionSurface.cpp
  1365. 6> InternalColliders.cpp
  1366. 6> COBBTree.cpp
  1367. 6> CCollidableAABox.cpp
  1368. 6> CCollidableCollisionSurface.cpp
  1369. 6> CCollidableSphere.cpp
  1370. 6> CCollidableOBBTree.cpp
  1371. 6> CCollidableOBBTreeGroup.cpp
  1372. 6> CCollisionPrimitive.cpp
  1373. 6> CMaterialFilter.cpp
  1374. 6> CInternalRayCastStructure.cpp
  1375. 6> CRayCastResult.cpp
  1376. 6> IWeaponRenderer.cpp
  1377. 6> CBooRenderer.cpp
  1378. 6> CDrawable.cpp
  1379. 6> CDrawablePlaneObject.cpp
  1380. 6> CLineRenderer.cpp
  1381. 6> CMetroidModelInstance.cpp
  1382. 6> CLight.cpp
  1383. 6> CTextureBoo.cpp
  1384. 6> CModelBoo.cpp
  1385. 6> CSkinnedModel.cpp
  1386. 6> CVertexMorphEffect.cpp
  1387. 6> CMoviePlayer.cpp
  1388. 6>C:\Users\Alumno\Desktop\urde\urde\Runtime\Graphics\CTextureBoo.cpp(83): warning C4018: '<': signed/unsigned mismatch
  1389. 6>C:\Users\Alumno\Desktop\urde\urde\Runtime\Graphics\CTextureBoo.cpp(131): warning C4018: '<': signed/unsigned mismatch
  1390. 6>C:\Users\Alumno\Desktop\urde\urde\Runtime\Graphics\CTextureBoo.cpp(179): warning C4018: '<': signed/unsigned mismatch
  1391. 6>C:\Users\Alumno\Desktop\urde\urde\Runtime\Graphics\CTextureBoo.cpp(228): warning C4018: '<': signed/unsigned mismatch
  1392. 6>C:\Users\Alumno\Desktop\urde\urde\Runtime\Graphics\CTextureBoo.cpp(342): warning C4018: '<': signed/unsigned mismatch
  1393. 6>C:\Users\Alumno\Desktop\urde\urde\Runtime\Graphics\CTextureBoo.cpp(386): warning C4018: '<': signed/unsigned mismatch
  1394. 6>C:\Users\Alumno\Desktop\urde\urde\Runtime\Graphics\CTextureBoo.cpp(434): warning C4018: '<': signed/unsigned mismatch
  1395. 6>C:\Users\Alumno\Desktop\urde\urde\Runtime\Graphics\CTextureBoo.cpp(481): warning C4018: '<': signed/unsigned mismatch
  1396. 6>C:\Users\Alumno\Desktop\urde\urde\Runtime\Graphics\CTextureBoo.cpp(538): warning C4018: '<': signed/unsigned mismatch
  1397. 6>C:\Users\Alumno\Desktop\urde\urde\Runtime\Graphics\CTextureBoo.cpp(602): warning C4018: '<': signed/unsigned mismatch
  1398. 6>C:\Users\Alumno\Desktop\urde\urde\Runtime\Graphics\CMoviePlayer.cpp(331): warning C4018: '<': signed/unsigned mismatch
  1399. 6>C:\Users\Alumno\Desktop\urde\urde\Runtime\Graphics\CMoviePlayer.cpp(347): warning C4018: '<': signed/unsigned mismatch
  1400. 6>C:\Users\Alumno\Desktop\urde\urde\Runtime\Graphics\CMoviePlayer.cpp(375): warning C4018: '<': signed/unsigned mismatch
  1401. 6>C:\Users\Alumno\Desktop\urde\urde\Runtime\Graphics\CMoviePlayer.cpp(808): warning C4018: '<': signed/unsigned mismatch
  1402. 6> CGraphicsPalette.cpp
  1403. 6> CPVSVisSet.cpp
  1404. 6> CPVSVisOctree.cpp
  1405. 6> CPVSBounds.cpp
  1406. 6> CPVSAreaSet.cpp
  1407. 6> CGraphics.cpp
  1408. 6> CSimpleShadow.cpp
  1409. 6> CLineRendererShaders.cpp
  1410. 6> CLineRendererShadersGLSL.cpp
  1411. 6> CTexturedQuadFilter.cpp
  1412. 6> CTexturedQuadFilterGLSL.cpp
  1413. 6> CColoredQuadFilter.cpp
  1414. 6> CColoredQuadFilterGLSL.cpp
  1415. 6> CModelShaders.cpp
  1416. 6> CModelShadersGLSL.cpp
  1417. 6> CXrayOutlineFilter.cpp
  1418. 6> CXrayOutlineFilterGLSL.cpp
  1419. 6> CThermalColdFilter.cpp
  1420. 6> CThermalColdFilterGLSL.cpp
  1421. 6> CThermalHotFilter.cpp
  1422. 6> CThermalHotFilterGLSL.cpp
  1423. 6> CSpaceWarpFilter.cpp
  1424. 6> CSpaceWarpFilterGLSL.cpp
  1425. 6> CCameraBlurFilter.cpp
  1426. 6> CCameraBlurFilterGLSL.cpp
  1427. 6> CXRayBlurFilter.cpp
  1428. 6> CXRayBlurFilterGLSL.cpp
  1429. 6> CLineRendererShadersHLSL.cpp
  1430. 6> CTexturedQuadFilterHLSL.cpp
  1431. 6> CColoredQuadFilterHLSL.cpp
  1432. 6> CModelShadersHLSL.cpp
  1433. 6> CThermalColdFilterHLSL.cpp
  1434. 6> CThermalHotFilterHLSL.cpp
  1435. 6> CSpaceWarpFilterHLSL.cpp
  1436. 6> CCameraBlurFilterHLSL.cpp
  1437. 6> CXRayBlurFilterHLSL.cpp
  1438. 6> CSplashScreen.cpp
  1439. 6> CGuiObject.cpp
  1440. 6> CConsoleOutputWindow.cpp
  1441. 6> CAuiEnergyBarT01.cpp
  1442. 6> CAuiImagePane.cpp
  1443. 6> CAuiMeter.cpp
  1444. 6> CErrorOutputWindow.cpp
  1445. 6> CGuiCamera.cpp
  1446. 6> CGuiFrame.cpp
  1447. 6> CGuiLight.cpp
  1448. 6> CGuiModel.cpp
  1449. 6> CGuiSliderGroup.cpp
  1450. 6> CGuiStaticImage.cpp
  1451. 6>C:\Users\Alumno\Desktop\urde\urde\Runtime\GuiSys\CGuiModel.cpp(79): warning C4805: '|': unsafe mix of type 'int' and type 'const bool' in operation
  1452. 6>C:\Users\Alumno\Desktop\urde\urde\Runtime\GuiSys\CGuiModel.cpp(85): warning C4805: '|': unsafe mix of type 'int' and type 'const bool' in operation
  1453. 6>C:\Users\Alumno\Desktop\urde\urde\Runtime\GuiSys\CGuiModel.cpp(96): warning C4805: '|': unsafe mix of type 'int' and type 'const bool' in operation
  1454. 6> CGuiSys.cpp
  1455. 6> CGuiTableGroup.cpp
  1456. 6> CGuiTextPane.cpp
  1457. 6> CGuiTextSupport.cpp
  1458. 6> CGuiWidget.cpp
  1459. 6> CGuiWidgetDrawParms.cpp
  1460. 6> CGuiCompoundWidget.cpp
  1461. 6>C:\Users\Alumno\Desktop\urde\urde\Runtime\GuiSys\CGuiTextSupport.cpp(96): warning C4018: '<': signed/unsigned mismatch
  1462. 6> CSaveableState.cpp
  1463. 6> CDrawStringOptions.cpp
  1464. 6> CRasterFont.cpp
  1465. 6> CGuiGroup.cpp
  1466. 6> CGuiWidgetIdDB.cpp
  1467. 6> CGuiHeadWidget.cpp
  1468. 6> CGuiBackground.cpp
  1469. 6> CGuiPane.cpp
  1470. 6> CFontRenderState.cpp
  1471. 6> CTextExecuteBuffer.cpp
  1472. 6> CTextRenderBuffer.cpp
  1473. 6> CInstruction.cpp
  1474. 6> CTextParser.cpp
  1475. 6> CWordBreakTables.cpp
  1476. 6> CFontImageDef.cpp
  1477. 6> CStringTable.cpp
  1478. 6> ControlMapper.cpp
  1479. 6> CInputGenerator.cpp
  1480. 6>C:\Users\Alumno\Desktop\urde\urde\Runtime\GuiSys\CStringTable.cpp(75): warning C4018: '>=': signed/unsigned mismatch
  1481. 6> CFinalInput.cpp
  1482. 6> CRumbleManager.cpp
  1483. 6> CRumbleGenerator.cpp
  1484. 6> CRumbleVoice.cpp
  1485. 6> CRealElement.cpp
  1486. 6> CIntElement.cpp
  1487. 6> CVectorElement.cpp
  1488. 6> CModVectorElement.cpp
  1489. 6>C:\Users\Alumno\Desktop\urde\urde\Runtime\Particle\CRealElement.cpp(37): warning C4018: '>=': signed/unsigned mismatch
  1490. 6>C:\Users\Alumno\Desktop\urde\urde\Runtime\Particle\CIntElement.cpp(35): warning C4018: '>=': signed/unsigned mismatch
  1491. 6>C:\Users\Alumno\Desktop\urde\urde\Runtime\Particle\CVectorElement.cpp(36): warning C4018: '>=': signed/unsigned mismatch
  1492. 6> CColorElement.cpp
  1493. 6> CUVElement.cpp
  1494. 6> CEmitterElement.cpp
  1495. 6> CParticleDataFactory.cpp
  1496. 6> CSwooshDescription.cpp
  1497. 6> CElectricDescription.cpp
  1498. 6> CDecalDescription.cpp
  1499. 6> CWeaponDescription.cpp
  1500. 6> CDecalDataFactory.cpp
  1501. 6>C:\Users\Alumno\Desktop\urde\urde\Runtime\Particle\CColorElement.cpp(36): warning C4018: '>=': signed/unsigned mismatch
  1502. 6> CElementGen.cpp
  1503. 6> CParticleSwooshDataFactory.cpp
  1504. 6> CParticleSwoosh.cpp
  1505. 6> CParticleElectricDataFactory.cpp
  1506. 6>C:\Users\Alumno\Desktop\urde\urde\Runtime\Particle\CElementGen.cpp(543): warning C4018: '>=': signed/unsigned mismatch
  1507. 6>C:\Users\Alumno\Desktop\urde\urde\Runtime\Particle\CElementGen.cpp(605): warning C4018: '<': signed/unsigned mismatch
  1508. 6>C:\Users\Alumno\Desktop\urde\urde\Runtime\Particle\CElementGen.cpp(623): warning C4018: '<': signed/unsigned mismatch
  1509. 6>C:\Users\Alumno\Desktop\urde\urde\Runtime\Particle\CElementGen.cpp(836): warning C4018: '<': signed/unsigned mismatch
  1510. 6>C:\Users\Alumno\Desktop\urde\urde\Runtime\Particle\CElementGen.cpp(924): warning C4018: '<': signed/unsigned mismatch
  1511. 6>C:\Users\Alumno\Desktop\urde\urde\Runtime\Particle\CElementGen.cpp(925): warning C4018: '>=': signed/unsigned mismatch
  1512. 6>C:\Users\Alumno\Desktop\urde\urde\Runtime\Particle\CElementGen.cpp(937): warning C4018: '<': signed/unsigned mismatch
  1513. 6>C:\Users\Alumno\Desktop\urde\urde\Runtime\Particle\CElementGen.cpp(1001): warning C4018: '<=': signed/unsigned mismatch
  1514. 6>C:\Users\Alumno\Desktop\urde\urde\Runtime\Particle\CElementGen.cpp(1235): warning C4018: '<=': signed/unsigned mismatch
  1515. 6>C:\Users\Alumno\Desktop\urde\urde\Runtime\Particle\CElementGen.cpp(2242): warning C4018: '<': signed/unsigned mismatch
  1516. 6> CParticleElectric.cpp
  1517. 6> CParticleGen.cpp
  1518. 6> CProjectileWeaponDataFactory.cpp
  1519. 6> CDecal.cpp
  1520. 6> CDecalManager.cpp
  1521. 6>C:\Users\Alumno\Desktop\urde\urde\Runtime\Particle\CDecal.cpp(30): warning C4805: '&=': unsafe mix of type 'u32' and type 'bool' in operation
  1522. 6> CSpawnSystemKeyframeData.cpp
  1523. 6> CWarp.cpp
  1524. 6> CFlameWarp.cpp
  1525. 6> CParticleGlobals.cpp
  1526. 6> CElementGenShadersGLSL.cpp
  1527. 6> CElementGenShadersHLSL.cpp
  1528. 6> CWorld.cpp
  1529. 6> CWorldLight.cpp
  1530. 6> IGameArea.cpp
  1531. 6> CGameArea.cpp
  1532. 6> CPlayer.cpp
  1533. 6> CPlayerEnergyDrain.cpp
  1534. 6>C:\Users\Alumno\Desktop\urde\urde\Runtime\World\CGameArea.cpp(24): warning C4018: '<': signed/unsigned mismatch
  1535. 6>C:\Users\Alumno\Desktop\urde\urde\Runtime\World\CGameArea.cpp(29): warning C4018: '<': signed/unsigned mismatch
  1536. 6>C:\Users\Alumno\Desktop\urde\urde\Runtime\World\CGameArea.cpp(620): warning C4018: '<': signed/unsigned mismatch
  1537. 6>C:\Users\Alumno\Desktop\urde\urde\Runtime\World\CGameArea.cpp(630): warning C4018: '<': signed/unsigned mismatch
  1538. 6>C:\Users\Alumno\Desktop\urde\urde\Runtime\World\CGameArea.cpp(707): warning C4018: '<': signed/unsigned mismatch
  1539. 6>C:\Users\Alumno\Desktop\urde\urde\Runtime\World\CGameArea.cpp(902): warning C4018: '<': signed/unsigned mismatch
  1540. 6> CEnergyDrainSource.cpp
  1541. 6> CPlayerCameraBob.cpp
  1542. 6> CMorphBall.cpp
  1543. 6> CActor.cpp
  1544. 6> CAi.cpp
  1545. 6> CAiFuncMap.cpp
  1546. 6> CStateMachine.cpp
  1547. 6> CPatterned.cpp
  1548. 6> CPathFindArea.cpp
  1549. 6> CPathFindRegion.cpp
  1550. 6> CPathFindDraw.cpp
  1551. 6> CPathFindAreaOctree.cpp
  1552. 6> CPathFindOpenList.cpp
  1553. 6> CPathFindLink.cpp
  1554. 6> CPhysicsActor.cpp
  1555. 6> CEntity.cpp
  1556. 6> CWorldTransManager.cpp
  1557. 6> CEnvFxManager.cpp
  1558. 6> CActorModelParticles.cpp
  1559. 6> CTeamAiTypes.cpp
  1560. 6> ScriptObjectSupport.cpp
  1561. 6> ScriptLoader.cpp
  1562. 6> CScriptActor.cpp
  1563. 6> CScriptWaypoint.cpp
  1564. 6>C:\Users\Alumno\Desktop\urde\urde\Runtime\World\ScriptLoader.cpp(749): warning C4805: '|': unsafe mix of type 'bool' and type 'int' in operation
  1565. 6> CScriptDoor.cpp
  1566. 6> CScriptTrigger.cpp
  1567. 6> CScriptTimer.cpp
  1568. 6> CScriptCounter.cpp
  1569. 6> CScriptEffect.cpp
  1570. 6> CScriptPlatform.cpp
  1571. 6> CScriptSound.cpp
  1572. 6> CScriptGenerator.cpp
  1573. 6> CScriptDock.cpp
  1574. 6> CScriptActorKeyframe.cpp
  1575. 6> CScriptWater.cpp
  1576. 6> CScriptGrapplePoint.cpp
  1577. 6> CScriptPickupGenerator.cpp
  1578. 6> CScriptPointOfInterest.cpp
  1579. 6> CScriptAreaAttributes.cpp
  1580. 6> CScriptCameraWaypoint.cpp
  1581. 6> CScriptCoverPoint.cpp
  1582. 6> CScriptSpawnPoint.cpp
  1583. 6> CScriptCameraHint.cpp
  1584. 6> CScriptPickup.cpp
  1585. 6> CScriptMemoryRelay.cpp
  1586. 6> CScriptRandomRelay.cpp
  1587. 6> CScriptRelay.cpp
  1588. 6> CScriptHUDMemo.cpp
  1589. 6> CScriptCameraFilterKeyframe.cpp
  1590. 6> CScriptCameraBlurKeyframe.cpp
  1591. 6> CScriptDamageableTrigger.cpp
  1592. 6> CScriptDebris.cpp
  1593. 6> CScriptDistanceFog.cpp
  1594. 6> CScriptActorRotate.cpp
  1595. 6> CScriptSpecialFunction.cpp
  1596. 6> CScriptPlayerActor.cpp
  1597. 6> CScriptSwitch.cpp
  1598. 6> CScriptAiJumpPoint.cpp
  1599. 6> CScriptColorModulate.cpp
  1600. 6> CScriptCameraPitchVolume.cpp
  1601. 6> CScriptCameraHintTrigger.cpp
  1602. 6> CFluidUVMotion.cpp
  1603. 6> CPatternedInfo.cpp
  1604. 6> CHealthInfo.cpp
  1605. 6> CHUDMemoParms.cpp
  1606. 6> CWorldShadow.cpp
  1607. 6> CGameLight.cpp
  1608. 6> CFluidPlane.cpp
  1609. 6> CFluidPlaneCPU.cpp
  1610. 6> CFluidPlaneDoor.cpp
  1611. 6> CRippleManager.cpp
  1612. 6> CRipple.cpp
  1613. 6> CWeaponMgr.cpp
  1614. 6> CGunController.cpp
  1615. 6> CGunMotion.cpp
  1616. 6> CGrappleArm.cpp
  1617. 6> CWeaponMode.cpp
  1618. 6> CPlayerGun.cpp
  1619. 6> CGunWeapon.cpp
  1620. 6> CAuxWeapon.cpp
  1621. 6> CPowerBeam.cpp
  1622. 6> CIceBeam.cpp
  1623. 6> CWaveBeam.cpp
  1624. 6> CPlasmaBeam.cpp
  1625. 6> CPhazonBeam.cpp
  1626. 6> CGSFreeLook.cpp
  1627. 6> CGSComboFire.cpp
  1628. 6> CGSFidget.cpp
  1629. 6> CFidget.cpp
  1630. 6> CMemoryCardSys.cpp
  1631. 6> CScannableObjectInfo.cpp
  1632. 6> CSaveWorld.cpp
  1633. 6> IAllocator.cpp
  1634. 6> CGameAllocator.cpp
  1635. 6> CDependencyGroup.cpp
  1636. 6> CBasicsPC.cpp
  1637. 6> CIOWinManager.cpp
  1638. 6> CStateManager.cpp
  1639. 6> CFluidPlaneManager.cpp
  1640. 6> CGameState.cpp
  1641. 6> CScanDisplay.cpp
  1642. 6> CRelayTracker.cpp
  1643. 6> CPlayerState.cpp
  1644. 6> CRandom16.cpp
  1645. 6> CResFactory.cpp
  1646. 6> CResLoader.cpp
  1647. 6> CDvdFile.cpp
  1648. 6> CVirtualDvdFile.cpp
  1649. 6> CSimplePool.cpp
  1650. 6> CGameOptions.cpp
  1651. 6> CCRC32.cpp
  1652. 6> CObjectList.cpp
  1653. 6> GameObjectLists.cpp
  1654. 6> CSortedLists.cpp
  1655. 6> CArchitectureQueue.cpp
  1656. 6> CTimeProvider.cpp
  1657. 6> CToken.cpp
  1658. 6> CFactoryMgr.cpp
  1659. 6> CPakFile.cpp
  1660. 6> IOStreams.cpp
  1661. 6> CMainFlowBase.cpp
  1662. 6> CGameDebug.cpp
  1663. 6> CGameHintInfo.cpp
  1664. 6> rstl.cpp
  1665. 6> GameGlobalObjects.cpp
  1666. 6> CMemoryCardSysWin.cpp
  1667. 55>------ Build started: Project: urde, Configuration: Debug x64 ------
  1668. 55> Building Custom Rule C:/Users/Alumno/Desktop/urde/urde/Editor/CMakeLists.txt
  1669. 55> CMake does not need to re-run because C:\Users\Alumno\Desktop\urde\urde-build\Editor\CMakeFiles\generate.stamp is up-to-date.
  1670. 55> Generating DNA atdna_Space.cpp
  1671. 55>C:\Program Files (x86)\MSBuild\Microsoft.Cpp\v4.0\V140\Microsoft.CppCommon.targets(171,5): error MSB6006: "cmd.exe" exited with code -1073741515.
  1672. 56>------ Build started: Project: ALL_BUILD, Configuration: Debug x64 ------
  1673. 56> Building Custom Rule C:/Users/Alumno/Desktop/urde/urde/CMakeLists.txt
  1674. 56> CMake does not need to re-run because C:\Users\Alumno\Desktop\urde\urde-build\CMakeFiles\generate.stamp is up-to-date.
  1675. 57>------ Skipped Build: Project: INSTALL, Configuration: Debug x64 ------
  1676. 57>Project not selected to build for this solution configuration
  1677. 58>------ Skipped Build: Project: PACKAGE, Configuration: Debug x64 ------
  1678. 58>Project not selected to build for this solution configuration
  1679. ========== Build: 44 succeeded, 12 failed, 0 up-to-date, 2 skipped ==========
RAW Paste Data