Advertisement
Guest User

Untitled

a guest
Aug 11th, 2020
44
0
Never
Not a member of Pastebin yet? Sign Up, it unlocks many cool features!
text 145.86 KB | None | 0 0
  1.  
  2. Cliff@Cliff-PC MINGW64 ~/Desktop/project/openmrs-module-fhir2 (master)
  3. $ git status
  4. On branch master
  5. Your branch is ahead of 'origin/master' by 49 commits.
  6. (use "git push" to publish your local commits)
  7.  
  8. Untracked files:
  9. (use "git add <file>..." to include in what will be committed)
  10.  
  11. api-2.1/.factorypath
  12. api-2.2/.factorypath
  13. api/.factorypath
  14. integration-tests/.factorypath
  15. omod/.factorypath
  16.  
  17. nothing added to commit but untracked files present (use "git add" to track)
  18.  
  19. Cliff@Cliff-PC MINGW64 ~/Desktop/project/openmrs-module-fhir2 (master)
  20. $ git pull --rebase upstream master
  21. From https://github.com/openmrs/openmrs-module-fhir2
  22. * branch master -> FETCH_HEAD
  23. Already up to date.
  24. Current branch master is up to date.
  25.  
  26. Cliff@Cliff-PC MINGW64 ~/Desktop/project/openmrs-module-fhir2 (master)
  27. $ mvn clean install -U
  28. [INFO] Scanning for projects...
  29. [INFO] ------------------------------------------------------------------------
  30. [INFO] Reactor Build Order:
  31. [INFO]
  32. [INFO] FHIR2 [pom]
  33. [INFO] FHIR2 Test Data [jar]
  34. [INFO] FHIR2 API [jar]
  35. [INFO] FHIR2 API 2.1 [jar]
  36. [INFO] FHIR2 API 2.2 [jar]
  37. [INFO] FHIR2 OMOD [jar]
  38. [INFO] FHIR2 Integration Tests [jar]
  39. [INFO]
  40. [INFO] ----------------------< org.openmrs.module:fhir2 >----------------------
  41. [INFO] Building FHIR2 1.0.0-SNAPSHOT [1/7]
  42. [INFO] --------------------------------[ pom ]---------------------------------
  43. Downloading from openmrs-bintray-repo: https://dl.bintray.com/openmrs/maven/org/apache/maven/plugins/maven-compiler-plugin/maven-metadata.xml
  44. Downloading from openmrs-repo: http://mavenrepo.openmrs.org/nexus/content/repositories/public/org/apache/maven/plugins/maven-compiler-plugin/maven-metadata.xml
  45. Downloading from central: https://repo.maven.apache.org/maven2/org/apache/maven/plugins/maven-compiler-plugin/maven-metadata.xml
  46. Downloaded from central: https://repo.maven.apache.org/maven2/org/apache/maven/plugins/maven-compiler-plugin/maven-metadata.xml (1.0 kB at 465 B/s)
  47. Downloaded from openmrs-repo: http://mavenrepo.openmrs.org/nexus/content/repositories/public/org/apache/maven/plugins/maven-compiler-plugin/maven-metadata.xml (1.1 kB at 215 B/s)
  48. [INFO]
  49. [INFO] --- maven-clean-plugin:2.5:clean (default-clean) @ fhir2 ---
  50. [INFO]
  51. [INFO] --- maven-install-plugin:2.4:install (default-install) @ fhir2 ---
  52. [INFO] Installing C:\Users\Cliff\Desktop\project\openmrs-module-fhir2\pom.xml to C:\Users\Cliff\.m2\repository\org\openmrs\module\fhir2\1.0.0-SNAPSHOT\fhir2-1.0.0-SNAPSHOT.pom
  53. [INFO]
  54. [INFO] -----------------< org.openmrs.module:fhir2-test-data >-----------------
  55. [INFO] Building FHIR2 Test Data 1.0.0-SNAPSHOT [2/7]
  56. [INFO] --------------------------------[ jar ]---------------------------------
  57. [INFO]
  58. [INFO] --- maven-clean-plugin:2.5:clean (default-clean) @ fhir2-test-data ---
  59. [INFO] Deleting C:\Users\Cliff\Desktop\project\openmrs-module-fhir2\test-data\target
  60. [INFO]
  61. [INFO] --- maven-resources-plugin:2.6:resources (default-resources) @ fhir2-test-data ---
  62. [INFO] Using 'UTF-8' encoding to copy filtered resources.
  63. [INFO] skip non existing resourceDirectory C:\Users\Cliff\Desktop\project\openmrs-module-fhir2\test-data\src\main\resources
  64. [INFO] skip non existing resourceDirectory C:\Users\Cliff\Desktop\project\openmrs-module-fhir2\test-data\src\main\resources
  65. [INFO] skip non existing resourceDirectory C:\Users\Cliff\Desktop\project\openmrs-module-fhir2\test-data\src\main\webapp
  66. [INFO] skip non existing resourceDirectory C:\Users\Cliff\Desktop\project\openmrs-module-fhir2\test-data\src\main\webapp
  67. [INFO]
  68. [INFO] --- maven-compiler-plugin:3.1:compile (default-compile) @ fhir2-test-data ---
  69. [INFO] No sources to compile
  70. [INFO]
  71. [INFO] --- maven-resources-plugin:2.6:testResources (default-testResources) @ fhir2-test-data ---
  72. [INFO] Using 'UTF-8' encoding to copy filtered resources.
  73. [INFO] Copying 22 resources
  74. [INFO] Copying 79 resources
  75. [INFO]
  76. [INFO] --- maven-compiler-plugin:3.1:testCompile (default-testCompile) @ fhir2-test-data ---
  77. [INFO] No sources to compile
  78. [INFO]
  79. [INFO] --- maven-surefire-plugin:3.0.0-M4:test (default-test) @ fhir2-test-data ---
  80. [INFO]
  81. [INFO] --- maven-jar-plugin:3.2.0:jar (default-jar) @ fhir2-test-data ---
  82. [WARNING] JAR will be empty - no content was marked for inclusion!
  83. [INFO] Building jar: C:\Users\Cliff\Desktop\project\openmrs-module-fhir2\test-data\target\fhir2-test-data-1.0.0-SNAPSHOT.jar
  84. [INFO]
  85. [INFO] --- maven-jar-plugin:3.2.0:test-jar (default) @ fhir2-test-data ---
  86. [INFO] Building jar: C:\Users\Cliff\Desktop\project\openmrs-module-fhir2\test-data\target\fhir2-test-data-1.0.0-SNAPSHOT-tests.jar
  87. [INFO]
  88. [INFO] --- maven-install-plugin:2.4:install (default-install) @ fhir2-test-data ---
  89. [INFO] Installing C:\Users\Cliff\Desktop\project\openmrs-module-fhir2\test-data\target\fhir2-test-data-1.0.0-SNAPSHOT.jar to C:\Users\Cliff\.m2\repository\org\openmrs\module\fhir2-test-data\1.0.0-SNAPSHOT\fhir2-test-data-1.0.0-SNAPSHOT.jar
  90. [INFO] Installing C:\Users\Cliff\Desktop\project\openmrs-module-fhir2\test-data\pom.xml to C:\Users\Cliff\.m2\repository\org\openmrs\module\fhir2-test-data\1.0.0-SNAPSHOT\fhir2-test-data-1.0.0-SNAPSHOT.pom
  91. [INFO] Installing C:\Users\Cliff\Desktop\project\openmrs-module-fhir2\test-data\target\fhir2-test-data-1.0.0-SNAPSHOT-tests.jar to C:\Users\Cliff\.m2\repository\org\openmrs\module\fhir2-test-data\1.0.0-SNAPSHOT\fhir2-test-data-1.0.0-SNAPSHOT-tests.jar
  92. [INFO]
  93. [INFO] --------------------< org.openmrs.module:fhir2-api >--------------------
  94. [INFO] Building FHIR2 API 1.0.0-SNAPSHOT [3/7]
  95. [INFO] --------------------------------[ jar ]---------------------------------
  96. [INFO]
  97. [INFO] --- maven-clean-plugin:2.5:clean (default-clean) @ fhir2-api ---
  98. [INFO] Deleting C:\Users\Cliff\Desktop\project\openmrs-module-fhir2\api\target
  99. [INFO]
  100. [INFO] --- directory-maven-plugin:0.1:highest-basedir (directories) @ fhir2-api ---
  101. [INFO] Highest basedir set to: C:\Users\Cliff\Desktop\project\openmrs-module-fhir2
  102. [INFO]
  103. [INFO] --- license-maven-plugin:3.0:format (add-license) @ fhir2-api ---
  104. [INFO] Updating license headers...
  105. [INFO]
  106. [INFO] --- jacoco-maven-plugin:0.8.2:prepare-agent (default) @ fhir2-api ---
  107. [INFO] argLine set to -javaagent:C:\\Users\\Cliff\\.m2\\repository\\org\\jacoco\\org.jacoco.agent\\0.8.2\\org.jacoco.agent-0.8.2-runtime.jar=destfile=C:\\Users\\Cliff\\Desktop\\project\\openmrs-module-fhir2\\api\\target\\jacoco.exec
  108. [INFO]
  109. [INFO] --- formatter-maven-plugin:2.11.0:format (default) @ fhir2-api ---
  110. [INFO] Using 'UTF-8' encoding to format source files.
  111. [INFO] Number of files to be formatted: 389
  112. [INFO] Successfully formatted: 308 file(s)
  113. [INFO] Fail to format: 0 file(s)
  114. [INFO] Skipped: 81 file(s)
  115. [INFO] Read only skipped: 0 file(s)
  116. [INFO] Approximate time taken: 10s
  117. [INFO]
  118. [INFO] --- impsort-maven-plugin:1.3.2:sort (default) @ fhir2-api ---
  119. [INFO] Total Files Processed: 389 in 00:05.396
  120. [INFO] Already Sorted: 389
  121. [INFO] Needed Sorting: 0
  122. [INFO]
  123. [INFO] --- maven-resources-plugin:2.6:resources (default-resources) @ fhir2-api ---
  124. [INFO] Using 'UTF-8' encoding to copy filtered resources.
  125. [INFO] Copying 8 resources
  126. [INFO] Copying 0 resource
  127. [INFO] skip non existing resourceDirectory C:\Users\Cliff\Desktop\project\openmrs-module-fhir2\api\src\main\webapp
  128. [INFO] skip non existing resourceDirectory C:\Users\Cliff\Desktop\project\openmrs-module-fhir2\api\src\main\webapp
  129. [INFO]
  130. [INFO] --- maven-compiler-plugin:3.1:compile (default-compile) @ fhir2-api ---
  131. [INFO] Changes detected - recompiling the module!
  132. [INFO] Compiling 246 source files to C:\Users\Cliff\Desktop\project\openmrs-module-fhir2\api\target\classes
  133. [INFO]
  134. [INFO] --- maven-resources-plugin:2.6:testResources (default-testResources) @ fhir2-api ---
  135. [INFO] Using 'UTF-8' encoding to copy filtered resources.
  136. [INFO] Copying 1 resource
  137. [INFO] Copying 0 resource
  138. [INFO]
  139. [INFO] --- maven-compiler-plugin:3.1:testCompile (default-testCompile) @ fhir2-api ---
  140. [INFO] Changes detected - recompiling the module!
  141. [INFO] Compiling 143 source files to C:\Users\Cliff\Desktop\project\openmrs-module-fhir2\api\target\test-classes
  142. [INFO]
  143. [INFO] --- maven-surefire-plugin:3.0.0-M4:test (default-test) @ fhir2-api ---
  144. [INFO]
  145. [INFO] -------------------------------------------------------
  146. [INFO] T E S T S
  147. [INFO] -------------------------------------------------------
  148. [INFO] Running org.openmrs.module.fhir2.api.dao.impl.FhirAllergyIntoleranceDaoImplTest
  149. [INFO] Tests run: 4, Failures: 0, Errors: 0, Skipped: 0, Time elapsed: 38.581 s - in org.openmrs.module.fhir2.api.dao.impl.FhirAllergyIntoleranceDaoImplTest
  150. [INFO] Running org.openmrs.module.fhir2.api.dao.impl.FhirCohortListDaoImplTest
  151. [INFO] Tests run: 2, Failures: 0, Errors: 0, Skipped: 0, Time elapsed: 0.537 s - in org.openmrs.module.fhir2.api.dao.impl.FhirCohortListDaoImplTest
  152. [INFO] Running org.openmrs.module.fhir2.api.dao.impl.FhirConceptDaoImplTest
  153. [INFO] Tests run: 5, Failures: 0, Errors: 0, Skipped: 0, Time elapsed: 0.725 s - in org.openmrs.module.fhir2.api.dao.impl.FhirConceptDaoImplTest
  154. [INFO] Running org.openmrs.module.fhir2.api.dao.impl.FhirConceptSourceDaoImplTest
  155. [INFO] Tests run: 5, Failures: 0, Errors: 0, Skipped: 0, Time elapsed: 0.734 s - in org.openmrs.module.fhir2.api.dao.impl.FhirConceptSourceDaoImplTest
  156. [INFO] Running org.openmrs.module.fhir2.api.dao.impl.FhirDiagnosticReportDaoImplTest
  157. [INFO] Tests run: 5, Failures: 0, Errors: 0, Skipped: 0, Time elapsed: 0.567 s - in org.openmrs.module.fhir2.api.dao.impl.FhirDiagnosticReportDaoImplTest
  158. [INFO] Running org.openmrs.module.fhir2.api.dao.impl.FhirEncounterDaoImplTest
  159. [INFO] Tests run: 2, Failures: 0, Errors: 0, Skipped: 0, Time elapsed: 0.463 s - in org.openmrs.module.fhir2.api.dao.impl.FhirEncounterDaoImplTest
  160. [INFO] Running org.openmrs.module.fhir2.api.dao.impl.FhirGlobalPropertyDaoImplTest
  161. [INFO] Tests run: 6, Failures: 0, Errors: 0, Skipped: 0, Time elapsed: 0.607 s - in org.openmrs.module.fhir2.api.dao.impl.FhirGlobalPropertyDaoImplTest
  162. [INFO] Running org.openmrs.module.fhir2.api.dao.impl.FhirLocationDaoImplTest
  163. [INFO] Tests run: 3, Failures: 0, Errors: 0, Skipped: 0, Time elapsed: 0.35 s - in org.openmrs.module.fhir2.api.dao.impl.FhirLocationDaoImplTest
  164. [INFO] Running org.openmrs.module.fhir2.api.dao.impl.FhirMedicationDaoImplTest
  165. [INFO] Tests run: 6, Failures: 0, Errors: 0, Skipped: 0, Time elapsed: 0.521 s - in org.openmrs.module.fhir2.api.dao.impl.FhirMedicationDaoImplTest
  166. [INFO] Running org.openmrs.module.fhir2.api.dao.impl.FhirMedicationRequestDaoImplTest
  167. [INFO] Tests run: 3, Failures: 0, Errors: 0, Skipped: 0, Time elapsed: 0.764 s - in org.openmrs.module.fhir2.api.dao.impl.FhirMedicationRequestDaoImplTest
  168. [INFO] Running org.openmrs.module.fhir2.api.dao.impl.FhirObservationDaoImplTest
  169. [INFO] Tests run: 3, Failures: 0, Errors: 0, Skipped: 0, Time elapsed: 0.469 s - in org.openmrs.module.fhir2.api.dao.impl.FhirObservationDaoImplTest
  170. [INFO] Running org.openmrs.module.fhir2.api.dao.impl.FhirPatientDaoImplPatientIdentifierTest
  171. [INFO] Tests run: 8, Failures: 0, Errors: 0, Skipped: 0, Time elapsed: 0.614 s - in org.openmrs.module.fhir2.api.dao.impl.FhirPatientDaoImplPatientIdentifierTest
  172. [INFO] Running org.openmrs.module.fhir2.api.dao.impl.FhirPatientDaoImplTest
  173. [INFO] Tests run: 4, Failures: 0, Errors: 0, Skipped: 0, Time elapsed: 0.628 s - in org.openmrs.module.fhir2.api.dao.impl.FhirPatientDaoImplTest
  174. [INFO] Running org.openmrs.module.fhir2.api.dao.impl.FhirPersonDaoImplTest
  175. [INFO] Tests run: 3, Failures: 0, Errors: 0, Skipped: 0, Time elapsed: 0.232 s - in org.openmrs.module.fhir2.api.dao.impl.FhirPersonDaoImplTest
  176. [INFO] Running org.openmrs.module.fhir2.api.dao.impl.FhirPractitionerDaoImplTest
  177. [INFO] Tests run: 2, Failures: 0, Errors: 0, Skipped: 0, Time elapsed: 0.197 s - in org.openmrs.module.fhir2.api.dao.impl.FhirPractitionerDaoImplTest
  178. [INFO] Running org.openmrs.module.fhir2.api.dao.impl.FhirRelatedPersonDaoImplTest
  179. [INFO] Tests run: 2, Failures: 0, Errors: 0, Skipped: 0, Time elapsed: 0.134 s - in org.openmrs.module.fhir2.api.dao.impl.FhirRelatedPersonDaoImplTest
  180. [INFO] Running org.openmrs.module.fhir2.api.dao.impl.FhirServiceRequestDaoImplTest
  181. [INFO] Tests run: 3, Failures: 0, Errors: 0, Skipped: 0, Time elapsed: 0.255 s - in org.openmrs.module.fhir2.api.dao.impl.FhirServiceRequestDaoImplTest
  182. [INFO] Running org.openmrs.module.fhir2.api.dao.impl.FhirTaskDaoImplTest
  183. [INFO] Tests run: 10, Failures: 0, Errors: 0, Skipped: 0, Time elapsed: 1.077 s - in org.openmrs.module.fhir2.api.dao.impl.FhirTaskDaoImplTest
  184. [INFO] Running org.openmrs.module.fhir2.api.dao.impl.FhirUserDaoImplTest
  185. [INFO] Tests run: 1, Failures: 0, Errors: 0, Skipped: 0, Time elapsed: 0.171 s - in org.openmrs.module.fhir2.api.dao.impl.FhirUserDaoImplTest
  186. [INFO] Running org.openmrs.module.fhir2.api.impl.FhirAllergyIntoleranceServiceImplTest
  187. [INFO] Tests run: 14, Failures: 0, Errors: 0, Skipped: 0, Time elapsed: 1.123 s - in org.openmrs.module.fhir2.api.impl.FhirAllergyIntoleranceServiceImplTest
  188. [INFO] Running org.openmrs.module.fhir2.api.impl.FhirCohortListServiceImplTest
  189. [INFO] Tests run: 2, Failures: 0, Errors: 0, Skipped: 0, Time elapsed: 0.315 s - in org.openmrs.module.fhir2.api.impl.FhirCohortListServiceImplTest
  190. [INFO] Running org.openmrs.module.fhir2.api.impl.FhirConceptServiceImplTest
  191. [INFO] Tests run: 4, Failures: 0, Errors: 0, Skipped: 0, Time elapsed: 0.083 s - in org.openmrs.module.fhir2.api.impl.FhirConceptServiceImplTest
  192. [INFO] Running org.openmrs.module.fhir2.api.impl.FhirConceptSourceServiceImplTest
  193. [INFO] Tests run: 6, Failures: 0, Errors: 0, Skipped: 0, Time elapsed: 0.157 s - in org.openmrs.module.fhir2.api.impl.FhirConceptSourceServiceImplTest
  194. [INFO] Running org.openmrs.module.fhir2.api.impl.FhirConditionServiceImplTest
  195. [INFO] Tests run: 3, Failures: 0, Errors: 0, Skipped: 0, Time elapsed: 0.042 s - in org.openmrs.module.fhir2.api.impl.FhirConditionServiceImplTest
  196. [INFO] Running org.openmrs.module.fhir2.api.impl.FhirDiagnosticReportServiceImplTest
  197. [INFO] Tests run: 7, Failures: 0, Errors: 0, Skipped: 0, Time elapsed: 0.341 s - in org.openmrs.module.fhir2.api.impl.FhirDiagnosticReportServiceImplTest
  198. [INFO] Running org.openmrs.module.fhir2.api.impl.FhirEncounterServiceImplTest
  199. [INFO] Tests run: 7, Failures: 0, Errors: 0, Skipped: 0, Time elapsed: 0.193 s - in org.openmrs.module.fhir2.api.impl.FhirEncounterServiceImplTest
  200. [INFO] Running org.openmrs.module.fhir2.api.impl.FhirGlobalPropertyServiceImplTest
  201. [INFO] Tests run: 8, Failures: 0, Errors: 0, Skipped: 0, Time elapsed: 0.114 s - in org.openmrs.module.fhir2.api.impl.FhirGlobalPropertyServiceImplTest
  202. [INFO] Running org.openmrs.module.fhir2.api.impl.FhirLocationServiceImplTest
  203. [INFO] Tests run: 2, Failures: 0, Errors: 0, Skipped: 0, Time elapsed: 0.177 s - in org.openmrs.module.fhir2.api.impl.FhirLocationServiceImplTest
  204. [INFO] Running org.openmrs.module.fhir2.api.impl.FhirMedicationRequestServiceImplTest
  205. [INFO] Tests run: 9, Failures: 0, Errors: 0, Skipped: 0, Time elapsed: 0.096 s - in org.openmrs.module.fhir2.api.impl.FhirMedicationRequestServiceImplTest
  206. [INFO] Running org.openmrs.module.fhir2.api.impl.FhirMedicationServiceImplTest
  207. [INFO] Tests run: 13, Failures: 0, Errors: 0, Skipped: 0, Time elapsed: 0.118 s - in org.openmrs.module.fhir2.api.impl.FhirMedicationServiceImplTest
  208. [INFO] Running org.openmrs.module.fhir2.api.impl.FhirObservationServiceImplTest
  209. [INFO] Tests run: 2, Failures: 0, Errors: 0, Skipped: 0, Time elapsed: 0.164 s - in org.openmrs.module.fhir2.api.impl.FhirObservationServiceImplTest
  210. [INFO] Running org.openmrs.module.fhir2.api.impl.FhirPatientServiceImplTest
  211. [INFO] Tests run: 27, Failures: 0, Errors: 0, Skipped: 0, Time elapsed: 0.178 s - in org.openmrs.module.fhir2.api.impl.FhirPatientServiceImplTest
  212. [INFO] Running org.openmrs.module.fhir2.api.impl.FhirPersonServiceImplTest
  213. [INFO] Tests run: 19, Failures: 0, Errors: 0, Skipped: 0, Time elapsed: 0.212 s - in org.openmrs.module.fhir2.api.impl.FhirPersonServiceImplTest
  214. [INFO] Running org.openmrs.module.fhir2.api.impl.FhirPractitionerServiceImplTest
  215. [INFO] Tests run: 26, Failures: 0, Errors: 0, Skipped: 0, Time elapsed: 0.196 s - in org.openmrs.module.fhir2.api.impl.FhirPractitionerServiceImplTest
  216. [INFO] Running org.openmrs.module.fhir2.api.impl.FhirRelatedPersonServiceImplTest
  217. [INFO] Tests run: 21, Failures: 0, Errors: 0, Skipped: 0, Time elapsed: 0.224 s - in org.openmrs.module.fhir2.api.impl.FhirRelatedPersonServiceImplTest
  218. [INFO] Running org.openmrs.module.fhir2.api.impl.FhirServiceRequestServiceImplTest
  219. [INFO] Tests run: 8, Failures: 0, Errors: 0, Skipped: 0, Time elapsed: 0.09 s - in org.openmrs.module.fhir2.api.impl.FhirServiceRequestServiceImplTest
  220. [INFO] Running org.openmrs.module.fhir2.api.impl.FhirTaskServiceImplTest
  221. [INFO] Tests run: 7, Failures: 0, Errors: 0, Skipped: 0, Time elapsed: 0.128 s - in org.openmrs.module.fhir2.api.impl.FhirTaskServiceImplTest
  222. [INFO] Running org.openmrs.module.fhir2.api.impl.FhirUserDefaultPropertiesImplTest
  223. [INFO] Tests run: 2, Failures: 0, Errors: 0, Skipped: 0, Time elapsed: 0.002 s - in org.openmrs.module.fhir2.api.impl.FhirUserDefaultPropertiesImplTest
  224. [INFO] Running org.openmrs.module.fhir2.api.impl.FhirUserServiceImplTest
  225. [INFO] Tests run: 16, Failures: 0, Errors: 0, Skipped: 0, Time elapsed: 0.001 s - in org.openmrs.module.fhir2.api.impl.FhirUserServiceImplTest
  226. [INFO] Running org.openmrs.module.fhir2.api.search.AllergyIntoleranceSearchQueryTest
  227. [INFO] Tests run: 35, Failures: 0, Errors: 0, Skipped: 0, Time elapsed: 3.661 s - in org.openmrs.module.fhir2.api.search.AllergyIntoleranceSearchQueryTest
  228. [INFO] Running org.openmrs.module.fhir2.api.search.DiagnosticReportSearchQueryTest
  229. [INFO] Tests run: 38, Failures: 0, Errors: 0, Skipped: 0, Time elapsed: 2.609 s - in org.openmrs.module.fhir2.api.search.DiagnosticReportSearchQueryTest
  230. [INFO] Running org.openmrs.module.fhir2.api.search.EncounterSearchQueryTest
  231. [INFO] Tests run: 47, Failures: 0, Errors: 0, Skipped: 0, Time elapsed: 2.328 s - in org.openmrs.module.fhir2.api.search.EncounterSearchQueryTest
  232. [INFO] Running org.openmrs.module.fhir2.api.search.LocationSearchQueryTest
  233. [INFO] Tests run: 28, Failures: 0, Errors: 0, Skipped: 0, Time elapsed: 1.868 s - in org.openmrs.module.fhir2.api.search.LocationSearchQueryTest
  234. [INFO] Running org.openmrs.module.fhir2.api.search.MedicationRequestSearchQueryTest
  235. [INFO] Tests run: 42, Failures: 0, Errors: 0, Skipped: 0, Time elapsed: 4.708 s - in org.openmrs.module.fhir2.api.search.MedicationRequestSearchQueryTest
  236. [INFO] Running org.openmrs.module.fhir2.api.search.MedicationSearchQueryTest
  237. [INFO] Tests run: 12, Failures: 0, Errors: 0, Skipped: 0, Time elapsed: 0.49 s - in org.openmrs.module.fhir2.api.search.MedicationSearchQueryTest
  238. [INFO] Running org.openmrs.module.fhir2.api.search.ObservationSearchQueryTest
  239. [INFO] Tests run: 51, Failures: 0, Errors: 0, Skipped: 0, Time elapsed: 6.34 s - in org.openmrs.module.fhir2.api.search.ObservationSearchQueryTest
  240. [INFO] Running org.openmrs.module.fhir2.api.search.param.SearchParameterMapTest
  241. [INFO] Tests run: 9, Failures: 0, Errors: 0, Skipped: 0, Time elapsed: 0.053 s - in org.openmrs.module.fhir2.api.search.param.SearchParameterMapTest
  242. [INFO] Running org.openmrs.module.fhir2.api.search.PatientSearchQueryTest
  243. [INFO] Tests run: 36, Failures: 0, Errors: 0, Skipped: 0, Time elapsed: 2.608 s - in org.openmrs.module.fhir2.api.search.PatientSearchQueryTest
  244. [INFO] Running org.openmrs.module.fhir2.api.search.PersonSearchQueryTest
  245. [INFO] Tests run: 22, Failures: 0, Errors: 0, Skipped: 0, Time elapsed: 1.113 s - in org.openmrs.module.fhir2.api.search.PersonSearchQueryTest
  246. [INFO] Running org.openmrs.module.fhir2.api.search.PractitionerSearchQueryTest
  247. [INFO] Tests run: 26, Failures: 0, Errors: 0, Skipped: 0, Time elapsed: 1.261 s - in org.openmrs.module.fhir2.api.search.PractitionerSearchQueryTest
  248. [INFO] Running org.openmrs.module.fhir2.api.search.RelatedPersonSearchQueryTest
  249. [INFO] Tests run: 23, Failures: 0, Errors: 0, Skipped: 0, Time elapsed: 0.642 s - in org.openmrs.module.fhir2.api.search.RelatedPersonSearchQueryTest
  250. [INFO] Running org.openmrs.module.fhir2.api.search.SearchQueryBundleProviderTest
  251. [INFO] Tests run: 3, Failures: 0, Errors: 0, Skipped: 0, Time elapsed: 0.012 s - in org.openmrs.module.fhir2.api.search.SearchQueryBundleProviderTest
  252. [INFO] Running org.openmrs.module.fhir2.api.search.ServiceRequestSearchQueryTest
  253. [INFO] Tests run: 44, Failures: 0, Errors: 0, Skipped: 0, Time elapsed: 3.459 s - in org.openmrs.module.fhir2.api.search.ServiceRequestSearchQueryTest
  254. [INFO] Running org.openmrs.module.fhir2.api.search.TaskSearchQueryTest
  255. [INFO] Tests run: 18, Failures: 0, Errors: 0, Skipped: 0, Time elapsed: 0.749 s - in org.openmrs.module.fhir2.api.search.TaskSearchQueryTest
  256. [INFO] Running org.openmrs.module.fhir2.api.search.UserSearchQueryTest
  257. [INFO] Tests run: 25, Failures: 0, Errors: 0, Skipped: 0, Time elapsed: 0.577 s - in org.openmrs.module.fhir2.api.search.UserSearchQueryTest
  258. [INFO] Running org.openmrs.module.fhir2.api.translators.impl.AbstractProvenanceHandlingTranslatorTest
  259. [INFO] Tests run: 7, Failures: 0, Errors: 0, Skipped: 0, Time elapsed: 0.032 s - in org.openmrs.module.fhir2.api.translators.impl.AbstractProvenanceHandlingTranslatorTest
  260. [INFO] Running org.openmrs.module.fhir2.api.translators.impl.AllergyIntoleranceCategoryTranslatorImplTest
  261. [INFO] Tests run: 9, Failures: 0, Errors: 0, Skipped: 0, Time elapsed: 0.01 s - in org.openmrs.module.fhir2.api.translators.impl.AllergyIntoleranceCategoryTranslatorImplTest
  262. [INFO] Running org.openmrs.module.fhir2.api.translators.impl.AllergyIntoleranceCriticalityTranslatorImplTest
  263. [INFO] Tests run: 4, Failures: 0, Errors: 0, Skipped: 0, Time elapsed: 0.008 s - in org.openmrs.module.fhir2.api.translators.impl.AllergyIntoleranceCriticalityTranslatorImplTest
  264. [INFO] Running org.openmrs.module.fhir2.api.translators.impl.AllergyIntoleranceReactionComponentTranslatorImplTest
  265. [INFO] Tests run: 13, Failures: 0, Errors: 0, Skipped: 0, Time elapsed: 0.089 s - in org.openmrs.module.fhir2.api.translators.impl.AllergyIntoleranceReactionComponentTranslatorImplTest
  266. [INFO] Running org.openmrs.module.fhir2.api.translators.impl.AllergyIntoleranceSeverityTranslatorImplTest
  267. [INFO] Tests run: 8, Failures: 0, Errors: 0, Skipped: 0, Time elapsed: 0.04 s - in org.openmrs.module.fhir2.api.translators.impl.AllergyIntoleranceSeverityTranslatorImplTest
  268. [INFO] Running org.openmrs.module.fhir2.api.translators.impl.AllergyIntoleranceTranslatorImplTest
  269. [INFO] Tests run: 40, Failures: 0, Errors: 0, Skipped: 0, Time elapsed: 0.25 s - in org.openmrs.module.fhir2.api.translators.impl.AllergyIntoleranceTranslatorImplTest
  270. [INFO] Running org.openmrs.module.fhir2.api.translators.impl.BaseReferenceHandlingTranslatorTest
  271. [INFO] Tests run: 19, Failures: 0, Errors: 0, Skipped: 0, Time elapsed: 0.093 s - in org.openmrs.module.fhir2.api.translators.impl.BaseReferenceHandlingTranslatorTest
  272. [INFO] Running org.openmrs.module.fhir2.api.translators.impl.CohortListEntryTranslatorImplTest
  273. [INFO] Tests run: 2, Failures: 0, Errors: 0, Skipped: 0, Time elapsed: 0.003 s - in org.openmrs.module.fhir2.api.translators.impl.CohortListEntryTranslatorImplTest
  274. [INFO] Running org.openmrs.module.fhir2.api.translators.impl.ConceptTranslatorImplTest
  275. [INFO] Tests run: 12, Failures: 0, Errors: 0, Skipped: 0, Time elapsed: 0.849 s - in org.openmrs.module.fhir2.api.translators.impl.ConceptTranslatorImplTest
  276. [INFO] Running org.openmrs.module.fhir2.api.translators.impl.DiagnosticReportTranslatorImplTest
  277. [INFO] Tests run: 24, Failures: 0, Errors: 0, Skipped: 0, Time elapsed: 0.095 s - in org.openmrs.module.fhir2.api.translators.impl.DiagnosticReportTranslatorImplTest
  278. [INFO] Running org.openmrs.module.fhir2.api.translators.impl.DosageTranslatorImplTest
  279. [INFO] Tests run: 5, Failures: 0, Errors: 0, Skipped: 0, Time elapsed: 0.002 s - in org.openmrs.module.fhir2.api.translators.impl.DosageTranslatorImplTest
  280. [INFO] Running org.openmrs.module.fhir2.api.translators.impl.EncounterLocationTranslatorImplTest
  281. [INFO] Tests run: 4, Failures: 0, Errors: 0, Skipped: 0, Time elapsed: 0.054 s - in org.openmrs.module.fhir2.api.translators.impl.EncounterLocationTranslatorImplTest
  282. [INFO] Running org.openmrs.module.fhir2.api.translators.impl.EncounterParticipantTranslatorImplTest
  283. [INFO] Tests run: 5, Failures: 0, Errors: 0, Skipped: 0, Time elapsed: 0.002 s - in org.openmrs.module.fhir2.api.translators.impl.EncounterParticipantTranslatorImplTest
  284. [INFO] Running org.openmrs.module.fhir2.api.translators.impl.EncounterReferenceTranslatorImplTest
  285. [INFO] Tests run: 7, Failures: 0, Errors: 0, Skipped: 0, Time elapsed: 0.002 s - in org.openmrs.module.fhir2.api.translators.impl.EncounterReferenceTranslatorImplTest
  286. [INFO] Running org.openmrs.module.fhir2.api.translators.impl.EncounterTranslatorImplTest
  287. [INFO] Tests run: 16, Failures: 0, Errors: 0, Skipped: 0, Time elapsed: 0.048 s - in org.openmrs.module.fhir2.api.translators.impl.EncounterTranslatorImplTest
  288. [INFO] Running org.openmrs.module.fhir2.api.translators.impl.FhirTaskTranslatorImplTest
  289. [INFO] Tests run: 39, Failures: 0, Errors: 0, Skipped: 0, Time elapsed: 0.596 s - in org.openmrs.module.fhir2.api.translators.impl.FhirTaskTranslatorImplTest
  290. [INFO] Running org.openmrs.module.fhir2.api.translators.impl.GenderTranslatorImplTest
  291. [INFO] Tests run: 12, Failures: 0, Errors: 0, Skipped: 0, Time elapsed: 0.002 s - in org.openmrs.module.fhir2.api.translators.impl.GenderTranslatorImplTest
  292. [INFO] Running org.openmrs.module.fhir2.api.translators.impl.ListTranslatorImplTest
  293. [INFO] Tests run: 13, Failures: 0, Errors: 0, Skipped: 0, Time elapsed: 0.043 s - in org.openmrs.module.fhir2.api.translators.impl.ListTranslatorImplTest
  294. [INFO] Running org.openmrs.module.fhir2.api.translators.impl.LocationAddressTranslatorImplTest
  295. [INFO] Tests run: 26, Failures: 0, Errors: 0, Skipped: 0, Time elapsed: 0.015 s - in org.openmrs.module.fhir2.api.translators.impl.LocationAddressTranslatorImplTest
  296. [INFO] Running org.openmrs.module.fhir2.api.translators.impl.LocationTranslatorImplTest
  297. [INFO] Tests run: 29, Failures: 0, Errors: 0, Skipped: 0, Time elapsed: 0.047 s - in org.openmrs.module.fhir2.api.translators.impl.LocationTranslatorImplTest
  298. [INFO] Running org.openmrs.module.fhir2.api.translators.impl.MedicationReferenceTranslatorImplTest
  299. [INFO] Tests run: 6, Failures: 0, Errors: 0, Skipped: 0, Time elapsed: 0.004 s - in org.openmrs.module.fhir2.api.translators.impl.MedicationReferenceTranslatorImplTest
  300. [INFO] Running org.openmrs.module.fhir2.api.translators.impl.MedicationRequestPriorityTranslatorImplTest
  301. [INFO] Tests run: 8, Failures: 0, Errors: 0, Skipped: 0, Time elapsed: 0.01 s - in org.openmrs.module.fhir2.api.translators.impl.MedicationRequestPriorityTranslatorImplTest
  302. [INFO] Running org.openmrs.module.fhir2.api.translators.impl.MedicationRequestStatusTranslatorImplTest
  303. [INFO] Tests run: 2, Failures: 0, Errors: 0, Skipped: 0, Time elapsed: 0.008 s - in org.openmrs.module.fhir2.api.translators.impl.MedicationRequestStatusTranslatorImplTest
  304. [INFO] Running org.openmrs.module.fhir2.api.translators.impl.MedicationRequestTimingComponentTranslatorImplTest
  305. [INFO] Tests run: 7, Failures: 0, Errors: 0, Skipped: 0, Time elapsed: 0.012 s - in org.openmrs.module.fhir2.api.translators.impl.MedicationRequestTimingComponentTranslatorImplTest
  306. [INFO] Running org.openmrs.module.fhir2.api.translators.impl.MedicationRequestTimingTranslatorImplTest
  307. [INFO] Tests run: 3, Failures: 0, Errors: 0, Skipped: 0, Time elapsed: 0.019 s - in org.openmrs.module.fhir2.api.translators.impl.MedicationRequestTimingTranslatorImplTest
  308. [INFO] Running org.openmrs.module.fhir2.api.translators.impl.MedicationRequestTranslatorImplTest
  309. [INFO] Tests run: 20, Failures: 0, Errors: 0, Skipped: 0, Time elapsed: 0.072 s - in org.openmrs.module.fhir2.api.translators.impl.MedicationRequestTranslatorImplTest
  310. [INFO] Running org.openmrs.module.fhir2.api.translators.impl.MedicationTranslatorImplTest
  311. [INFO] Tests run: 23, Failures: 0, Errors: 0, Skipped: 0, Time elapsed: 0.003 s - in org.openmrs.module.fhir2.api.translators.impl.MedicationTranslatorImplTest
  312. [INFO] Running org.openmrs.module.fhir2.api.translators.impl.ObservationBasedOnReferenceTranslatorImplTest
  313. [INFO] Tests run: 10, Failures: 0, Errors: 0, Skipped: 0, Time elapsed: 0.003 s - in org.openmrs.module.fhir2.api.translators.impl.ObservationBasedOnReferenceTranslatorImplTest
  314. [INFO] Running org.openmrs.module.fhir2.api.translators.impl.ObservationComponentTranslatorImplTest
  315. [INFO] Tests run: 10, Failures: 0, Errors: 0, Skipped: 0, Time elapsed: 0.002 s - in org.openmrs.module.fhir2.api.translators.impl.ObservationComponentTranslatorImplTest
  316. [INFO] Running org.openmrs.module.fhir2.api.translators.impl.ObservationEffectiveDatetimeTranslatorImplTest
  317. [INFO] Tests run: 5, Failures: 0, Errors: 0, Skipped: 0, Time elapsed: 0.008 s - in org.openmrs.module.fhir2.api.translators.impl.ObservationEffectiveDatetimeTranslatorImplTest
  318. [INFO] Running org.openmrs.module.fhir2.api.translators.impl.ObservationInterpretationTranslatorImplTest
  319. [INFO] Tests run: 2, Failures: 0, Errors: 0, Skipped: 0, Time elapsed: 0.418 s - in org.openmrs.module.fhir2.api.translators.impl.ObservationInterpretationTranslatorImplTest
  320. [INFO] Running org.openmrs.module.fhir2.api.translators.impl.ObservationReferenceRangeTranslatorImplTest
  321. [INFO] Tests run: 6, Failures: 0, Errors: 0, Skipped: 0, Time elapsed: 0.003 s - in org.openmrs.module.fhir2.api.translators.impl.ObservationReferenceRangeTranslatorImplTest
  322. [INFO] Running org.openmrs.module.fhir2.api.translators.impl.ObservationReferenceTranslatorImplTest
  323. [INFO] Tests run: 6, Failures: 0, Errors: 0, Skipped: 0, Time elapsed: 0.002 s - in org.openmrs.module.fhir2.api.translators.impl.ObservationReferenceTranslatorImplTest
  324. [INFO] Running org.openmrs.module.fhir2.api.translators.impl.ObservationStatusTranslatorImplTest
  325. [INFO] Tests run: 2, Failures: 0, Errors: 0, Skipped: 0, Time elapsed: 0.002 s - in org.openmrs.module.fhir2.api.translators.impl.ObservationStatusTranslatorImplTest
  326. [INFO] Running org.openmrs.module.fhir2.api.translators.impl.ObservationTranslatorImplTest
  327. [INFO] Tests run: 24, Failures: 0, Errors: 0, Skipped: 0, Time elapsed: 0.003 s - in org.openmrs.module.fhir2.api.translators.impl.ObservationTranslatorImplTest
  328. [INFO] Running org.openmrs.module.fhir2.api.translators.impl.ObservationValueTranslatorImplTest
  329. [INFO] Tests run: 14, Failures: 0, Errors: 0, Skipped: 0, Time elapsed: 5.957 s - in org.openmrs.module.fhir2.api.translators.impl.ObservationValueTranslatorImplTest
  330. [INFO] Running org.openmrs.module.fhir2.api.translators.impl.PatientIdentifierTranslatorImplTest
  331. [INFO] Tests run: 8, Failures: 0, Errors: 0, Skipped: 0, Time elapsed: 0.003 s - in org.openmrs.module.fhir2.api.translators.impl.PatientIdentifierTranslatorImplTest
  332. [INFO] Running org.openmrs.module.fhir2.api.translators.impl.PatientReferenceTranslatorImplTest
  333. [INFO] Tests run: 7, Failures: 0, Errors: 0, Skipped: 0, Time elapsed: 0.002 s - in org.openmrs.module.fhir2.api.translators.impl.PatientReferenceTranslatorImplTest
  334. [INFO] Running org.openmrs.module.fhir2.api.translators.impl.PatientTranslatorImplTest
  335. [INFO] Tests run: 24, Failures: 0, Errors: 0, Skipped: 0, Time elapsed: 0.158 s - in org.openmrs.module.fhir2.api.translators.impl.PatientTranslatorImplTest
  336. [INFO] Running org.openmrs.module.fhir2.api.translators.impl.PersonAddressTranslatorImplTest
  337. [INFO] Tests run: 31, Failures: 0, Errors: 0, Skipped: 0, Time elapsed: 0.023 s - in org.openmrs.module.fhir2.api.translators.impl.PersonAddressTranslatorImplTest
  338. [INFO] Running org.openmrs.module.fhir2.api.translators.impl.PersonNameTranslatorImplTest
  339. [INFO] Tests run: 19, Failures: 0, Errors: 0, Skipped: 0, Time elapsed: 0.003 s - in org.openmrs.module.fhir2.api.translators.impl.PersonNameTranslatorImplTest
  340. [INFO] Running org.openmrs.module.fhir2.api.translators.impl.PersonTranslatorImplTest
  341. [INFO] Tests run: 20, Failures: 0, Errors: 0, Skipped: 0, Time elapsed: 0.22 s - in org.openmrs.module.fhir2.api.translators.impl.PersonTranslatorImplTest
  342. [INFO] Running org.openmrs.module.fhir2.api.translators.impl.PractitionerReferenceTranslatorProviderImplTest
  343. [INFO] Tests run: 5, Failures: 0, Errors: 0, Skipped: 0, Time elapsed: 0.011 s - in org.openmrs.module.fhir2.api.translators.impl.PractitionerReferenceTranslatorProviderImplTest
  344. [INFO] Running org.openmrs.module.fhir2.api.translators.impl.PractitionerReferenceTranslatorUserImplTest
  345. [INFO] Tests run: 5, Failures: 0, Errors: 0, Skipped: 0, Time elapsed: 0.01 s - in org.openmrs.module.fhir2.api.translators.impl.PractitionerReferenceTranslatorUserImplTest
  346. [INFO] Running org.openmrs.module.fhir2.api.translators.impl.PractitionerTranslatorProviderImplTest
  347. [INFO] Tests run: 12, Failures: 0, Errors: 0, Skipped: 0, Time elapsed: 0.095 s - in org.openmrs.module.fhir2.api.translators.impl.PractitionerTranslatorProviderImplTest
  348. [INFO] Running org.openmrs.module.fhir2.api.translators.impl.PractitionerTranslatorUserImplTest
  349. [INFO] Tests run: 10, Failures: 0, Errors: 0, Skipped: 0, Time elapsed: 0.002 s - in org.openmrs.module.fhir2.api.translators.impl.PractitionerTranslatorUserImplTest
  350. [INFO] Running org.openmrs.module.fhir2.api.translators.impl.ProvenanceTranslatorImplTest
  351. [INFO] Tests run: 28, Failures: 0, Errors: 0, Skipped: 0, Time elapsed: 0.003 s - in org.openmrs.module.fhir2.api.translators.impl.ProvenanceTranslatorImplTest
  352. [INFO] Running org.openmrs.module.fhir2.api.translators.impl.ReferenceTranslatorImplTest
  353. [INFO] Tests run: 6, Failures: 0, Errors: 0, Skipped: 0, Time elapsed: 0.002 s - in org.openmrs.module.fhir2.api.translators.impl.ReferenceTranslatorImplTest
  354. [INFO] Running org.openmrs.module.fhir2.api.translators.impl.RelatedPersonTranslatorImplTest
  355. [INFO] Tests run: 14, Failures: 0, Errors: 0, Skipped: 0, Time elapsed: 0.003 s - in org.openmrs.module.fhir2.api.translators.impl.RelatedPersonTranslatorImplTest
  356. [INFO] Running org.openmrs.module.fhir2.api.translators.impl.ServiceRequestTranslatorImplTest
  357. [INFO] Tests run: 18, Failures: 0, Errors: 0, Skipped: 0, Time elapsed: 0.03 s - in org.openmrs.module.fhir2.api.translators.impl.ServiceRequestTranslatorImplTest
  358. [INFO] Running org.openmrs.module.fhir2.api.translators.impl.TelecomTranslatorImplTest
  359. [INFO] Tests run: 26, Failures: 0, Errors: 0, Skipped: 0, Time elapsed: 0.216 s - in org.openmrs.module.fhir2.api.translators.impl.TelecomTranslatorImplTest
  360. [INFO] Running org.openmrs.module.fhir2.providers.r3.AllergyIntoleranceFhirR3ResourceProviderTest
  361. [INFO] Tests run: 24, Failures: 0, Errors: 0, Skipped: 0, Time elapsed: 1.733 s - in org.openmrs.module.fhir2.providers.r3.AllergyIntoleranceFhirR3ResourceProviderTest
  362. [INFO] Running org.openmrs.module.fhir2.providers.r3.ConditionFhirR3ResourceProviderTest
  363. [INFO] Tests run: 8, Failures: 0, Errors: 0, Skipped: 0, Time elapsed: 0.08 s - in org.openmrs.module.fhir2.providers.r3.ConditionFhirR3ResourceProviderTest
  364. [INFO] Running org.openmrs.module.fhir2.providers.r3.DiagnosticReportFhirResourceProviderTest
  365. [INFO] Tests run: 12, Failures: 0, Errors: 0, Skipped: 0, Time elapsed: 0.002 s - in org.openmrs.module.fhir2.providers.r3.DiagnosticReportFhirResourceProviderTest
  366. [INFO] Running org.openmrs.module.fhir2.providers.r3.EncounterFhirResourceProviderTest
  367. [INFO] Tests run: 14, Failures: 0, Errors: 0, Skipped: 0, Time elapsed: 0.05 s - in org.openmrs.module.fhir2.providers.r3.EncounterFhirResourceProviderTest
  368. [INFO] Running org.openmrs.module.fhir2.providers.r3.ListFhirResourceProviderTest
  369. [INFO] Tests run: 10, Failures: 0, Errors: 0, Skipped: 0, Time elapsed: 0.056 s - in org.openmrs.module.fhir2.providers.r3.ListFhirResourceProviderTest
  370. [INFO] Running org.openmrs.module.fhir2.providers.r3.LocationFhirResourceProviderTest
  371. [INFO] Tests run: 27, Failures: 0, Errors: 0, Skipped: 0, Time elapsed: 0.074 s - in org.openmrs.module.fhir2.providers.r3.LocationFhirResourceProviderTest
  372. [INFO] Running org.openmrs.module.fhir2.providers.r3.MedicationFhirResourceProviderTest
  373. [INFO] Tests run: 15, Failures: 0, Errors: 0, Skipped: 0, Time elapsed: 0.095 s - in org.openmrs.module.fhir2.providers.r3.MedicationFhirResourceProviderTest
  374. [INFO] Running org.openmrs.module.fhir2.providers.r3.MedicationRequestFhirResourceProviderTest
  375. [INFO] Tests run: 17, Failures: 0, Errors: 0, Skipped: 0, Time elapsed: 0.026 s - in org.openmrs.module.fhir2.providers.r3.MedicationRequestFhirResourceProviderTest
  376. [INFO] Running org.openmrs.module.fhir2.providers.r3.ObservationFhirResourceProviderTest
  377. [INFO] Tests run: 15, Failures: 0, Errors: 0, Skipped: 0, Time elapsed: 0.018 s - in org.openmrs.module.fhir2.providers.r3.ObservationFhirResourceProviderTest
  378. [INFO] Running org.openmrs.module.fhir2.providers.r3.PatientFhirResourceProviderTest
  379. [INFO] Tests run: 27, Failures: 0, Errors: 0, Skipped: 0, Time elapsed: 0.335 s - in org.openmrs.module.fhir2.providers.r3.PatientFhirResourceProviderTest
  380. [INFO] Running org.openmrs.module.fhir2.providers.r3.PersonFhirResourceProviderTest
  381. [INFO] Tests run: 22, Failures: 0, Errors: 0, Skipped: 0, Time elapsed: 0.052 s - in org.openmrs.module.fhir2.providers.r3.PersonFhirResourceProviderTest
  382. [INFO] Running org.openmrs.module.fhir2.providers.r3.PractitionerFhirResourceProviderTest
  383. [INFO] Tests run: 33, Failures: 0, Errors: 0, Skipped: 0, Time elapsed: 0.068 s - in org.openmrs.module.fhir2.providers.r3.PractitionerFhirResourceProviderTest
  384. [INFO] Running org.openmrs.module.fhir2.providers.r3.ProcedureRequestFhirResourceProviderTest
  385. [INFO] Tests run: 18, Failures: 0, Errors: 0, Skipped: 0, Time elapsed: 0.084 s - in org.openmrs.module.fhir2.providers.r3.ProcedureRequestFhirResourceProviderTest
  386. [INFO] Running org.openmrs.module.fhir2.providers.r3.RelatedPersonFhirResourceProviderTest
  387. [INFO] Tests run: 12, Failures: 0, Errors: 0, Skipped: 0, Time elapsed: 0.041 s - in org.openmrs.module.fhir2.providers.r3.RelatedPersonFhirResourceProviderTest
  388. [INFO] Running org.openmrs.module.fhir2.providers.r3.TaskFhirResourceProviderTest
  389. [INFO] Tests run: 14, Failures: 0, Errors: 0, Skipped: 0, Time elapsed: 0.051 s - in org.openmrs.module.fhir2.providers.r3.TaskFhirResourceProviderTest
  390. [INFO] Running org.openmrs.module.fhir2.providers.r4.AllergyIntoleranceFhirResourceProviderTest
  391. [INFO] Tests run: 24, Failures: 0, Errors: 0, Skipped: 0, Time elapsed: 0.054 s - in org.openmrs.module.fhir2.providers.r4.AllergyIntoleranceFhirResourceProviderTest
  392. [INFO] Running org.openmrs.module.fhir2.providers.r4.ConditionFhirResourceProviderTest
  393. [INFO] Tests run: 8, Failures: 0, Errors: 0, Skipped: 0, Time elapsed: 0.019 s - in org.openmrs.module.fhir2.providers.r4.ConditionFhirResourceProviderTest
  394. [INFO] Running org.openmrs.module.fhir2.providers.r4.DiagnosticReportFhirResourceProviderTest
  395. [INFO] Tests run: 12, Failures: 0, Errors: 0, Skipped: 0, Time elapsed: 0.028 s - in org.openmrs.module.fhir2.providers.r4.DiagnosticReportFhirResourceProviderTest
  396. [INFO] Running org.openmrs.module.fhir2.providers.r4.EncounterFhirResourceProviderTest
  397. [INFO] Tests run: 14, Failures: 0, Errors: 0, Skipped: 0, Time elapsed: 0.002 s - in org.openmrs.module.fhir2.providers.r4.EncounterFhirResourceProviderTest
  398. [INFO] Running org.openmrs.module.fhir2.providers.r4.ListFhirResourceProviderTest
  399. [INFO] Tests run: 10, Failures: 0, Errors: 0, Skipped: 0, Time elapsed: 0.006 s - in org.openmrs.module.fhir2.providers.r4.ListFhirResourceProviderTest
  400. [INFO] Running org.openmrs.module.fhir2.providers.r4.LocationFhirResourceProviderTest
  401. [INFO] Tests run: 27, Failures: 0, Errors: 0, Skipped: 0, Time elapsed: 0.003 s - in org.openmrs.module.fhir2.providers.r4.LocationFhirResourceProviderTest
  402. [INFO] Running org.openmrs.module.fhir2.providers.r4.MedicationFhirResourceProviderTest
  403. [INFO] Tests run: 15, Failures: 0, Errors: 0, Skipped: 0, Time elapsed: 0.003 s - in org.openmrs.module.fhir2.providers.r4.MedicationFhirResourceProviderTest
  404. [INFO] Running org.openmrs.module.fhir2.providers.r4.MedicationRequestFhirResourceProviderTest
  405. [INFO] Tests run: 17, Failures: 0, Errors: 0, Skipped: 0, Time elapsed: 0.003 s - in org.openmrs.module.fhir2.providers.r4.MedicationRequestFhirResourceProviderTest
  406. [INFO] Running org.openmrs.module.fhir2.providers.r4.ObservationFhirResourceProviderTest
  407. [INFO] Tests run: 15, Failures: 0, Errors: 0, Skipped: 0, Time elapsed: 0.16 s - in org.openmrs.module.fhir2.providers.r4.ObservationFhirResourceProviderTest
  408. [INFO] Running org.openmrs.module.fhir2.providers.r4.PatientFhirResourceProviderTest
  409. [INFO] Tests run: 27, Failures: 0, Errors: 0, Skipped: 0, Time elapsed: 0.003 s - in org.openmrs.module.fhir2.providers.r4.PatientFhirResourceProviderTest
  410. [INFO] Running org.openmrs.module.fhir2.providers.r4.PersonFhirResourceProviderTest
  411. [INFO] Tests run: 22, Failures: 0, Errors: 0, Skipped: 0, Time elapsed: 0.002 s - in org.openmrs.module.fhir2.providers.r4.PersonFhirResourceProviderTest
  412. [INFO] Running org.openmrs.module.fhir2.providers.r4.PractitionerFhirResourceProviderTest
  413. [INFO] Tests run: 33, Failures: 0, Errors: 0, Skipped: 0, Time elapsed: 0.003 s - in org.openmrs.module.fhir2.providers.r4.PractitionerFhirResourceProviderTest
  414. [INFO] Running org.openmrs.module.fhir2.providers.r4.RelatedPersonFhirResourceProviderTest
  415. [INFO] Tests run: 12, Failures: 0, Errors: 0, Skipped: 0, Time elapsed: 0.003 s - in org.openmrs.module.fhir2.providers.r4.RelatedPersonFhirResourceProviderTest
  416. [INFO] Running org.openmrs.module.fhir2.providers.r4.ServiceRequestFhirResourceProviderTest
  417. [INFO] Tests run: 18, Failures: 0, Errors: 0, Skipped: 0, Time elapsed: 0.002 s - in org.openmrs.module.fhir2.providers.r4.ServiceRequestFhirResourceProviderTest
  418. [INFO] Running org.openmrs.module.fhir2.providers.r4.TaskFhirResourceProviderTest
  419. [INFO] Tests run: 14, Failures: 0, Errors: 0, Skipped: 0, Time elapsed: 0.001 s - in org.openmrs.module.fhir2.providers.r4.TaskFhirResourceProviderTest
  420. [INFO]
  421. [INFO] Results:
  422. [INFO]
  423. [INFO] Tests run: 1950, Failures: 0, Errors: 0, Skipped: 0
  424. [INFO]
  425. [INFO]
  426. [INFO] --- jacoco-maven-plugin:0.8.2:report (report) @ fhir2-api ---
  427. [INFO] Loading execution data file C:\Users\Cliff\Desktop\project\openmrs-module-fhir2\api\target\jacoco.exec
  428. [INFO] Analyzed bundle 'FHIR2 API' with 157 classes
  429. [INFO]
  430. [INFO] --- maven-jar-plugin:3.2.0:jar (default-jar) @ fhir2-api ---
  431. [INFO] Building jar: C:\Users\Cliff\Desktop\project\openmrs-module-fhir2\api\target\fhir2-api-1.0.0-SNAPSHOT.jar
  432. [INFO]
  433. [INFO] --- maven-jar-plugin:3.2.0:test-jar (default) @ fhir2-api ---
  434. [INFO] Building jar: C:\Users\Cliff\Desktop\project\openmrs-module-fhir2\api\target\fhir2-api-1.0.0-SNAPSHOT-tests.jar
  435. [INFO]
  436. [INFO] --- maven-install-plugin:2.4:install (default-install) @ fhir2-api ---
  437. [INFO] Installing C:\Users\Cliff\Desktop\project\openmrs-module-fhir2\api\target\fhir2-api-1.0.0-SNAPSHOT.jar to C:\Users\Cliff\.m2\repository\org\openmrs\module\fhir2-api\1.0.0-SNAPSHOT\fhir2-api-1.0.0-SNAPSHOT.jar
  438. [INFO] Installing C:\Users\Cliff\Desktop\project\openmrs-module-fhir2\api\pom.xml to C:\Users\Cliff\.m2\repository\org\openmrs\module\fhir2-api\1.0.0-SNAPSHOT\fhir2-api-1.0.0-SNAPSHOT.pom
  439. [INFO] Installing C:\Users\Cliff\Desktop\project\openmrs-module-fhir2\api\target\fhir2-api-1.0.0-SNAPSHOT-tests.jar to C:\Users\Cliff\.m2\repository\org\openmrs\module\fhir2-api\1.0.0-SNAPSHOT\fhir2-api-1.0.0-SNAPSHOT-tests.jar
  440. [INFO]
  441. [INFO] ------------------< org.openmrs.module:fhir2-api-2.1 >------------------
  442. [INFO] Building FHIR2 API 2.1 1.0.0-SNAPSHOT [4/7]
  443. [INFO] --------------------------------[ jar ]---------------------------------
  444. [INFO]
  445. [INFO] --- maven-clean-plugin:2.5:clean (default-clean) @ fhir2-api-2.1 ---
  446. [INFO] Deleting C:\Users\Cliff\Desktop\project\openmrs-module-fhir2\api-2.1\target
  447. [INFO]
  448. [INFO] --- directory-maven-plugin:0.1:highest-basedir (directories) @ fhir2-api-2.1 ---
  449. [INFO] Highest basedir set to: C:\Users\Cliff\Desktop\project\openmrs-module-fhir2
  450. [INFO]
  451. [INFO] --- license-maven-plugin:3.0:format (add-license) @ fhir2-api-2.1 ---
  452. [INFO] Updating license headers...
  453. [INFO]
  454. [INFO] --- jacoco-maven-plugin:0.8.2:prepare-agent (default) @ fhir2-api-2.1 ---
  455. [INFO] argLine set to -javaagent:C:\\Users\\Cliff\\.m2\\repository\\org\\jacoco\\org.jacoco.agent\\0.8.2\\org.jacoco.agent-0.8.2-runtime.jar=destfile=C:\\Users\\Cliff\\Desktop\\project\\openmrs-module-fhir2\\api-2.1\\target\\jacoco.exec
  456. [INFO]
  457. [INFO] --- formatter-maven-plugin:2.11.0:format (default) @ fhir2-api-2.1 ---
  458. [INFO] Using 'UTF-8' encoding to format source files.
  459. [INFO] Number of files to be formatted: 6
  460. [INFO] Successfully formatted: 2 file(s)
  461. [INFO] Fail to format: 0 file(s)
  462. [INFO] Skipped: 4 file(s)
  463. [INFO] Read only skipped: 0 file(s)
  464. [INFO] Approximate time taken: 1s
  465. [INFO]
  466. [INFO] --- impsort-maven-plugin:1.3.2:sort (default) @ fhir2-api-2.1 ---
  467. [INFO] Total Files Processed: 6 in 00:00.072
  468. [INFO] Already Sorted: 6
  469. [INFO] Needed Sorting: 0
  470. [INFO]
  471. [INFO] --- maven-resources-plugin:2.6:resources (default-resources) @ fhir2-api-2.1 ---
  472. [INFO] Using 'UTF-8' encoding to copy filtered resources.
  473. [INFO] skip non existing resourceDirectory C:\Users\Cliff\Desktop\project\openmrs-module-fhir2\api-2.1\src\main\resources
  474. [INFO] skip non existing resourceDirectory C:\Users\Cliff\Desktop\project\openmrs-module-fhir2\api-2.1\src\main\resources
  475. [INFO] skip non existing resourceDirectory C:\Users\Cliff\Desktop\project\openmrs-module-fhir2\api-2.1\src\main\webapp
  476. [INFO] skip non existing resourceDirectory C:\Users\Cliff\Desktop\project\openmrs-module-fhir2\api-2.1\src\main\webapp
  477. [INFO]
  478. [INFO] --- maven-compiler-plugin:3.1:compile (default-compile) @ fhir2-api-2.1 ---
  479. [INFO] Changes detected - recompiling the module!
  480. [INFO] Compiling 3 source files to C:\Users\Cliff\Desktop\project\openmrs-module-fhir2\api-2.1\target\classes
  481. [INFO]
  482. [INFO] --- maven-resources-plugin:2.6:testResources (default-testResources) @ fhir2-api-2.1 ---
  483. [INFO] Using 'UTF-8' encoding to copy filtered resources.
  484. [INFO] skip non existing resourceDirectory C:\Users\Cliff\Desktop\project\openmrs-module-fhir2\api-2.1\src\test\resources
  485. [INFO] skip non existing resourceDirectory C:\Users\Cliff\Desktop\project\openmrs-module-fhir2\api-2.1\src\test\resources
  486. [INFO]
  487. [INFO] --- maven-compiler-plugin:3.1:testCompile (default-testCompile) @ fhir2-api-2.1 ---
  488. [INFO] Changes detected - recompiling the module!
  489. [INFO] Compiling 3 source files to C:\Users\Cliff\Desktop\project\openmrs-module-fhir2\api-2.1\target\test-classes
  490. [INFO]
  491. [INFO] --- maven-surefire-plugin:3.0.0-M4:test (default-test) @ fhir2-api-2.1 ---
  492. [INFO]
  493. [INFO] -------------------------------------------------------
  494. [INFO] T E S T S
  495. [INFO] -------------------------------------------------------
  496. [INFO] Running org.openmrs.module.fhir2.api.translators.impl.CohortListEntryTranslatorImpl_2_1Test
  497. [INFO] Tests run: 7, Failures: 0, Errors: 0, Skipped: 0, Time elapsed: 4.163 s - in org.openmrs.module.fhir2.api.translators.impl.CohortListEntryTranslatorImpl_2_1Test
  498. [INFO] Running org.openmrs.module.fhir2.api.translators.impl.ObservationInterpretationTranslatorImpl_2_1Test
  499. [INFO] Tests run: 36, Failures: 0, Errors: 0, Skipped: 0, Time elapsed: 0.137 s - in org.openmrs.module.fhir2.api.translators.impl.ObservationInterpretationTranslatorImpl_2_1Test
  500. [INFO] Running org.openmrs.module.fhir2.api.translators.impl.ObservationStatusTranslatorImpl_2_1Test
  501. [INFO] Tests run: 10, Failures: 0, Errors: 0, Skipped: 0, Time elapsed: 0.045 s - in org.openmrs.module.fhir2.api.translators.impl.ObservationStatusTranslatorImpl_2_1Test
  502. [INFO]
  503. [INFO] Results:
  504. [INFO]
  505. [INFO] Tests run: 53, Failures: 0, Errors: 0, Skipped: 0
  506. [INFO]
  507. [INFO]
  508. [INFO] --- jacoco-maven-plugin:0.8.2:report (report) @ fhir2-api-2.1 ---
  509. [INFO] Loading execution data file C:\Users\Cliff\Desktop\project\openmrs-module-fhir2\api-2.1\target\jacoco.exec
  510. [INFO] Analyzed bundle 'FHIR2 API 2.1' with 3 classes
  511. [INFO]
  512. [INFO] --- maven-jar-plugin:3.2.0:jar (default-jar) @ fhir2-api-2.1 ---
  513. [INFO] Building jar: C:\Users\Cliff\Desktop\project\openmrs-module-fhir2\api-2.1\target\fhir2-api-2.1-1.0.0-SNAPSHOT.jar
  514. [INFO]
  515. [INFO] --- maven-jar-plugin:3.2.0:test-jar (default) @ fhir2-api-2.1 ---
  516. [INFO] Building jar: C:\Users\Cliff\Desktop\project\openmrs-module-fhir2\api-2.1\target\fhir2-api-2.1-1.0.0-SNAPSHOT-tests.jar
  517. [INFO]
  518. [INFO] --- maven-install-plugin:2.4:install (default-install) @ fhir2-api-2.1 ---
  519. [INFO] Installing C:\Users\Cliff\Desktop\project\openmrs-module-fhir2\api-2.1\target\fhir2-api-2.1-1.0.0-SNAPSHOT.jar to C:\Users\Cliff\.m2\repository\org\openmrs\module\fhir2-api-2.1\1.0.0-SNAPSHOT\fhir2-api-2.1-1.0.0-SNAPSHOT.jar
  520. [INFO] Installing C:\Users\Cliff\Desktop\project\openmrs-module-fhir2\api-2.1\pom.xml to C:\Users\Cliff\.m2\repository\org\openmrs\module\fhir2-api-2.1\1.0.0-SNAPSHOT\fhir2-api-2.1-1.0.0-SNAPSHOT.pom
  521. [INFO] Installing C:\Users\Cliff\Desktop\project\openmrs-module-fhir2\api-2.1\target\fhir2-api-2.1-1.0.0-SNAPSHOT-tests.jar to C:\Users\Cliff\.m2\repository\org\openmrs\module\fhir2-api-2.1\1.0.0-SNAPSHOT\fhir2-api-2.1-1.0.0-SNAPSHOT-tests.jar
  522. [INFO]
  523. [INFO] ------------------< org.openmrs.module:fhir2-api-2.2 >------------------
  524. [INFO] Building FHIR2 API 2.2 1.0.0-SNAPSHOT [5/7]
  525. [INFO] --------------------------------[ jar ]---------------------------------
  526. [INFO]
  527. [INFO] --- maven-clean-plugin:2.5:clean (default-clean) @ fhir2-api-2.2 ---
  528. [INFO] Deleting C:\Users\Cliff\Desktop\project\openmrs-module-fhir2\api-2.2\target
  529. [INFO]
  530. [INFO] --- directory-maven-plugin:0.1:highest-basedir (directories) @ fhir2-api-2.2 ---
  531. [INFO] Highest basedir set to: C:\Users\Cliff\Desktop\project\openmrs-module-fhir2
  532. [INFO]
  533. [INFO] --- license-maven-plugin:3.0:format (add-license) @ fhir2-api-2.2 ---
  534. [INFO] Updating license headers...
  535. [INFO]
  536. [INFO] --- jacoco-maven-plugin:0.8.2:prepare-agent (default) @ fhir2-api-2.2 ---
  537. [INFO] argLine set to -javaagent:C:\\Users\\Cliff\\.m2\\repository\\org\\jacoco\\org.jacoco.agent\\0.8.2\\org.jacoco.agent-0.8.2-runtime.jar=destfile=C:\\Users\\Cliff\\Desktop\\project\\openmrs-module-fhir2\\api-2.2\\target\\jacoco.exec
  538. [INFO]
  539. [INFO] --- formatter-maven-plugin:2.11.0:format (default) @ fhir2-api-2.2 ---
  540. [INFO] Using 'UTF-8' encoding to format source files.
  541. [INFO] Number of files to be formatted: 13
  542. [INFO] Successfully formatted: 10 file(s)
  543. [INFO] Fail to format: 0 file(s)
  544. [INFO] Skipped: 3 file(s)
  545. [INFO] Read only skipped: 0 file(s)
  546. [INFO] Approximate time taken: 2s
  547. [INFO]
  548. [INFO] --- impsort-maven-plugin:1.3.2:sort (default) @ fhir2-api-2.2 ---
  549. [INFO] Total Files Processed: 13 in 00:00.141
  550. [INFO] Already Sorted: 13
  551. [INFO] Needed Sorting: 0
  552. [INFO]
  553. [INFO] --- maven-resources-plugin:2.6:resources (default-resources) @ fhir2-api-2.2 ---
  554. [INFO] Using 'UTF-8' encoding to copy filtered resources.
  555. [INFO] skip non existing resourceDirectory C:\Users\Cliff\Desktop\project\openmrs-module-fhir2\api-2.2\src\main\resources
  556. [INFO] skip non existing resourceDirectory C:\Users\Cliff\Desktop\project\openmrs-module-fhir2\api-2.2\src\main\resources
  557. [INFO] skip non existing resourceDirectory C:\Users\Cliff\Desktop\project\openmrs-module-fhir2\api-2.2\src\main\webapp
  558. [INFO] skip non existing resourceDirectory C:\Users\Cliff\Desktop\project\openmrs-module-fhir2\api-2.2\src\main\webapp
  559. [INFO]
  560. [INFO] --- maven-compiler-plugin:3.1:compile (default-compile) @ fhir2-api-2.2 ---
  561. [INFO] Changes detected - recompiling the module!
  562. [INFO] Compiling 5 source files to C:\Users\Cliff\Desktop\project\openmrs-module-fhir2\api-2.2\target\classes
  563. [INFO]
  564. [INFO] --- maven-resources-plugin:2.6:testResources (default-testResources) @ fhir2-api-2.2 ---
  565. [INFO] Using 'UTF-8' encoding to copy filtered resources.
  566. [INFO] skip non existing resourceDirectory C:\Users\Cliff\Desktop\project\openmrs-module-fhir2\api-2.2\src\test\resources
  567. [INFO] skip non existing resourceDirectory C:\Users\Cliff\Desktop\project\openmrs-module-fhir2\api-2.2\src\test\resources
  568. [INFO]
  569. [INFO] --- maven-compiler-plugin:3.1:testCompile (default-testCompile) @ fhir2-api-2.2 ---
  570. [INFO] Changes detected - recompiling the module!
  571. [INFO] Compiling 8 source files to C:\Users\Cliff\Desktop\project\openmrs-module-fhir2\api-2.2\target\test-classes
  572. [INFO]
  573. [INFO] --- maven-surefire-plugin:3.0.0-M4:test (default-test) @ fhir2-api-2.2 ---
  574. [INFO]
  575. [INFO] -------------------------------------------------------
  576. [INFO] T E S T S
  577. [INFO] -------------------------------------------------------
  578. [INFO] Running org.openmrs.module.fhir2.api.dao.impl.FhirConditionDaoImpl_2_2Test
  579. [INFO] Tests run: 5, Failures: 0, Errors: 0, Skipped: 0, Time elapsed: 41.642 s - in org.openmrs.module.fhir2.api.dao.impl.FhirConditionDaoImpl_2_2Test
  580. [INFO] Running org.openmrs.module.fhir2.api.impl.FhirConditionServiceImpl_2_2Test
  581. [INFO] Tests run: 4, Failures: 0, Errors: 0, Skipped: 0, Time elapsed: 0.447 s - in org.openmrs.module.fhir2.api.impl.FhirConditionServiceImpl_2_2Test
  582. [INFO] Running org.openmrs.module.fhir2.api.search.ConditionSearchQueryImpl_2_2Test
  583. [INFO] Tests run: 41, Failures: 0, Errors: 0, Skipped: 0, Time elapsed: 7.209 s - in org.openmrs.module.fhir2.api.search.ConditionSearchQueryImpl_2_2Test
  584. [INFO] Running org.openmrs.module.fhir2.api.translators.impl.ConditionClinicalStatusTranslatorImpl_2_2Test
  585. [INFO] Tests run: 5, Failures: 0, Errors: 0, Skipped: 0, Time elapsed: 0.001 s - in org.openmrs.module.fhir2.api.translators.impl.ConditionClinicalStatusTranslatorImpl_2_2Test
  586. [INFO] Running org.openmrs.module.fhir2.api.translators.impl.ConditionTranslatorImpl_2_2Test
  587. [INFO] Tests run: 19, Failures: 0, Errors: 0, Skipped: 0, Time elapsed: 0.001 s - in org.openmrs.module.fhir2.api.translators.impl.ConditionTranslatorImpl_2_2Test
  588. [INFO] Running org.openmrs.module.fhir2.api.translators.impl.ConditionVerificationStatusTranslatorImpl_2_2Test
  589. [INFO] Tests run: 7, Failures: 0, Errors: 0, Skipped: 0, Time elapsed: 0.001 s - in org.openmrs.module.fhir2.api.translators.impl.ConditionVerificationStatusTranslatorImpl_2_2Test
  590. [INFO]
  591. [INFO] Results:
  592. [INFO]
  593. [INFO] Tests run: 81, Failures: 0, Errors: 0, Skipped: 0
  594. [INFO]
  595. [INFO]
  596. [INFO] --- jacoco-maven-plugin:0.8.2:report (report) @ fhir2-api-2.2 ---
  597. [INFO] Loading execution data file C:\Users\Cliff\Desktop\project\openmrs-module-fhir2\api-2.2\target\jacoco.exec
  598. [INFO] Analyzed bundle 'FHIR2 API 2.2' with 5 classes
  599. [INFO]
  600. [INFO] --- maven-jar-plugin:3.2.0:jar (default-jar) @ fhir2-api-2.2 ---
  601. [INFO] Building jar: C:\Users\Cliff\Desktop\project\openmrs-module-fhir2\api-2.2\target\fhir2-api-2.2-1.0.0-SNAPSHOT.jar
  602. [INFO]
  603. [INFO] --- maven-jar-plugin:3.2.0:test-jar (default) @ fhir2-api-2.2 ---
  604. [INFO] Building jar: C:\Users\Cliff\Desktop\project\openmrs-module-fhir2\api-2.2\target\fhir2-api-2.2-1.0.0-SNAPSHOT-tests.jar
  605. [INFO]
  606. [INFO] --- maven-install-plugin:2.4:install (default-install) @ fhir2-api-2.2 ---
  607. [INFO] Installing C:\Users\Cliff\Desktop\project\openmrs-module-fhir2\api-2.2\target\fhir2-api-2.2-1.0.0-SNAPSHOT.jar to C:\Users\Cliff\.m2\repository\org\openmrs\module\fhir2-api-2.2\1.0.0-SNAPSHOT\fhir2-api-2.2-1.0.0-SNAPSHOT.jar
  608. [INFO] Installing C:\Users\Cliff\Desktop\project\openmrs-module-fhir2\api-2.2\pom.xml to C:\Users\Cliff\.m2\repository\org\openmrs\module\fhir2-api-2.2\1.0.0-SNAPSHOT\fhir2-api-2.2-1.0.0-SNAPSHOT.pom
  609. [INFO] Installing C:\Users\Cliff\Desktop\project\openmrs-module-fhir2\api-2.2\target\fhir2-api-2.2-1.0.0-SNAPSHOT-tests.jar to C:\Users\Cliff\.m2\repository\org\openmrs\module\fhir2-api-2.2\1.0.0-SNAPSHOT\fhir2-api-2.2-1.0.0-SNAPSHOT-tests.jar
  610. [INFO]
  611. [INFO] -------------------< org.openmrs.module:fhir2-omod >--------------------
  612. [INFO] Building FHIR2 OMOD 1.0.0-SNAPSHOT [6/7]
  613. [INFO] --------------------------------[ jar ]---------------------------------
  614. [INFO]
  615. [INFO] --- maven-clean-plugin:2.5:clean (default-clean) @ fhir2-omod ---
  616. [INFO] Deleting C:\Users\Cliff\Desktop\project\openmrs-module-fhir2\omod\target
  617. [INFO]
  618. [INFO] --- directory-maven-plugin:0.1:highest-basedir (directories) @ fhir2-omod ---
  619. [INFO] Highest basedir set to: C:\Users\Cliff\Desktop\project\openmrs-module-fhir2
  620. [INFO]
  621. [INFO] --- license-maven-plugin:3.0:format (add-license) @ fhir2-omod ---
  622. [INFO] Updating license headers...
  623. [INFO]
  624. [INFO] --- jacoco-maven-plugin:0.8.2:prepare-agent (default) @ fhir2-omod ---
  625. [INFO] argLine set to -javaagent:C:\\Users\\Cliff\\.m2\\repository\\org\\jacoco\\org.jacoco.agent\\0.8.2\\org.jacoco.agent-0.8.2-runtime.jar=destfile=C:\\Users\\Cliff\\Desktop\\project\\openmrs-module-fhir2\\omod\\target\\jacoco.exec
  626. [INFO]
  627. [INFO] --- formatter-maven-plugin:2.11.0:format (default) @ fhir2-omod ---
  628. [INFO] Using 'UTF-8' encoding to format source files.
  629. [INFO] Number of files to be formatted: 61
  630. [INFO] Successfully formatted: 61 file(s)
  631. [INFO] Fail to format: 0 file(s)
  632. [INFO] Skipped: 0 file(s)
  633. [INFO] Read only skipped: 0 file(s)
  634. [INFO] Approximate time taken: 3s
  635. [INFO]
  636. [INFO] --- impsort-maven-plugin:1.3.2:sort (default) @ fhir2-omod ---
  637. [INFO] Total Files Processed: 61 in 00:02.319
  638. [INFO] Already Sorted: 61
  639. [INFO] Needed Sorting: 0
  640. [INFO]
  641. [INFO] --- maven-dependency-plugin:2.8:unpack-dependencies (Expand resources) @ fhir2-omod ---
  642. [INFO] Unpacking C:\Users\Cliff\Desktop\project\openmrs-module-fhir2\api\target\fhir2-api-1.0.0-SNAPSHOT.jar to C:\Users\Cliff\Desktop\project\openmrs-module-fhir2\omod\target\classes with includes "*.xml,*.properties" and excludes ""
  643. [INFO]
  644. [INFO] --- maven-resources-plugin:2.6:resources (default-resources) @ fhir2-omod ---
  645. [INFO] Using 'UTF-8' encoding to copy filtered resources.
  646. [INFO] Copying 3 resources
  647. [INFO] Copying 21 resources
  648. [INFO] skip non existing resourceDirectory C:\Users\Cliff\Desktop\project\openmrs-module-fhir2\omod\src\main\webapp
  649. [INFO] skip non existing resourceDirectory C:\Users\Cliff\Desktop\project\openmrs-module-fhir2\omod\src\main\webapp
  650. [INFO]
  651. [INFO] --- maven-compiler-plugin:3.1:compile (default-compile) @ fhir2-omod ---
  652. [INFO] Changes detected - recompiling the module!
  653. [INFO] Compiling 10 source files to C:\Users\Cliff\Desktop\project\openmrs-module-fhir2\omod\target\classes
  654. [INFO]
  655. [INFO] --- maven-resources-plugin:2.6:testResources (default-testResources) @ fhir2-omod ---
  656. [INFO] Using 'UTF-8' encoding to copy filtered resources.
  657. [INFO] Copying 2 resources
  658. [INFO] Copying 1 resource
  659. [INFO]
  660. [INFO] --- maven-compiler-plugin:3.1:testCompile (default-testCompile) @ fhir2-omod ---
  661. [INFO] Changes detected - recompiling the module!
  662. [INFO] Compiling 51 source files to C:\Users\Cliff\Desktop\project\openmrs-module-fhir2\omod\target\test-classes
  663. [INFO]
  664. [INFO] --- maven-surefire-plugin:3.0.0-M4:test (default-test) @ fhir2-omod ---
  665. [INFO]
  666. [INFO] -------------------------------------------------------
  667. [INFO] T E S T S
  668. [INFO] -------------------------------------------------------
  669. [INFO] Running org.openmrs.module.fhir2.narrative.AllergyIntoleranceNarrativeTest
  670. [INFO] Tests run: 1, Failures: 0, Errors: 0, Skipped: 0, Time elapsed: 11.467 s - in org.openmrs.module.fhir2.narrative.AllergyIntoleranceNarrativeTest
  671. [INFO] Running org.openmrs.module.fhir2.narrative.ConditionNarrativeTest
  672. [INFO] Tests run: 1, Failures: 0, Errors: 0, Skipped: 0, Time elapsed: 1.113 s - in org.openmrs.module.fhir2.narrative.ConditionNarrativeTest
  673. [INFO] Running org.openmrs.module.fhir2.narrative.EncounterNarrativeTest
  674. [INFO] Tests run: 1, Failures: 0, Errors: 0, Skipped: 0, Time elapsed: 0.811 s - in org.openmrs.module.fhir2.narrative.EncounterNarrativeTest
  675. [INFO] Running org.openmrs.module.fhir2.narrative.LocationNarrativeTest
  676. [INFO] Tests run: 1, Failures: 0, Errors: 0, Skipped: 0, Time elapsed: 0.306 s - in org.openmrs.module.fhir2.narrative.LocationNarrativeTest
  677. [INFO] Running org.openmrs.module.fhir2.narrative.MedicationRequestNarrativeTest
  678. [INFO] Tests run: 1, Failures: 0, Errors: 0, Skipped: 0, Time elapsed: 0.918 s - in org.openmrs.module.fhir2.narrative.MedicationRequestNarrativeTest
  679. [INFO] Running org.openmrs.module.fhir2.narrative.NarrativeGeneratorTest
  680. [ERROR] Tests run: 6, Failures: 1, Errors: 0, Skipped: 0, Time elapsed: 0.127 s <<< FAILURE! - in org.openmrs.module.fhir2.narrative.NarrativeGeneratorTest
  681. [ERROR] org.openmrs.module.fhir2.narrative.NarrativeGeneratorTest.shouldMapValuesFromPropertiesFileToTemplate Time elapsed: 0.025 s <<< FAILURE!
  682. org.junit.ComparisonFailure:
  683. ]xpected:<...rrativeContent</div>[
  684. > but was:<...rrativeContent</div>[]
  685. >
  686. at org.openmrs.module.fhir2.narrative.NarrativeGeneratorTest.shouldMapValuesFromPropertiesFileToTemplate(NarrativeGeneratorTest.java:109)
  687.  
  688. [INFO] Running org.openmrs.module.fhir2.narrative.ObservationNarrativeTest
  689. [INFO] Tests run: 1, Failures: 0, Errors: 0, Skipped: 0, Time elapsed: 0.441 s - in org.openmrs.module.fhir2.narrative.ObservationNarrativeTest
  690. [INFO] Running org.openmrs.module.fhir2.narrative.PersonNarrativeTest
  691. [INFO] Tests run: 1, Failures: 0, Errors: 0, Skipped: 0, Time elapsed: 0.326 s - in org.openmrs.module.fhir2.narrative.PersonNarrativeTest
  692. [INFO] Running org.openmrs.module.fhir2.narrative.PractitionerNarrativeTest
  693. [INFO] Tests run: 1, Failures: 0, Errors: 0, Skipped: 0, Time elapsed: 0.277 s - in org.openmrs.module.fhir2.narrative.PractitionerNarrativeTest
  694. [INFO] Running org.openmrs.module.fhir2.narrative.PractitionerRoleNarrativeTest
  695. [INFO] Tests run: 1, Failures: 0, Errors: 0, Skipped: 0, Time elapsed: 0.221 s - in org.openmrs.module.fhir2.narrative.PractitionerRoleNarrativeTest
  696. [INFO] Running org.openmrs.module.fhir2.narrative.RelatedPersonNarrativeTest
  697. [INFO] Tests run: 1, Failures: 0, Errors: 0, Skipped: 0, Time elapsed: 0.156 s - in org.openmrs.module.fhir2.narrative.RelatedPersonNarrativeTest
  698. [INFO] Running org.openmrs.module.fhir2.narrative.ServiceRequestNarrativeTest
  699. [INFO] Tests run: 1, Failures: 0, Errors: 0, Skipped: 0, Time elapsed: 0.534 s - in org.openmrs.module.fhir2.narrative.ServiceRequestNarrativeTest
  700. [INFO] Running org.openmrs.module.fhir2.narrative.TaskNarrativeTest
  701. [INFO] Tests run: 1, Failures: 0, Errors: 0, Skipped: 0, Time elapsed: 0.804 s - in org.openmrs.module.fhir2.narrative.TaskNarrativeTest
  702. [INFO] Running org.openmrs.module.fhir2.providers.r3.AllergyIntoleranceFhirR3ResourceProviderWebTest
  703. [INFO] Tests run: 29, Failures: 0, Errors: 0, Skipped: 0, Time elapsed: 7.008 s - in org.openmrs.module.fhir2.providers.r3.AllergyIntoleranceFhirR3ResourceProviderWebTest
  704. [INFO] Running org.openmrs.module.fhir2.providers.r3.ConditionFhirR3ResourceProviderWebTest
  705. [INFO] Tests run: 19, Failures: 0, Errors: 0, Skipped: 0, Time elapsed: 1.36 s - in org.openmrs.module.fhir2.providers.r3.ConditionFhirR3ResourceProviderWebTest
  706. [INFO] Running org.openmrs.module.fhir2.providers.r3.DiagnosticReportFhirResourceProviderWebTest
  707. [INFO] Tests run: 25, Failures: 0, Errors: 0, Skipped: 0, Time elapsed: 1.029 s - in org.openmrs.module.fhir2.providers.r3.DiagnosticReportFhirResourceProviderWebTest
  708. [INFO] Running org.openmrs.module.fhir2.providers.r3.EncounterFhirResourceProviderWebTest
  709. [INFO] Tests run: 35, Failures: 0, Errors: 0, Skipped: 0, Time elapsed: 1.214 s - in org.openmrs.module.fhir2.providers.r3.EncounterFhirResourceProviderWebTest
  710. [INFO] Running org.openmrs.module.fhir2.providers.r3.ListFhirResourceProviderWebTest
  711. [INFO] Tests run: 8, Failures: 0, Errors: 0, Skipped: 0, Time elapsed: 0.25 s - in org.openmrs.module.fhir2.providers.r3.ListFhirResourceProviderWebTest
  712. [INFO] Running org.openmrs.module.fhir2.providers.r3.LocationFhirResourceProviderWebTest
  713. [INFO] Tests run: 26, Failures: 0, Errors: 0, Skipped: 0, Time elapsed: 1.674 s - in org.openmrs.module.fhir2.providers.r3.LocationFhirResourceProviderWebTest
  714. [INFO] Running org.openmrs.module.fhir2.providers.r3.MedicationFhirResourceProviderWebTest
  715. [INFO] Tests run: 14, Failures: 0, Errors: 0, Skipped: 0, Time elapsed: 1.028 s - in org.openmrs.module.fhir2.providers.r3.MedicationFhirResourceProviderWebTest
  716. [INFO] Running org.openmrs.module.fhir2.providers.r3.MedicationRequestFhirResourceProviderWebTest
  717. [INFO] Tests run: 32, Failures: 0, Errors: 0, Skipped: 0, Time elapsed: 1.24 s - in org.openmrs.module.fhir2.providers.r3.MedicationRequestFhirResourceProviderWebTest
  718. [INFO] Running org.openmrs.module.fhir2.providers.r3.ObservationFhirResourceProviderWebTest
  719. [INFO] Tests run: 39, Failures: 0, Errors: 0, Skipped: 0, Time elapsed: 1.561 s - in org.openmrs.module.fhir2.providers.r3.ObservationFhirResourceProviderWebTest
  720. [INFO] Running org.openmrs.module.fhir2.providers.r3.PatientFhirR3ResourceProviderWebTest
  721. [INFO] Tests run: 35, Failures: 0, Errors: 0, Skipped: 0, Time elapsed: 0.938 s - in org.openmrs.module.fhir2.providers.r3.PatientFhirR3ResourceProviderWebTest
  722. [INFO] Running org.openmrs.module.fhir2.providers.r3.PersonFhirResourceProviderWebTest
  723. [INFO] Tests run: 26, Failures: 0, Errors: 0, Skipped: 0, Time elapsed: 0.627 s - in org.openmrs.module.fhir2.providers.r3.PersonFhirResourceProviderWebTest
  724. [INFO] Running org.openmrs.module.fhir2.providers.r3.PractitionerFhirResourceProviderWebTest
  725. [INFO] Tests run: 22, Failures: 0, Errors: 0, Skipped: 0, Time elapsed: 0.455 s - in org.openmrs.module.fhir2.providers.r3.PractitionerFhirResourceProviderWebTest
  726. [INFO] Running org.openmrs.module.fhir2.providers.r3.ProcedureRequestFhirResourceProviderWebTest
  727. [INFO] Tests run: 29, Failures: 0, Errors: 0, Skipped: 0, Time elapsed: 0.002 s - in org.openmrs.module.fhir2.providers.r3.ProcedureRequestFhirResourceProviderWebTest
  728. [INFO] Running org.openmrs.module.fhir2.providers.r3.RelatedPersonFhirResourceProviderWebTest
  729. [INFO] Tests run: 17, Failures: 0, Errors: 0, Skipped: 0, Time elapsed: 0.364 s - in org.openmrs.module.fhir2.providers.r3.RelatedPersonFhirResourceProviderWebTest
  730. [INFO] Running org.openmrs.module.fhir2.providers.r3.TaskFhirResourceProviderWebTest
  731. [INFO] Tests run: 19, Failures: 0, Errors: 0, Skipped: 0, Time elapsed: 0.506 s - in org.openmrs.module.fhir2.providers.r3.TaskFhirResourceProviderWebTest
  732. [INFO] Running org.openmrs.module.fhir2.providers.r4.AllergyIntoleranceFhirResourceProviderWebTest
  733. [INFO] Tests run: 30, Failures: 0, Errors: 0, Skipped: 0, Time elapsed: 1.619 s - in org.openmrs.module.fhir2.providers.r4.AllergyIntoleranceFhirResourceProviderWebTest
  734. [INFO] Running org.openmrs.module.fhir2.providers.r4.ConditionFhirResourceProviderWebTest
  735. [INFO] Tests run: 19, Failures: 0, Errors: 0, Skipped: 0, Time elapsed: 0.659 s - in org.openmrs.module.fhir2.providers.r4.ConditionFhirResourceProviderWebTest
  736. [INFO] Running org.openmrs.module.fhir2.providers.r4.DiagnosticReportFhirResourceProviderWebTest
  737. [INFO] Tests run: 25, Failures: 0, Errors: 0, Skipped: 0, Time elapsed: 0.806 s - in org.openmrs.module.fhir2.providers.r4.DiagnosticReportFhirResourceProviderWebTest
  738. [INFO] Running org.openmrs.module.fhir2.providers.r4.EncounterFhirResourceProviderWebTest
  739. [INFO] Tests run: 37, Failures: 0, Errors: 0, Skipped: 0, Time elapsed: 1.227 s - in org.openmrs.module.fhir2.providers.r4.EncounterFhirResourceProviderWebTest
  740. [INFO] Running org.openmrs.module.fhir2.providers.r4.ListFhirResourceProviderWebTest
  741. [INFO] Tests run: 8, Failures: 0, Errors: 0, Skipped: 0, Time elapsed: 0.182 s - in org.openmrs.module.fhir2.providers.r4.ListFhirResourceProviderWebTest
  742. [INFO] Running org.openmrs.module.fhir2.providers.r4.LocationFhirResourceProviderWebTest
  743. [INFO] Tests run: 26, Failures: 0, Errors: 0, Skipped: 0, Time elapsed: 0.659 s - in org.openmrs.module.fhir2.providers.r4.LocationFhirResourceProviderWebTest
  744. [INFO] Running org.openmrs.module.fhir2.providers.r4.MedicationFhirResourceProviderWebTest
  745. [INFO] Tests run: 14, Failures: 0, Errors: 0, Skipped: 0, Time elapsed: 0.343 s - in org.openmrs.module.fhir2.providers.r4.MedicationFhirResourceProviderWebTest
  746. [INFO] Running org.openmrs.module.fhir2.providers.r4.MedicationRequestFhirResourceProviderWebTest
  747. [INFO] Tests run: 32, Failures: 0, Errors: 0, Skipped: 0, Time elapsed: 0.816 s - in org.openmrs.module.fhir2.providers.r4.MedicationRequestFhirResourceProviderWebTest
  748. [INFO] Running org.openmrs.module.fhir2.providers.r4.ObservationFhirResourceProviderWebTest
  749. [INFO] Tests run: 39, Failures: 0, Errors: 0, Skipped: 0, Time elapsed: 0.79 s - in org.openmrs.module.fhir2.providers.r4.ObservationFhirResourceProviderWebTest
  750. [INFO] Running org.openmrs.module.fhir2.providers.r4.PatientFhirResourceProviderWebTest
  751. [INFO] Tests run: 35, Failures: 0, Errors: 0, Skipped: 0, Time elapsed: 0.992 s - in org.openmrs.module.fhir2.providers.r4.PatientFhirResourceProviderWebTest
  752. [INFO] Running org.openmrs.module.fhir2.providers.r4.PersonFhirResourceProviderWebTest
  753. [INFO] Tests run: 26, Failures: 0, Errors: 0, Skipped: 0, Time elapsed: 0.641 s - in org.openmrs.module.fhir2.providers.r4.PersonFhirResourceProviderWebTest
  754. [INFO] Running org.openmrs.module.fhir2.providers.r4.PractitionerFhirResourceProviderWebTest
  755. [INFO] Tests run: 22, Failures: 0, Errors: 0, Skipped: 0, Time elapsed: 0.455 s - in org.openmrs.module.fhir2.providers.r4.PractitionerFhirResourceProviderWebTest
  756. [INFO] Running org.openmrs.module.fhir2.providers.r4.RelatedPersonFhirResourceProviderWebTest
  757. [INFO] Tests run: 17, Failures: 0, Errors: 0, Skipped: 0, Time elapsed: 0.482 s - in org.openmrs.module.fhir2.providers.r4.RelatedPersonFhirResourceProviderWebTest
  758. [INFO] Running org.openmrs.module.fhir2.providers.r4.ServiceRequestFhirResourceProviderWebTest
  759. [INFO] Tests run: 30, Failures: 0, Errors: 0, Skipped: 0, Time elapsed: 0.753 s - in org.openmrs.module.fhir2.providers.r4.ServiceRequestFhirResourceProviderWebTest
  760. [INFO] Running org.openmrs.module.fhir2.providers.r4.TaskFhirResourceProviderWebTest
  761. [INFO] Tests run: 19, Failures: 0, Errors: 0, Skipped: 0, Time elapsed: 0.383 s - in org.openmrs.module.fhir2.providers.r4.TaskFhirResourceProviderWebTest
  762. [INFO] Running org.openmrs.module.fhir2.web.filter.ForwardingFilterTest
  763. ERROR - FhirVersionUtils.getFhirVersion(60) |2020-08-11 07:10:33,936| Could not determine FHIR version for URI /ws/fhir2//Person and path .
  764. ERROR - FhirVersionUtils.getFhirVersion(60) |2020-08-11 07:10:33,943| Could not determine FHIR version for URI /ws/fhir2/R27/Person and path .
  765. ERROR - FhirVersionUtils.getFhirVersion(60) |2020-08-11 07:10:33,944| Could not determine FHIR version for URI /ws/fhir2/Person and path .
  766. ERROR - FhirVersionUtils.getFhirVersion(45) |2020-08-11 07:10:33,944| Could not determine FHIR version for URI /ws/fhir2 and path .
  767. ERROR - FhirVersionUtils.getFhirVersion(60) |2020-08-11 07:10:33,945| Could not determine FHIR version for URI /ws/fhir2/ and path .
  768. [INFO] Tests run: 7, Failures: 0, Errors: 0, Skipped: 0, Time elapsed: 0.053 s - in org.openmrs.module.fhir2.web.filter.ForwardingFilterTest
  769. [INFO] Running org.openmrs.module.fhir2.web.util.FhirVersionUtilsTest
  770. ERROR - FhirVersionUtils.getFhirVersion(60) |2020-08-11 07:10:34,207| Could not determine FHIR version for URI /openmrs/ws/fhir2/Patient and path /openmrs.
  771. [INFO] Tests run: 7, Failures: 0, Errors: 0, Skipped: 0, Time elapsed: 0.212 s - in org.openmrs.module.fhir2.web.util.FhirVersionUtilsTest
  772. [INFO] Running org.openmrs.module.fhir2.web.util.NarrativeUtilTest
  773. ERROR - NarrativeUtils.validatePropertiesFilePath(54) |2020-08-11 07:10:34,218| Properties File classpath must not be empty
  774. ERROR - NarrativeUtils.validatePropertiesFilePath(42) |2020-08-11 07:10:34,219| Properties File path must not be empty
  775. ERROR - NarrativeUtils.validatePropertiesFilePath(47) |2020-08-11 07:10:34,219| Properties File must have extension '.properties'
  776. ERROR - NarrativeUtils.validatePropertiesFilePath(61) |2020-08-11 07:10:34,221| Properties File OpenMRS relative path must not be empty
  777. [INFO] Tests run: 6, Failures: 0, Errors: 0, Skipped: 0, Time elapsed: 0.008 s - in org.openmrs.module.fhir2.web.util.NarrativeUtilTest
  778. [INFO] Running org.openmrs.module.fhir2.web.util.OpenmrsFhirAddressStrategyTest
  779. [INFO] Tests run: 8, Failures: 0, Errors: 0, Skipped: 0, Time elapsed: 0.174 s - in org.openmrs.module.fhir2.web.util.OpenmrsFhirAddressStrategyTest
  780. [INFO]
  781. [INFO] Results:
  782. [INFO]
  783. [ERROR] Failures:
  784. [ERROR] NarrativeGeneratorTest.shouldMapValuesFromPropertiesFileToTemplate:109]expected:<...rrativeContent</div>[
  785. > but was:<...rrativeContent</div>[]
  786. >
  787. [INFO]
  788. [ERROR] Tests run: 800, Failures: 1, Errors: 0, Skipped: 0
  789. [INFO]
  790. [INFO] ------------------------------------------------------------------------
  791. [INFO] Reactor Summary for FHIR2 1.0.0-SNAPSHOT:
  792. [INFO]
  793. [INFO] FHIR2 .............................................. SUCCESS [ 6.908 s]
  794. [INFO] FHIR2 Test Data .................................... SUCCESS [ 4.515 s]
  795. [INFO] FHIR2 API .......................................... SUCCESS [02:53 min]
  796. [INFO] FHIR2 API 2.1 ...................................... SUCCESS [ 14.479 s]
  797. [INFO] FHIR2 API 2.2 ...................................... SUCCESS [01:02 min]
  798. [INFO] FHIR2 OMOD ......................................... FAILURE [01:22 min]
  799. [INFO] FHIR2 Integration Tests ............................ SKIPPED
  800. [INFO] ------------------------------------------------------------------------
  801. [INFO] BUILD FAILURE
  802. [INFO] ------------------------------------------------------------------------
  803. [INFO] Total time: 05:45 min
  804. [INFO] Finished at: 2020-08-11T10:10:35+03:00
  805. [INFO] ------------------------------------------------------------------------
  806. [ERROR] Failed to execute goal org.apache.maven.plugins:maven-surefire-plugin:3.0.0-M4:test (default-test) on project fhir2-omod: There are test failures.
  807. [ERROR]
  808. [ERROR] Please refer to C:\Users\Cliff\Desktop\project\openmrs-module-fhir2\omod\target\surefire-reports for the individual test results.
  809. [ERROR] Please refer to dump files (if any exist) [date].dump, [date]-jvmRun[N].dump and [date].dumpstream.
  810. [ERROR] -> [Help 1]
  811. [ERROR]
  812. [ERROR] To see the full stack trace of the errors, re-run Maven with the -e switch.
  813. [ERROR] Re-run Maven using the -X switch to enable full debug logging.
  814. [ERROR]
  815. [ERROR] For more information about the errors and possible solutions, please read the following articles:
  816. [ERROR] [Help 1] http://cwiki.apache.org/confluence/display/MAVEN/MojoFailureException
  817. [ERROR]
  818. [ERROR] After correcting the problems, you can resume the build with the command
  819. [ERROR] mvn <goals> -rf :fhir2-omod
  820.  
  821. Cliff@Cliff-PC MINGW64 ~/Desktop/project/openmrs-module-fhir2 (master)
  822. $ mvn clean install
  823. [INFO] Scanning for projects...
  824. [INFO] ------------------------------------------------------------------------
  825. [INFO] Reactor Build Order:
  826. [INFO]
  827. [INFO] FHIR2 [pom]
  828. [INFO] FHIR2 Test Data [jar]
  829. [INFO] FHIR2 API [jar]
  830. [INFO] FHIR2 API 2.1 [jar]
  831. [INFO] FHIR2 API 2.2 [jar]
  832. [INFO] FHIR2 OMOD [jar]
  833. [INFO] FHIR2 Integration Tests [jar]
  834. [INFO]
  835. [INFO] ----------------------< org.openmrs.module:fhir2 >----------------------
  836. [INFO] Building FHIR2 1.0.0-SNAPSHOT [1/7]
  837. [INFO] --------------------------------[ pom ]---------------------------------
  838. [INFO]
  839. [INFO] --- maven-clean-plugin:2.5:clean (default-clean) @ fhir2 ---
  840. [INFO]
  841. [INFO] --- maven-install-plugin:2.4:install (default-install) @ fhir2 ---
  842. [INFO] Installing C:\Users\Cliff\Desktop\project\openmrs-module-fhir2\pom.xml to C:\Users\Cliff\.m2\repository\org\openmrs\module\fhir2\1.0.0-SNAPSHOT\fhir2-1.0.0-SNAPSHOT.pom
  843. [INFO]
  844. [INFO] -----------------< org.openmrs.module:fhir2-test-data >-----------------
  845. [INFO] Building FHIR2 Test Data 1.0.0-SNAPSHOT [2/7]
  846. [INFO] --------------------------------[ jar ]---------------------------------
  847. [INFO]
  848. [INFO] --- maven-clean-plugin:2.5:clean (default-clean) @ fhir2-test-data ---
  849. [INFO] Deleting C:\Users\Cliff\Desktop\project\openmrs-module-fhir2\test-data\target
  850. [INFO]
  851. [INFO] --- maven-resources-plugin:2.6:resources (default-resources) @ fhir2-test-data ---
  852. [INFO] Using 'UTF-8' encoding to copy filtered resources.
  853. [INFO] skip non existing resourceDirectory C:\Users\Cliff\Desktop\project\openmrs-module-fhir2\test-data\src\main\resources
  854. [INFO] skip non existing resourceDirectory C:\Users\Cliff\Desktop\project\openmrs-module-fhir2\test-data\src\main\resources
  855. [INFO] skip non existing resourceDirectory C:\Users\Cliff\Desktop\project\openmrs-module-fhir2\test-data\src\main\webapp
  856. [INFO] skip non existing resourceDirectory C:\Users\Cliff\Desktop\project\openmrs-module-fhir2\test-data\src\main\webapp
  857. [INFO]
  858. [INFO] --- maven-compiler-plugin:3.1:compile (default-compile) @ fhir2-test-data ---
  859. [INFO] No sources to compile
  860. [INFO]
  861. [INFO] --- maven-resources-plugin:2.6:testResources (default-testResources) @ fhir2-test-data ---
  862. [INFO] Using 'UTF-8' encoding to copy filtered resources.
  863. [INFO] Copying 22 resources
  864. [INFO] Copying 79 resources
  865. [INFO]
  866. [INFO] --- maven-compiler-plugin:3.1:testCompile (default-testCompile) @ fhir2-test-data ---
  867. [INFO] No sources to compile
  868. [INFO]
  869. [INFO] --- maven-surefire-plugin:3.0.0-M4:test (default-test) @ fhir2-test-data ---
  870. [INFO]
  871. [INFO] --- maven-jar-plugin:3.2.0:jar (default-jar) @ fhir2-test-data ---
  872. [WARNING] JAR will be empty - no content was marked for inclusion!
  873. [INFO] Building jar: C:\Users\Cliff\Desktop\project\openmrs-module-fhir2\test-data\target\fhir2-test-data-1.0.0-SNAPSHOT.jar
  874. [INFO]
  875. [INFO] --- maven-jar-plugin:3.2.0:test-jar (default) @ fhir2-test-data ---
  876. [INFO] Building jar: C:\Users\Cliff\Desktop\project\openmrs-module-fhir2\test-data\target\fhir2-test-data-1.0.0-SNAPSHOT-tests.jar
  877. [INFO]
  878. [INFO] --- maven-install-plugin:2.4:install (default-install) @ fhir2-test-data ---
  879. [INFO] Installing C:\Users\Cliff\Desktop\project\openmrs-module-fhir2\test-data\target\fhir2-test-data-1.0.0-SNAPSHOT.jar to C:\Users\Cliff\.m2\repository\org\openmrs\module\fhir2-test-data\1.0.0-SNAPSHOT\fhir2-test-data-1.0.0-SNAPSHOT.jar
  880. [INFO] Installing C:\Users\Cliff\Desktop\project\openmrs-module-fhir2\test-data\pom.xml to C:\Users\Cliff\.m2\repository\org\openmrs\module\fhir2-test-data\1.0.0-SNAPSHOT\fhir2-test-data-1.0.0-SNAPSHOT.pom
  881. [INFO] Installing C:\Users\Cliff\Desktop\project\openmrs-module-fhir2\test-data\target\fhir2-test-data-1.0.0-SNAPSHOT-tests.jar to C:\Users\Cliff\.m2\repository\org\openmrs\module\fhir2-test-data\1.0.0-SNAPSHOT\fhir2-test-data-1.0.0-SNAPSHOT-tests.jar
  882. [INFO]
  883. [INFO] --------------------< org.openmrs.module:fhir2-api >--------------------
  884. [INFO] Building FHIR2 API 1.0.0-SNAPSHOT [3/7]
  885. [INFO] --------------------------------[ jar ]---------------------------------
  886. [INFO]
  887. [INFO] --- maven-clean-plugin:2.5:clean (default-clean) @ fhir2-api ---
  888. [INFO] Deleting C:\Users\Cliff\Desktop\project\openmrs-module-fhir2\api\target
  889. [INFO]
  890. [INFO] --- directory-maven-plugin:0.1:highest-basedir (directories) @ fhir2-api ---
  891. [INFO] Highest basedir set to: C:\Users\Cliff\Desktop\project\openmrs-module-fhir2
  892. [INFO]
  893. [INFO] --- license-maven-plugin:3.0:format (add-license) @ fhir2-api ---
  894. [INFO] Updating license headers...
  895. [INFO]
  896. [INFO] --- jacoco-maven-plugin:0.8.2:prepare-agent (default) @ fhir2-api ---
  897. [INFO] argLine set to -javaagent:C:\\Users\\Cliff\\.m2\\repository\\org\\jacoco\\org.jacoco.agent\\0.8.2\\org.jacoco.agent-0.8.2-runtime.jar=destfile=C:\\Users\\Cliff\\Desktop\\project\\openmrs-module-fhir2\\api\\target\\jacoco.exec
  898. [INFO]
  899. [INFO] --- formatter-maven-plugin:2.11.0:format (default) @ fhir2-api ---
  900. [INFO] Using 'UTF-8' encoding to format source files.
  901. [INFO] Number of files to be formatted: 389
  902. [INFO] Successfully formatted: 0 file(s)
  903. [INFO] Fail to format: 0 file(s)
  904. [INFO] Skipped: 389 file(s)
  905. [INFO] Read only skipped: 0 file(s)
  906. [INFO] Approximate time taken: 6s
  907. [INFO]
  908. [INFO] --- impsort-maven-plugin:1.3.2:sort (default) @ fhir2-api ---
  909. [INFO] Total Files Processed: 389 in 00:05.488
  910. [INFO] Already Sorted: 389
  911. [INFO] Needed Sorting: 0
  912. [INFO]
  913. [INFO] --- maven-resources-plugin:2.6:resources (default-resources) @ fhir2-api ---
  914. [INFO] Using 'UTF-8' encoding to copy filtered resources.
  915. [INFO] Copying 8 resources
  916. [INFO] Copying 0 resource
  917. [INFO] skip non existing resourceDirectory C:\Users\Cliff\Desktop\project\openmrs-module-fhir2\api\src\main\webapp
  918. [INFO] skip non existing resourceDirectory C:\Users\Cliff\Desktop\project\openmrs-module-fhir2\api\src\main\webapp
  919. [INFO]
  920. [INFO] --- maven-compiler-plugin:3.1:compile (default-compile) @ fhir2-api ---
  921. [INFO] Changes detected - recompiling the module!
  922. [INFO] Compiling 246 source files to C:\Users\Cliff\Desktop\project\openmrs-module-fhir2\api\target\classes
  923. [INFO]
  924. [INFO] --- maven-resources-plugin:2.6:testResources (default-testResources) @ fhir2-api ---
  925. [INFO] Using 'UTF-8' encoding to copy filtered resources.
  926. [INFO] Copying 1 resource
  927. [INFO] Copying 0 resource
  928. [INFO]
  929. [INFO] --- maven-compiler-plugin:3.1:testCompile (default-testCompile) @ fhir2-api ---
  930. [INFO] Changes detected - recompiling the module!
  931. [INFO] Compiling 143 source files to C:\Users\Cliff\Desktop\project\openmrs-module-fhir2\api\target\test-classes
  932. [INFO]
  933. [INFO] --- maven-surefire-plugin:3.0.0-M4:test (default-test) @ fhir2-api ---
  934. [INFO]
  935. [INFO] -------------------------------------------------------
  936. [INFO] T E S T S
  937. [INFO] -------------------------------------------------------
  938. [INFO] Running org.openmrs.module.fhir2.api.dao.impl.FhirAllergyIntoleranceDaoImplTest
  939. [INFO] Tests run: 4, Failures: 0, Errors: 0, Skipped: 0, Time elapsed: 35.432 s - in org.openmrs.module.fhir2.api.dao.impl.FhirAllergyIntoleranceDaoImplTest
  940. [INFO] Running org.openmrs.module.fhir2.api.dao.impl.FhirCohortListDaoImplTest
  941. [INFO] Tests run: 2, Failures: 0, Errors: 0, Skipped: 0, Time elapsed: 0.228 s - in org.openmrs.module.fhir2.api.dao.impl.FhirCohortListDaoImplTest
  942. [INFO] Running org.openmrs.module.fhir2.api.dao.impl.FhirConceptDaoImplTest
  943. [INFO] Tests run: 5, Failures: 0, Errors: 0, Skipped: 0, Time elapsed: 0.773 s - in org.openmrs.module.fhir2.api.dao.impl.FhirConceptDaoImplTest
  944. [INFO] Running org.openmrs.module.fhir2.api.dao.impl.FhirConceptSourceDaoImplTest
  945. [INFO] Tests run: 5, Failures: 0, Errors: 0, Skipped: 0, Time elapsed: 0.67 s - in org.openmrs.module.fhir2.api.dao.impl.FhirConceptSourceDaoImplTest
  946. [INFO] Running org.openmrs.module.fhir2.api.dao.impl.FhirDiagnosticReportDaoImplTest
  947. [INFO] Tests run: 5, Failures: 0, Errors: 0, Skipped: 0, Time elapsed: 0.795 s - in org.openmrs.module.fhir2.api.dao.impl.FhirDiagnosticReportDaoImplTest
  948. [INFO] Running org.openmrs.module.fhir2.api.dao.impl.FhirEncounterDaoImplTest
  949. [INFO] Tests run: 2, Failures: 0, Errors: 0, Skipped: 0, Time elapsed: 0.557 s - in org.openmrs.module.fhir2.api.dao.impl.FhirEncounterDaoImplTest
  950. [INFO] Running org.openmrs.module.fhir2.api.dao.impl.FhirGlobalPropertyDaoImplTest
  951. [INFO] Tests run: 6, Failures: 0, Errors: 0, Skipped: 0, Time elapsed: 0.518 s - in org.openmrs.module.fhir2.api.dao.impl.FhirGlobalPropertyDaoImplTest
  952. [INFO] Running org.openmrs.module.fhir2.api.dao.impl.FhirLocationDaoImplTest
  953. [INFO] Tests run: 3, Failures: 0, Errors: 0, Skipped: 0, Time elapsed: 0.481 s - in org.openmrs.module.fhir2.api.dao.impl.FhirLocationDaoImplTest
  954. [INFO] Running org.openmrs.module.fhir2.api.dao.impl.FhirMedicationDaoImplTest
  955. [INFO] Tests run: 6, Failures: 0, Errors: 0, Skipped: 0, Time elapsed: 0.573 s - in org.openmrs.module.fhir2.api.dao.impl.FhirMedicationDaoImplTest
  956. [INFO] Running org.openmrs.module.fhir2.api.dao.impl.FhirMedicationRequestDaoImplTest
  957. [INFO] Tests run: 3, Failures: 0, Errors: 0, Skipped: 0, Time elapsed: 0.613 s - in org.openmrs.module.fhir2.api.dao.impl.FhirMedicationRequestDaoImplTest
  958. [INFO] Running org.openmrs.module.fhir2.api.dao.impl.FhirObservationDaoImplTest
  959. [INFO] Tests run: 3, Failures: 0, Errors: 0, Skipped: 0, Time elapsed: 0.447 s - in org.openmrs.module.fhir2.api.dao.impl.FhirObservationDaoImplTest
  960. [INFO] Running org.openmrs.module.fhir2.api.dao.impl.FhirPatientDaoImplPatientIdentifierTest
  961. [INFO] Tests run: 8, Failures: 0, Errors: 0, Skipped: 0, Time elapsed: 0.457 s - in org.openmrs.module.fhir2.api.dao.impl.FhirPatientDaoImplPatientIdentifierTest
  962. [INFO] Running org.openmrs.module.fhir2.api.dao.impl.FhirPatientDaoImplTest
  963. [INFO] Tests run: 4, Failures: 0, Errors: 0, Skipped: 0, Time elapsed: 0.341 s - in org.openmrs.module.fhir2.api.dao.impl.FhirPatientDaoImplTest
  964. [INFO] Running org.openmrs.module.fhir2.api.dao.impl.FhirPersonDaoImplTest
  965. [INFO] Tests run: 3, Failures: 0, Errors: 0, Skipped: 0, Time elapsed: 0.226 s - in org.openmrs.module.fhir2.api.dao.impl.FhirPersonDaoImplTest
  966. [INFO] Running org.openmrs.module.fhir2.api.dao.impl.FhirPractitionerDaoImplTest
  967. [INFO] Tests run: 2, Failures: 0, Errors: 0, Skipped: 0, Time elapsed: 0.198 s - in org.openmrs.module.fhir2.api.dao.impl.FhirPractitionerDaoImplTest
  968. [INFO] Running org.openmrs.module.fhir2.api.dao.impl.FhirRelatedPersonDaoImplTest
  969. [INFO] Tests run: 2, Failures: 0, Errors: 0, Skipped: 0, Time elapsed: 0.068 s - in org.openmrs.module.fhir2.api.dao.impl.FhirRelatedPersonDaoImplTest
  970. [INFO] Running org.openmrs.module.fhir2.api.dao.impl.FhirServiceRequestDaoImplTest
  971. [INFO] Tests run: 3, Failures: 0, Errors: 0, Skipped: 0, Time elapsed: 0.301 s - in org.openmrs.module.fhir2.api.dao.impl.FhirServiceRequestDaoImplTest
  972. [INFO] Running org.openmrs.module.fhir2.api.dao.impl.FhirTaskDaoImplTest
  973. [INFO] Tests run: 10, Failures: 0, Errors: 0, Skipped: 0, Time elapsed: 0.949 s - in org.openmrs.module.fhir2.api.dao.impl.FhirTaskDaoImplTest
  974. [INFO] Running org.openmrs.module.fhir2.api.dao.impl.FhirUserDaoImplTest
  975. [INFO] Tests run: 1, Failures: 0, Errors: 0, Skipped: 0, Time elapsed: 0.165 s - in org.openmrs.module.fhir2.api.dao.impl.FhirUserDaoImplTest
  976. [INFO] Running org.openmrs.module.fhir2.api.impl.FhirAllergyIntoleranceServiceImplTest
  977. [INFO] Tests run: 14, Failures: 0, Errors: 0, Skipped: 0, Time elapsed: 0.542 s - in org.openmrs.module.fhir2.api.impl.FhirAllergyIntoleranceServiceImplTest
  978. [INFO] Running org.openmrs.module.fhir2.api.impl.FhirCohortListServiceImplTest
  979. [INFO] Tests run: 2, Failures: 0, Errors: 0, Skipped: 0, Time elapsed: 0.184 s - in org.openmrs.module.fhir2.api.impl.FhirCohortListServiceImplTest
  980. [INFO] Running org.openmrs.module.fhir2.api.impl.FhirConceptServiceImplTest
  981. [INFO] Tests run: 4, Failures: 0, Errors: 0, Skipped: 0, Time elapsed: 0.08 s - in org.openmrs.module.fhir2.api.impl.FhirConceptServiceImplTest
  982. [INFO] Running org.openmrs.module.fhir2.api.impl.FhirConceptSourceServiceImplTest
  983. [INFO] Tests run: 6, Failures: 0, Errors: 0, Skipped: 0, Time elapsed: 0.118 s - in org.openmrs.module.fhir2.api.impl.FhirConceptSourceServiceImplTest
  984. [INFO] Running org.openmrs.module.fhir2.api.impl.FhirConditionServiceImplTest
  985. [INFO] Tests run: 3, Failures: 0, Errors: 0, Skipped: 0, Time elapsed: 0.006 s - in org.openmrs.module.fhir2.api.impl.FhirConditionServiceImplTest
  986. [INFO] Running org.openmrs.module.fhir2.api.impl.FhirDiagnosticReportServiceImplTest
  987. [INFO] Tests run: 7, Failures: 0, Errors: 0, Skipped: 0, Time elapsed: 0.335 s - in org.openmrs.module.fhir2.api.impl.FhirDiagnosticReportServiceImplTest
  988. [INFO] Running org.openmrs.module.fhir2.api.impl.FhirEncounterServiceImplTest
  989. [INFO] Tests run: 7, Failures: 0, Errors: 0, Skipped: 0, Time elapsed: 0.196 s - in org.openmrs.module.fhir2.api.impl.FhirEncounterServiceImplTest
  990. [INFO] Running org.openmrs.module.fhir2.api.impl.FhirGlobalPropertyServiceImplTest
  991. [INFO] Tests run: 8, Failures: 0, Errors: 0, Skipped: 0, Time elapsed: 0.039 s - in org.openmrs.module.fhir2.api.impl.FhirGlobalPropertyServiceImplTest
  992. [INFO] Running org.openmrs.module.fhir2.api.impl.FhirLocationServiceImplTest
  993. [INFO] Tests run: 2, Failures: 0, Errors: 0, Skipped: 0, Time elapsed: 0.175 s - in org.openmrs.module.fhir2.api.impl.FhirLocationServiceImplTest
  994. [INFO] Running org.openmrs.module.fhir2.api.impl.FhirMedicationRequestServiceImplTest
  995. [INFO] Tests run: 9, Failures: 0, Errors: 0, Skipped: 0, Time elapsed: 0.161 s - in org.openmrs.module.fhir2.api.impl.FhirMedicationRequestServiceImplTest
  996. [INFO] Running org.openmrs.module.fhir2.api.impl.FhirMedicationServiceImplTest
  997. [INFO] Tests run: 13, Failures: 0, Errors: 0, Skipped: 0, Time elapsed: 0.161 s - in org.openmrs.module.fhir2.api.impl.FhirMedicationServiceImplTest
  998. [INFO] Running org.openmrs.module.fhir2.api.impl.FhirObservationServiceImplTest
  999. [INFO] Tests run: 2, Failures: 0, Errors: 0, Skipped: 0, Time elapsed: 0.176 s - in org.openmrs.module.fhir2.api.impl.FhirObservationServiceImplTest
  1000. [INFO] Running org.openmrs.module.fhir2.api.impl.FhirPatientServiceImplTest
  1001. [INFO] Tests run: 27, Failures: 0, Errors: 0, Skipped: 0, Time elapsed: 0.327 s - in org.openmrs.module.fhir2.api.impl.FhirPatientServiceImplTest
  1002. [INFO] Running org.openmrs.module.fhir2.api.impl.FhirPersonServiceImplTest
  1003. [INFO] Tests run: 19, Failures: 0, Errors: 0, Skipped: 0, Time elapsed: 0.178 s - in org.openmrs.module.fhir2.api.impl.FhirPersonServiceImplTest
  1004. [INFO] Running org.openmrs.module.fhir2.api.impl.FhirPractitionerServiceImplTest
  1005. [INFO] Tests run: 26, Failures: 0, Errors: 0, Skipped: 0, Time elapsed: 0.273 s - in org.openmrs.module.fhir2.api.impl.FhirPractitionerServiceImplTest
  1006. [INFO] Running org.openmrs.module.fhir2.api.impl.FhirRelatedPersonServiceImplTest
  1007. [INFO] Tests run: 21, Failures: 0, Errors: 0, Skipped: 0, Time elapsed: 0.251 s - in org.openmrs.module.fhir2.api.impl.FhirRelatedPersonServiceImplTest
  1008. [INFO] Running org.openmrs.module.fhir2.api.impl.FhirServiceRequestServiceImplTest
  1009. [INFO] Tests run: 8, Failures: 0, Errors: 0, Skipped: 0, Time elapsed: 0.262 s - in org.openmrs.module.fhir2.api.impl.FhirServiceRequestServiceImplTest
  1010. [INFO] Running org.openmrs.module.fhir2.api.impl.FhirTaskServiceImplTest
  1011. [INFO] Tests run: 7, Failures: 0, Errors: 0, Skipped: 0, Time elapsed: 0.319 s - in org.openmrs.module.fhir2.api.impl.FhirTaskServiceImplTest
  1012. [INFO] Running org.openmrs.module.fhir2.api.impl.FhirUserDefaultPropertiesImplTest
  1013. [INFO] Tests run: 2, Failures: 0, Errors: 0, Skipped: 0, Time elapsed: 0.029 s - in org.openmrs.module.fhir2.api.impl.FhirUserDefaultPropertiesImplTest
  1014. [INFO] Running org.openmrs.module.fhir2.api.impl.FhirUserServiceImplTest
  1015. [INFO] Tests run: 16, Failures: 0, Errors: 0, Skipped: 0, Time elapsed: 0.216 s - in org.openmrs.module.fhir2.api.impl.FhirUserServiceImplTest
  1016. [INFO] Running org.openmrs.module.fhir2.api.search.AllergyIntoleranceSearchQueryTest
  1017. [INFO] Tests run: 35, Failures: 0, Errors: 0, Skipped: 0, Time elapsed: 4.456 s - in org.openmrs.module.fhir2.api.search.AllergyIntoleranceSearchQueryTest
  1018. [INFO] Running org.openmrs.module.fhir2.api.search.DiagnosticReportSearchQueryTest
  1019. [INFO] Tests run: 38, Failures: 0, Errors: 0, Skipped: 0, Time elapsed: 4.556 s - in org.openmrs.module.fhir2.api.search.DiagnosticReportSearchQueryTest
  1020. [INFO] Running org.openmrs.module.fhir2.api.search.EncounterSearchQueryTest
  1021. [INFO] Tests run: 47, Failures: 0, Errors: 0, Skipped: 0, Time elapsed: 2.14 s - in org.openmrs.module.fhir2.api.search.EncounterSearchQueryTest
  1022. [INFO] Running org.openmrs.module.fhir2.api.search.LocationSearchQueryTest
  1023. [INFO] Tests run: 28, Failures: 0, Errors: 0, Skipped: 0, Time elapsed: 2.378 s - in org.openmrs.module.fhir2.api.search.LocationSearchQueryTest
  1024. [INFO] Running org.openmrs.module.fhir2.api.search.MedicationRequestSearchQueryTest
  1025. [INFO] Tests run: 42, Failures: 0, Errors: 0, Skipped: 0, Time elapsed: 6.277 s - in org.openmrs.module.fhir2.api.search.MedicationRequestSearchQueryTest
  1026. [INFO] Running org.openmrs.module.fhir2.api.search.MedicationSearchQueryTest
  1027. [INFO] Tests run: 12, Failures: 0, Errors: 0, Skipped: 0, Time elapsed: 0.733 s - in org.openmrs.module.fhir2.api.search.MedicationSearchQueryTest
  1028. [INFO] Running org.openmrs.module.fhir2.api.search.ObservationSearchQueryTest
  1029. [INFO] Tests run: 51, Failures: 0, Errors: 0, Skipped: 0, Time elapsed: 7.534 s - in org.openmrs.module.fhir2.api.search.ObservationSearchQueryTest
  1030. [INFO] Running org.openmrs.module.fhir2.api.search.param.SearchParameterMapTest
  1031. [INFO] Tests run: 9, Failures: 0, Errors: 0, Skipped: 0, Time elapsed: 0.02 s - in org.openmrs.module.fhir2.api.search.param.SearchParameterMapTest
  1032. [INFO] Running org.openmrs.module.fhir2.api.search.PatientSearchQueryTest
  1033. [INFO] Tests run: 36, Failures: 0, Errors: 0, Skipped: 0, Time elapsed: 2.759 s - in org.openmrs.module.fhir2.api.search.PatientSearchQueryTest
  1034. [INFO] Running org.openmrs.module.fhir2.api.search.PersonSearchQueryTest
  1035. [INFO] Tests run: 22, Failures: 0, Errors: 0, Skipped: 0, Time elapsed: 1.137 s - in org.openmrs.module.fhir2.api.search.PersonSearchQueryTest
  1036. [INFO] Running org.openmrs.module.fhir2.api.search.PractitionerSearchQueryTest
  1037. [INFO] Tests run: 26, Failures: 0, Errors: 0, Skipped: 0, Time elapsed: 0.908 s - in org.openmrs.module.fhir2.api.search.PractitionerSearchQueryTest
  1038. [INFO] Running org.openmrs.module.fhir2.api.search.RelatedPersonSearchQueryTest
  1039. [INFO] Tests run: 23, Failures: 0, Errors: 0, Skipped: 0, Time elapsed: 1.145 s - in org.openmrs.module.fhir2.api.search.RelatedPersonSearchQueryTest
  1040. [INFO] Running org.openmrs.module.fhir2.api.search.SearchQueryBundleProviderTest
  1041. [INFO] Tests run: 3, Failures: 0, Errors: 0, Skipped: 0, Time elapsed: 0.131 s - in org.openmrs.module.fhir2.api.search.SearchQueryBundleProviderTest
  1042. [INFO] Running org.openmrs.module.fhir2.api.search.ServiceRequestSearchQueryTest
  1043. [INFO] Tests run: 44, Failures: 0, Errors: 0, Skipped: 0, Time elapsed: 5.167 s - in org.openmrs.module.fhir2.api.search.ServiceRequestSearchQueryTest
  1044. [INFO] Running org.openmrs.module.fhir2.api.search.TaskSearchQueryTest
  1045. [INFO] Tests run: 18, Failures: 0, Errors: 0, Skipped: 0, Time elapsed: 1.027 s - in org.openmrs.module.fhir2.api.search.TaskSearchQueryTest
  1046. [INFO] Running org.openmrs.module.fhir2.api.search.UserSearchQueryTest
  1047. [INFO] Tests run: 25, Failures: 0, Errors: 0, Skipped: 0, Time elapsed: 0.693 s - in org.openmrs.module.fhir2.api.search.UserSearchQueryTest
  1048. [INFO] Running org.openmrs.module.fhir2.api.translators.impl.AbstractProvenanceHandlingTranslatorTest
  1049. [INFO] Tests run: 7, Failures: 0, Errors: 0, Skipped: 0, Time elapsed: 0.031 s - in org.openmrs.module.fhir2.api.translators.impl.AbstractProvenanceHandlingTranslatorTest
  1050. [INFO] Running org.openmrs.module.fhir2.api.translators.impl.AllergyIntoleranceCategoryTranslatorImplTest
  1051. [INFO] Tests run: 9, Failures: 0, Errors: 0, Skipped: 0, Time elapsed: 0.009 s - in org.openmrs.module.fhir2.api.translators.impl.AllergyIntoleranceCategoryTranslatorImplTest
  1052. [INFO] Running org.openmrs.module.fhir2.api.translators.impl.AllergyIntoleranceCriticalityTranslatorImplTest
  1053. [INFO] Tests run: 4, Failures: 0, Errors: 0, Skipped: 0, Time elapsed: 0.01 s - in org.openmrs.module.fhir2.api.translators.impl.AllergyIntoleranceCriticalityTranslatorImplTest
  1054. [INFO] Running org.openmrs.module.fhir2.api.translators.impl.AllergyIntoleranceReactionComponentTranslatorImplTest
  1055. [INFO] Tests run: 13, Failures: 0, Errors: 0, Skipped: 0, Time elapsed: 0.091 s - in org.openmrs.module.fhir2.api.translators.impl.AllergyIntoleranceReactionComponentTranslatorImplTest
  1056. [INFO] Running org.openmrs.module.fhir2.api.translators.impl.AllergyIntoleranceSeverityTranslatorImplTest
  1057. [INFO] Tests run: 8, Failures: 0, Errors: 0, Skipped: 0, Time elapsed: 0.047 s - in org.openmrs.module.fhir2.api.translators.impl.AllergyIntoleranceSeverityTranslatorImplTest
  1058. [INFO] Running org.openmrs.module.fhir2.api.translators.impl.AllergyIntoleranceTranslatorImplTest
  1059. [INFO] Tests run: 40, Failures: 0, Errors: 0, Skipped: 0, Time elapsed: 0.229 s - in org.openmrs.module.fhir2.api.translators.impl.AllergyIntoleranceTranslatorImplTest
  1060. [INFO] Running org.openmrs.module.fhir2.api.translators.impl.BaseReferenceHandlingTranslatorTest
  1061. [INFO] Tests run: 19, Failures: 0, Errors: 0, Skipped: 0, Time elapsed: 0.05 s - in org.openmrs.module.fhir2.api.translators.impl.BaseReferenceHandlingTranslatorTest
  1062. [INFO] Running org.openmrs.module.fhir2.api.translators.impl.CohortListEntryTranslatorImplTest
  1063. [INFO] Tests run: 2, Failures: 0, Errors: 0, Skipped: 0, Time elapsed: 0.007 s - in org.openmrs.module.fhir2.api.translators.impl.CohortListEntryTranslatorImplTest
  1064. [INFO] Running org.openmrs.module.fhir2.api.translators.impl.ConceptTranslatorImplTest
  1065. [INFO] Tests run: 12, Failures: 0, Errors: 0, Skipped: 0, Time elapsed: 1.088 s - in org.openmrs.module.fhir2.api.translators.impl.ConceptTranslatorImplTest
  1066. [INFO] Running org.openmrs.module.fhir2.api.translators.impl.DiagnosticReportTranslatorImplTest
  1067. [INFO] Tests run: 24, Failures: 0, Errors: 0, Skipped: 0, Time elapsed: 0.129 s - in org.openmrs.module.fhir2.api.translators.impl.DiagnosticReportTranslatorImplTest
  1068. [INFO] Running org.openmrs.module.fhir2.api.translators.impl.DosageTranslatorImplTest
  1069. [INFO] Tests run: 5, Failures: 0, Errors: 0, Skipped: 0, Time elapsed: 0.051 s - in org.openmrs.module.fhir2.api.translators.impl.DosageTranslatorImplTest
  1070. [INFO] Running org.openmrs.module.fhir2.api.translators.impl.EncounterLocationTranslatorImplTest
  1071. [INFO] Tests run: 4, Failures: 0, Errors: 0, Skipped: 0, Time elapsed: 0.013 s - in org.openmrs.module.fhir2.api.translators.impl.EncounterLocationTranslatorImplTest
  1072. [INFO] Running org.openmrs.module.fhir2.api.translators.impl.EncounterParticipantTranslatorImplTest
  1073. [INFO] Tests run: 5, Failures: 0, Errors: 0, Skipped: 0, Time elapsed: 0.029 s - in org.openmrs.module.fhir2.api.translators.impl.EncounterParticipantTranslatorImplTest
  1074. [INFO] Running org.openmrs.module.fhir2.api.translators.impl.EncounterReferenceTranslatorImplTest
  1075. [INFO] Tests run: 7, Failures: 0, Errors: 0, Skipped: 0, Time elapsed: 0.016 s - in org.openmrs.module.fhir2.api.translators.impl.EncounterReferenceTranslatorImplTest
  1076. [INFO] Running org.openmrs.module.fhir2.api.translators.impl.EncounterTranslatorImplTest
  1077. [INFO] Tests run: 16, Failures: 0, Errors: 0, Skipped: 0, Time elapsed: 0.079 s - in org.openmrs.module.fhir2.api.translators.impl.EncounterTranslatorImplTest
  1078. [INFO] Running org.openmrs.module.fhir2.api.translators.impl.FhirTaskTranslatorImplTest
  1079. [INFO] Tests run: 39, Failures: 0, Errors: 0, Skipped: 0, Time elapsed: 0.827 s - in org.openmrs.module.fhir2.api.translators.impl.FhirTaskTranslatorImplTest
  1080. [INFO] Running org.openmrs.module.fhir2.api.translators.impl.GenderTranslatorImplTest
  1081. [INFO] Tests run: 12, Failures: 0, Errors: 0, Skipped: 0, Time elapsed: 0.002 s - in org.openmrs.module.fhir2.api.translators.impl.GenderTranslatorImplTest
  1082. [INFO] Running org.openmrs.module.fhir2.api.translators.impl.ListTranslatorImplTest
  1083. [INFO] Tests run: 13, Failures: 0, Errors: 0, Skipped: 0, Time elapsed: 0.069 s - in org.openmrs.module.fhir2.api.translators.impl.ListTranslatorImplTest
  1084. [INFO] Running org.openmrs.module.fhir2.api.translators.impl.LocationAddressTranslatorImplTest
  1085. [INFO] Tests run: 26, Failures: 0, Errors: 0, Skipped: 0, Time elapsed: 0.07 s - in org.openmrs.module.fhir2.api.translators.impl.LocationAddressTranslatorImplTest
  1086. [INFO] Running org.openmrs.module.fhir2.api.translators.impl.LocationTranslatorImplTest
  1087. [INFO] Tests run: 29, Failures: 0, Errors: 0, Skipped: 0, Time elapsed: 0.434 s - in org.openmrs.module.fhir2.api.translators.impl.LocationTranslatorImplTest
  1088. [INFO] Running org.openmrs.module.fhir2.api.translators.impl.MedicationReferenceTranslatorImplTest
  1089. [INFO] Tests run: 6, Failures: 0, Errors: 0, Skipped: 0, Time elapsed: 0.045 s - in org.openmrs.module.fhir2.api.translators.impl.MedicationReferenceTranslatorImplTest
  1090. [INFO] Running org.openmrs.module.fhir2.api.translators.impl.MedicationRequestPriorityTranslatorImplTest
  1091. [INFO] Tests run: 8, Failures: 0, Errors: 0, Skipped: 0, Time elapsed: 0.001 s - in org.openmrs.module.fhir2.api.translators.impl.MedicationRequestPriorityTranslatorImplTest
  1092. [INFO] Running org.openmrs.module.fhir2.api.translators.impl.MedicationRequestStatusTranslatorImplTest
  1093. [INFO] Tests run: 2, Failures: 0, Errors: 0, Skipped: 0, Time elapsed: 0.001 s - in org.openmrs.module.fhir2.api.translators.impl.MedicationRequestStatusTranslatorImplTest
  1094. [INFO] Running org.openmrs.module.fhir2.api.translators.impl.MedicationRequestTimingComponentTranslatorImplTest
  1095. [INFO] Tests run: 7, Failures: 0, Errors: 0, Skipped: 0, Time elapsed: 0.002 s - in org.openmrs.module.fhir2.api.translators.impl.MedicationRequestTimingComponentTranslatorImplTest
  1096. [INFO] Running org.openmrs.module.fhir2.api.translators.impl.MedicationRequestTimingTranslatorImplTest
  1097. [INFO] Tests run: 3, Failures: 0, Errors: 0, Skipped: 0, Time elapsed: 0.001 s - in org.openmrs.module.fhir2.api.translators.impl.MedicationRequestTimingTranslatorImplTest
  1098. [INFO] Running org.openmrs.module.fhir2.api.translators.impl.MedicationRequestTranslatorImplTest
  1099. [INFO] Tests run: 20, Failures: 0, Errors: 0, Skipped: 0, Time elapsed: 0.076 s - in org.openmrs.module.fhir2.api.translators.impl.MedicationRequestTranslatorImplTest
  1100. [INFO] Running org.openmrs.module.fhir2.api.translators.impl.MedicationTranslatorImplTest
  1101. [INFO] Tests run: 23, Failures: 0, Errors: 0, Skipped: 0, Time elapsed: 0.024 s - in org.openmrs.module.fhir2.api.translators.impl.MedicationTranslatorImplTest
  1102. [INFO] Running org.openmrs.module.fhir2.api.translators.impl.ObservationBasedOnReferenceTranslatorImplTest
  1103. [INFO] Tests run: 10, Failures: 0, Errors: 0, Skipped: 0, Time elapsed: 0.013 s - in org.openmrs.module.fhir2.api.translators.impl.ObservationBasedOnReferenceTranslatorImplTest
  1104. [INFO] Running org.openmrs.module.fhir2.api.translators.impl.ObservationComponentTranslatorImplTest
  1105. [INFO] Tests run: 10, Failures: 0, Errors: 0, Skipped: 0, Time elapsed: 0.028 s - in org.openmrs.module.fhir2.api.translators.impl.ObservationComponentTranslatorImplTest
  1106. [INFO] Running org.openmrs.module.fhir2.api.translators.impl.ObservationEffectiveDatetimeTranslatorImplTest
  1107. [INFO] Tests run: 5, Failures: 0, Errors: 0, Skipped: 0, Time elapsed: 0.008 s - in org.openmrs.module.fhir2.api.translators.impl.ObservationEffectiveDatetimeTranslatorImplTest
  1108. [INFO] Running org.openmrs.module.fhir2.api.translators.impl.ObservationInterpretationTranslatorImplTest
  1109. [INFO] Tests run: 2, Failures: 0, Errors: 0, Skipped: 0, Time elapsed: 0.025 s - in org.openmrs.module.fhir2.api.translators.impl.ObservationInterpretationTranslatorImplTest
  1110. [INFO] Running org.openmrs.module.fhir2.api.translators.impl.ObservationReferenceRangeTranslatorImplTest
  1111. [INFO] Tests run: 6, Failures: 0, Errors: 0, Skipped: 0, Time elapsed: 0.018 s - in org.openmrs.module.fhir2.api.translators.impl.ObservationReferenceRangeTranslatorImplTest
  1112. [INFO] Running org.openmrs.module.fhir2.api.translators.impl.ObservationReferenceTranslatorImplTest
  1113. [INFO] Tests run: 6, Failures: 0, Errors: 0, Skipped: 0, Time elapsed: 0.017 s - in org.openmrs.module.fhir2.api.translators.impl.ObservationReferenceTranslatorImplTest
  1114. [INFO] Running org.openmrs.module.fhir2.api.translators.impl.ObservationStatusTranslatorImplTest
  1115. [INFO] Tests run: 2, Failures: 0, Errors: 0, Skipped: 0, Time elapsed: 0.006 s - in org.openmrs.module.fhir2.api.translators.impl.ObservationStatusTranslatorImplTest
  1116. [INFO] Running org.openmrs.module.fhir2.api.translators.impl.ObservationTranslatorImplTest
  1117. [INFO] Tests run: 24, Failures: 0, Errors: 0, Skipped: 0, Time elapsed: 0.151 s - in org.openmrs.module.fhir2.api.translators.impl.ObservationTranslatorImplTest
  1118. [INFO] Running org.openmrs.module.fhir2.api.translators.impl.ObservationValueTranslatorImplTest
  1119. [INFO] Tests run: 14, Failures: 0, Errors: 0, Skipped: 0, Time elapsed: 6.8 s - in org.openmrs.module.fhir2.api.translators.impl.ObservationValueTranslatorImplTest
  1120. [INFO] Running org.openmrs.module.fhir2.api.translators.impl.PatientIdentifierTranslatorImplTest
  1121. [INFO] Tests run: 8, Failures: 0, Errors: 0, Skipped: 0, Time elapsed: 0.07 s - in org.openmrs.module.fhir2.api.translators.impl.PatientIdentifierTranslatorImplTest
  1122. [INFO] Running org.openmrs.module.fhir2.api.translators.impl.PatientReferenceTranslatorImplTest
  1123. [INFO] Tests run: 7, Failures: 0, Errors: 0, Skipped: 0, Time elapsed: 0.001 s - in org.openmrs.module.fhir2.api.translators.impl.PatientReferenceTranslatorImplTest
  1124. [INFO] Running org.openmrs.module.fhir2.api.translators.impl.PatientTranslatorImplTest
  1125. [INFO] Tests run: 24, Failures: 0, Errors: 0, Skipped: 0, Time elapsed: 0.159 s - in org.openmrs.module.fhir2.api.translators.impl.PatientTranslatorImplTest
  1126. [INFO] Running org.openmrs.module.fhir2.api.translators.impl.PersonAddressTranslatorImplTest
  1127. [INFO] Tests run: 31, Failures: 0, Errors: 0, Skipped: 0, Time elapsed: 0.025 s - in org.openmrs.module.fhir2.api.translators.impl.PersonAddressTranslatorImplTest
  1128. [INFO] Running org.openmrs.module.fhir2.api.translators.impl.PersonNameTranslatorImplTest
  1129. [INFO] Tests run: 19, Failures: 0, Errors: 0, Skipped: 0, Time elapsed: 0.015 s - in org.openmrs.module.fhir2.api.translators.impl.PersonNameTranslatorImplTest
  1130. [INFO] Running org.openmrs.module.fhir2.api.translators.impl.PersonTranslatorImplTest
  1131. [INFO] Tests run: 20, Failures: 0, Errors: 0, Skipped: 0, Time elapsed: 0.299 s - in org.openmrs.module.fhir2.api.translators.impl.PersonTranslatorImplTest
  1132. [INFO] Running org.openmrs.module.fhir2.api.translators.impl.PractitionerReferenceTranslatorProviderImplTest
  1133. [INFO] Tests run: 5, Failures: 0, Errors: 0, Skipped: 0, Time elapsed: 0.01 s - in org.openmrs.module.fhir2.api.translators.impl.PractitionerReferenceTranslatorProviderImplTest
  1134. [INFO] Running org.openmrs.module.fhir2.api.translators.impl.PractitionerReferenceTranslatorUserImplTest
  1135. [INFO] Tests run: 5, Failures: 0, Errors: 0, Skipped: 0, Time elapsed: 0.001 s - in org.openmrs.module.fhir2.api.translators.impl.PractitionerReferenceTranslatorUserImplTest
  1136. [INFO] Running org.openmrs.module.fhir2.api.translators.impl.PractitionerTranslatorProviderImplTest
  1137. [INFO] Tests run: 12, Failures: 0, Errors: 0, Skipped: 0, Time elapsed: 0.002 s - in org.openmrs.module.fhir2.api.translators.impl.PractitionerTranslatorProviderImplTest
  1138. [INFO] Running org.openmrs.module.fhir2.api.translators.impl.PractitionerTranslatorUserImplTest
  1139. [INFO] Tests run: 10, Failures: 0, Errors: 0, Skipped: 0, Time elapsed: 0.001 s - in org.openmrs.module.fhir2.api.translators.impl.PractitionerTranslatorUserImplTest
  1140. [INFO] Running org.openmrs.module.fhir2.api.translators.impl.ProvenanceTranslatorImplTest
  1141. [INFO] Tests run: 28, Failures: 0, Errors: 0, Skipped: 0, Time elapsed: 0.001 s - in org.openmrs.module.fhir2.api.translators.impl.ProvenanceTranslatorImplTest
  1142. [INFO] Running org.openmrs.module.fhir2.api.translators.impl.ReferenceTranslatorImplTest
  1143. [INFO] Tests run: 6, Failures: 0, Errors: 0, Skipped: 0, Time elapsed: 0.001 s - in org.openmrs.module.fhir2.api.translators.impl.ReferenceTranslatorImplTest
  1144. [INFO] Running org.openmrs.module.fhir2.api.translators.impl.RelatedPersonTranslatorImplTest
  1145. [INFO] Tests run: 14, Failures: 0, Errors: 0, Skipped: 0, Time elapsed: 0.002 s - in org.openmrs.module.fhir2.api.translators.impl.RelatedPersonTranslatorImplTest
  1146. [INFO] Running org.openmrs.module.fhir2.api.translators.impl.ServiceRequestTranslatorImplTest
  1147. [INFO] Tests run: 18, Failures: 0, Errors: 0, Skipped: 0, Time elapsed: 0.002 s - in org.openmrs.module.fhir2.api.translators.impl.ServiceRequestTranslatorImplTest
  1148. [INFO] Running org.openmrs.module.fhir2.api.translators.impl.TelecomTranslatorImplTest
  1149. [INFO] Tests run: 26, Failures: 0, Errors: 0, Skipped: 0, Time elapsed: 0.004 s - in org.openmrs.module.fhir2.api.translators.impl.TelecomTranslatorImplTest
  1150. [INFO] Running org.openmrs.module.fhir2.providers.r3.AllergyIntoleranceFhirR3ResourceProviderTest
  1151. [INFO] Tests run: 24, Failures: 0, Errors: 0, Skipped: 0, Time elapsed: 1.262 s - in org.openmrs.module.fhir2.providers.r3.AllergyIntoleranceFhirR3ResourceProviderTest
  1152. [INFO] Running org.openmrs.module.fhir2.providers.r3.ConditionFhirR3ResourceProviderTest
  1153. [INFO] Tests run: 8, Failures: 0, Errors: 0, Skipped: 0, Time elapsed: 0.095 s - in org.openmrs.module.fhir2.providers.r3.ConditionFhirR3ResourceProviderTest
  1154. [INFO] Running org.openmrs.module.fhir2.providers.r3.DiagnosticReportFhirResourceProviderTest
  1155. [INFO] Tests run: 12, Failures: 0, Errors: 0, Skipped: 0, Time elapsed: 0.096 s - in org.openmrs.module.fhir2.providers.r3.DiagnosticReportFhirResourceProviderTest
  1156. [INFO] Running org.openmrs.module.fhir2.providers.r3.EncounterFhirResourceProviderTest
  1157. [INFO] Tests run: 14, Failures: 0, Errors: 0, Skipped: 0, Time elapsed: 0.199 s - in org.openmrs.module.fhir2.providers.r3.EncounterFhirResourceProviderTest
  1158. [INFO] Running org.openmrs.module.fhir2.providers.r3.ListFhirResourceProviderTest
  1159. [INFO] Tests run: 10, Failures: 0, Errors: 0, Skipped: 0, Time elapsed: 0.001 s - in org.openmrs.module.fhir2.providers.r3.ListFhirResourceProviderTest
  1160. [INFO] Running org.openmrs.module.fhir2.providers.r3.LocationFhirResourceProviderTest
  1161. [INFO] Tests run: 27, Failures: 0, Errors: 0, Skipped: 0, Time elapsed: 0.2 s - in org.openmrs.module.fhir2.providers.r3.LocationFhirResourceProviderTest
  1162. [INFO] Running org.openmrs.module.fhir2.providers.r3.MedicationFhirResourceProviderTest
  1163. [INFO] Tests run: 15, Failures: 0, Errors: 0, Skipped: 0, Time elapsed: 0.085 s - in org.openmrs.module.fhir2.providers.r3.MedicationFhirResourceProviderTest
  1164. [INFO] Running org.openmrs.module.fhir2.providers.r3.MedicationRequestFhirResourceProviderTest
  1165. [INFO] Tests run: 17, Failures: 0, Errors: 0, Skipped: 0, Time elapsed: 0.048 s - in org.openmrs.module.fhir2.providers.r3.MedicationRequestFhirResourceProviderTest
  1166. [INFO] Running org.openmrs.module.fhir2.providers.r3.ObservationFhirResourceProviderTest
  1167. [INFO] Tests run: 15, Failures: 0, Errors: 0, Skipped: 0, Time elapsed: 0.066 s - in org.openmrs.module.fhir2.providers.r3.ObservationFhirResourceProviderTest
  1168. [INFO] Running org.openmrs.module.fhir2.providers.r3.PatientFhirResourceProviderTest
  1169. [INFO] Tests run: 27, Failures: 0, Errors: 0, Skipped: 0, Time elapsed: 0.447 s - in org.openmrs.module.fhir2.providers.r3.PatientFhirResourceProviderTest
  1170. [INFO] Running org.openmrs.module.fhir2.providers.r3.PersonFhirResourceProviderTest
  1171. [INFO] Tests run: 22, Failures: 0, Errors: 0, Skipped: 0, Time elapsed: 0.256 s - in org.openmrs.module.fhir2.providers.r3.PersonFhirResourceProviderTest
  1172. [INFO] Running org.openmrs.module.fhir2.providers.r3.PractitionerFhirResourceProviderTest
  1173. [INFO] Tests run: 33, Failures: 0, Errors: 0, Skipped: 0, Time elapsed: 0.197 s - in org.openmrs.module.fhir2.providers.r3.PractitionerFhirResourceProviderTest
  1174. [INFO] Running org.openmrs.module.fhir2.providers.r3.ProcedureRequestFhirResourceProviderTest
  1175. [INFO] Tests run: 18, Failures: 0, Errors: 0, Skipped: 0, Time elapsed: 0.048 s - in org.openmrs.module.fhir2.providers.r3.ProcedureRequestFhirResourceProviderTest
  1176. [INFO] Running org.openmrs.module.fhir2.providers.r3.RelatedPersonFhirResourceProviderTest
  1177. [INFO] Tests run: 12, Failures: 0, Errors: 0, Skipped: 0, Time elapsed: 0.004 s - in org.openmrs.module.fhir2.providers.r3.RelatedPersonFhirResourceProviderTest
  1178. [INFO] Running org.openmrs.module.fhir2.providers.r3.TaskFhirResourceProviderTest
  1179. [INFO] Tests run: 14, Failures: 0, Errors: 0, Skipped: 0, Time elapsed: 0.126 s - in org.openmrs.module.fhir2.providers.r3.TaskFhirResourceProviderTest
  1180. [INFO] Running org.openmrs.module.fhir2.providers.r4.AllergyIntoleranceFhirResourceProviderTest
  1181. [INFO] Tests run: 24, Failures: 0, Errors: 0, Skipped: 0, Time elapsed: 0.005 s - in org.openmrs.module.fhir2.providers.r4.AllergyIntoleranceFhirResourceProviderTest
  1182. [INFO] Running org.openmrs.module.fhir2.providers.r4.ConditionFhirResourceProviderTest
  1183. [INFO] Tests run: 8, Failures: 0, Errors: 0, Skipped: 0, Time elapsed: 0.065 s - in org.openmrs.module.fhir2.providers.r4.ConditionFhirResourceProviderTest
  1184. [INFO] Running org.openmrs.module.fhir2.providers.r4.DiagnosticReportFhirResourceProviderTest
  1185. [INFO] Tests run: 12, Failures: 0, Errors: 0, Skipped: 0, Time elapsed: 0.002 s - in org.openmrs.module.fhir2.providers.r4.DiagnosticReportFhirResourceProviderTest
  1186. [INFO] Running org.openmrs.module.fhir2.providers.r4.EncounterFhirResourceProviderTest
  1187. [INFO] Tests run: 14, Failures: 0, Errors: 0, Skipped: 0, Time elapsed: 0.002 s - in org.openmrs.module.fhir2.providers.r4.EncounterFhirResourceProviderTest
  1188. [INFO] Running org.openmrs.module.fhir2.providers.r4.ListFhirResourceProviderTest
  1189. [INFO] Tests run: 10, Failures: 0, Errors: 0, Skipped: 0, Time elapsed: 0.002 s - in org.openmrs.module.fhir2.providers.r4.ListFhirResourceProviderTest
  1190. [INFO] Running org.openmrs.module.fhir2.providers.r4.LocationFhirResourceProviderTest
  1191. [INFO] Tests run: 27, Failures: 0, Errors: 0, Skipped: 0, Time elapsed: 0.002 s - in org.openmrs.module.fhir2.providers.r4.LocationFhirResourceProviderTest
  1192. [INFO] Running org.openmrs.module.fhir2.providers.r4.MedicationFhirResourceProviderTest
  1193. [INFO] Tests run: 15, Failures: 0, Errors: 0, Skipped: 0, Time elapsed: 0.003 s - in org.openmrs.module.fhir2.providers.r4.MedicationFhirResourceProviderTest
  1194. [INFO] Running org.openmrs.module.fhir2.providers.r4.MedicationRequestFhirResourceProviderTest
  1195. [INFO] Tests run: 17, Failures: 0, Errors: 0, Skipped: 0, Time elapsed: 0.002 s - in org.openmrs.module.fhir2.providers.r4.MedicationRequestFhirResourceProviderTest
  1196. [INFO] Running org.openmrs.module.fhir2.providers.r4.ObservationFhirResourceProviderTest
  1197. [INFO] Tests run: 15, Failures: 0, Errors: 0, Skipped: 0, Time elapsed: 0.004 s - in org.openmrs.module.fhir2.providers.r4.ObservationFhirResourceProviderTest
  1198. [INFO] Running org.openmrs.module.fhir2.providers.r4.PatientFhirResourceProviderTest
  1199. [INFO] Tests run: 27, Failures: 0, Errors: 0, Skipped: 0, Time elapsed: 0.085 s - in org.openmrs.module.fhir2.providers.r4.PatientFhirResourceProviderTest
  1200. [INFO] Running org.openmrs.module.fhir2.providers.r4.PersonFhirResourceProviderTest
  1201. [INFO] Tests run: 22, Failures: 0, Errors: 0, Skipped: 0, Time elapsed: 0.027 s - in org.openmrs.module.fhir2.providers.r4.PersonFhirResourceProviderTest
  1202. [INFO] Running org.openmrs.module.fhir2.providers.r4.PractitionerFhirResourceProviderTest
  1203. [INFO] Tests run: 33, Failures: 0, Errors: 0, Skipped: 0, Time elapsed: 0.058 s - in org.openmrs.module.fhir2.providers.r4.PractitionerFhirResourceProviderTest
  1204. [INFO] Running org.openmrs.module.fhir2.providers.r4.RelatedPersonFhirResourceProviderTest
  1205. [INFO] Tests run: 12, Failures: 0, Errors: 0, Skipped: 0, Time elapsed: 0.035 s - in org.openmrs.module.fhir2.providers.r4.RelatedPersonFhirResourceProviderTest
  1206. [INFO] Running org.openmrs.module.fhir2.providers.r4.ServiceRequestFhirResourceProviderTest
  1207. [INFO] Tests run: 18, Failures: 0, Errors: 0, Skipped: 0, Time elapsed: 0.033 s - in org.openmrs.module.fhir2.providers.r4.ServiceRequestFhirResourceProviderTest
  1208. [INFO] Running org.openmrs.module.fhir2.providers.r4.TaskFhirResourceProviderTest
  1209. [INFO] Tests run: 14, Failures: 0, Errors: 0, Skipped: 0, Time elapsed: 0.002 s - in org.openmrs.module.fhir2.providers.r4.TaskFhirResourceProviderTest
  1210. [INFO]
  1211. [INFO] Results:
  1212. [INFO]
  1213. [INFO] Tests run: 1950, Failures: 0, Errors: 0, Skipped: 0
  1214. [INFO]
  1215. [INFO]
  1216. [INFO] --- jacoco-maven-plugin:0.8.2:report (report) @ fhir2-api ---
  1217. [INFO] Loading execution data file C:\Users\Cliff\Desktop\project\openmrs-module-fhir2\api\target\jacoco.exec
  1218. [INFO] Analyzed bundle 'FHIR2 API' with 157 classes
  1219. [INFO]
  1220. [INFO] --- maven-jar-plugin:3.2.0:jar (default-jar) @ fhir2-api ---
  1221. [INFO] Building jar: C:\Users\Cliff\Desktop\project\openmrs-module-fhir2\api\target\fhir2-api-1.0.0-SNAPSHOT.jar
  1222. [INFO]
  1223. [INFO] --- maven-jar-plugin:3.2.0:test-jar (default) @ fhir2-api ---
  1224. [INFO] Building jar: C:\Users\Cliff\Desktop\project\openmrs-module-fhir2\api\target\fhir2-api-1.0.0-SNAPSHOT-tests.jar
  1225. [INFO]
  1226. [INFO] --- maven-install-plugin:2.4:install (default-install) @ fhir2-api ---
  1227. [INFO] Installing C:\Users\Cliff\Desktop\project\openmrs-module-fhir2\api\target\fhir2-api-1.0.0-SNAPSHOT.jar to C:\Users\Cliff\.m2\repository\org\openmrs\module\fhir2-api\1.0.0-SNAPSHOT\fhir2-api-1.0.0-SNAPSHOT.jar
  1228. [INFO] Installing C:\Users\Cliff\Desktop\project\openmrs-module-fhir2\api\pom.xml to C:\Users\Cliff\.m2\repository\org\openmrs\module\fhir2-api\1.0.0-SNAPSHOT\fhir2-api-1.0.0-SNAPSHOT.pom
  1229. [INFO] Installing C:\Users\Cliff\Desktop\project\openmrs-module-fhir2\api\target\fhir2-api-1.0.0-SNAPSHOT-tests.jar to C:\Users\Cliff\.m2\repository\org\openmrs\module\fhir2-api\1.0.0-SNAPSHOT\fhir2-api-1.0.0-SNAPSHOT-tests.jar
  1230. [INFO]
  1231. [INFO] ------------------< org.openmrs.module:fhir2-api-2.1 >------------------
  1232. [INFO] Building FHIR2 API 2.1 1.0.0-SNAPSHOT [4/7]
  1233. [INFO] --------------------------------[ jar ]---------------------------------
  1234. [INFO]
  1235. [INFO] --- maven-clean-plugin:2.5:clean (default-clean) @ fhir2-api-2.1 ---
  1236. [INFO] Deleting C:\Users\Cliff\Desktop\project\openmrs-module-fhir2\api-2.1\target
  1237. [INFO]
  1238. [INFO] --- directory-maven-plugin:0.1:highest-basedir (directories) @ fhir2-api-2.1 ---
  1239. [INFO] Highest basedir set to: C:\Users\Cliff\Desktop\project\openmrs-module-fhir2
  1240. [INFO]
  1241. [INFO] --- license-maven-plugin:3.0:format (add-license) @ fhir2-api-2.1 ---
  1242. [INFO] Updating license headers...
  1243. [INFO]
  1244. [INFO] --- jacoco-maven-plugin:0.8.2:prepare-agent (default) @ fhir2-api-2.1 ---
  1245. [INFO] argLine set to -javaagent:C:\\Users\\Cliff\\.m2\\repository\\org\\jacoco\\org.jacoco.agent\\0.8.2\\org.jacoco.agent-0.8.2-runtime.jar=destfile=C:\\Users\\Cliff\\Desktop\\project\\openmrs-module-fhir2\\api-2.1\\target\\jacoco.exec
  1246. [INFO]
  1247. [INFO] --- formatter-maven-plugin:2.11.0:format (default) @ fhir2-api-2.1 ---
  1248. [INFO] Using 'UTF-8' encoding to format source files.
  1249. [INFO] Number of files to be formatted: 6
  1250. [INFO] Successfully formatted: 0 file(s)
  1251. [INFO] Fail to format: 0 file(s)
  1252. [INFO] Skipped: 6 file(s)
  1253. [INFO] Read only skipped: 0 file(s)
  1254. [INFO] Approximate time taken: 1s
  1255. [INFO]
  1256. [INFO] --- impsort-maven-plugin:1.3.2:sort (default) @ fhir2-api-2.1 ---
  1257. [INFO] Total Files Processed: 6 in 00:00.087
  1258. [INFO] Already Sorted: 6
  1259. [INFO] Needed Sorting: 0
  1260. [INFO]
  1261. [INFO] --- maven-resources-plugin:2.6:resources (default-resources) @ fhir2-api-2.1 ---
  1262. [INFO] Using 'UTF-8' encoding to copy filtered resources.
  1263. [INFO] skip non existing resourceDirectory C:\Users\Cliff\Desktop\project\openmrs-module-fhir2\api-2.1\src\main\resources
  1264. [INFO] skip non existing resourceDirectory C:\Users\Cliff\Desktop\project\openmrs-module-fhir2\api-2.1\src\main\resources
  1265. [INFO] skip non existing resourceDirectory C:\Users\Cliff\Desktop\project\openmrs-module-fhir2\api-2.1\src\main\webapp
  1266. [INFO] skip non existing resourceDirectory C:\Users\Cliff\Desktop\project\openmrs-module-fhir2\api-2.1\src\main\webapp
  1267. [INFO]
  1268. [INFO] --- maven-compiler-plugin:3.1:compile (default-compile) @ fhir2-api-2.1 ---
  1269. [INFO] Changes detected - recompiling the module!
  1270. [INFO] Compiling 3 source files to C:\Users\Cliff\Desktop\project\openmrs-module-fhir2\api-2.1\target\classes
  1271. [INFO]
  1272. [INFO] --- maven-resources-plugin:2.6:testResources (default-testResources) @ fhir2-api-2.1 ---
  1273. [INFO] Using 'UTF-8' encoding to copy filtered resources.
  1274. [INFO] skip non existing resourceDirectory C:\Users\Cliff\Desktop\project\openmrs-module-fhir2\api-2.1\src\test\resources
  1275. [INFO] skip non existing resourceDirectory C:\Users\Cliff\Desktop\project\openmrs-module-fhir2\api-2.1\src\test\resources
  1276. [INFO]
  1277. [INFO] --- maven-compiler-plugin:3.1:testCompile (default-testCompile) @ fhir2-api-2.1 ---
  1278. [INFO] Changes detected - recompiling the module!
  1279. [INFO] Compiling 3 source files to C:\Users\Cliff\Desktop\project\openmrs-module-fhir2\api-2.1\target\test-classes
  1280. [INFO]
  1281. [INFO] --- maven-surefire-plugin:3.0.0-M4:test (default-test) @ fhir2-api-2.1 ---
  1282. [INFO]
  1283. [INFO] -------------------------------------------------------
  1284. [INFO] T E S T S
  1285. [INFO] -------------------------------------------------------
  1286. [INFO] Running org.openmrs.module.fhir2.api.translators.impl.CohortListEntryTranslatorImpl_2_1Test
  1287. [INFO] Tests run: 7, Failures: 0, Errors: 0, Skipped: 0, Time elapsed: 4.744 s - in org.openmrs.module.fhir2.api.translators.impl.CohortListEntryTranslatorImpl_2_1Test
  1288. [INFO] Running org.openmrs.module.fhir2.api.translators.impl.ObservationInterpretationTranslatorImpl_2_1Test
  1289. [INFO] Tests run: 36, Failures: 0, Errors: 0, Skipped: 0, Time elapsed: 0.116 s - in org.openmrs.module.fhir2.api.translators.impl.ObservationInterpretationTranslatorImpl_2_1Test
  1290. [INFO] Running org.openmrs.module.fhir2.api.translators.impl.ObservationStatusTranslatorImpl_2_1Test
  1291. [INFO] Tests run: 10, Failures: 0, Errors: 0, Skipped: 0, Time elapsed: 0.002 s - in org.openmrs.module.fhir2.api.translators.impl.ObservationStatusTranslatorImpl_2_1Test
  1292. [INFO]
  1293. [INFO] Results:
  1294. [INFO]
  1295. [INFO] Tests run: 53, Failures: 0, Errors: 0, Skipped: 0
  1296. [INFO]
  1297. [INFO]
  1298. [INFO] --- jacoco-maven-plugin:0.8.2:report (report) @ fhir2-api-2.1 ---
  1299. [INFO] Loading execution data file C:\Users\Cliff\Desktop\project\openmrs-module-fhir2\api-2.1\target\jacoco.exec
  1300. [INFO] Analyzed bundle 'FHIR2 API 2.1' with 3 classes
  1301. [INFO]
  1302. [INFO] --- maven-jar-plugin:3.2.0:jar (default-jar) @ fhir2-api-2.1 ---
  1303. [INFO] Building jar: C:\Users\Cliff\Desktop\project\openmrs-module-fhir2\api-2.1\target\fhir2-api-2.1-1.0.0-SNAPSHOT.jar
  1304. [INFO]
  1305. [INFO] --- maven-jar-plugin:3.2.0:test-jar (default) @ fhir2-api-2.1 ---
  1306. [INFO] Building jar: C:\Users\Cliff\Desktop\project\openmrs-module-fhir2\api-2.1\target\fhir2-api-2.1-1.0.0-SNAPSHOT-tests.jar
  1307. [INFO]
  1308. [INFO] --- maven-install-plugin:2.4:install (default-install) @ fhir2-api-2.1 ---
  1309. [INFO] Installing C:\Users\Cliff\Desktop\project\openmrs-module-fhir2\api-2.1\target\fhir2-api-2.1-1.0.0-SNAPSHOT.jar to C:\Users\Cliff\.m2\repository\org\openmrs\module\fhir2-api-2.1\1.0.0-SNAPSHOT\fhir2-api-2.1-1.0.0-SNAPSHOT.jar
  1310. [INFO] Installing C:\Users\Cliff\Desktop\project\openmrs-module-fhir2\api-2.1\pom.xml to C:\Users\Cliff\.m2\repository\org\openmrs\module\fhir2-api-2.1\1.0.0-SNAPSHOT\fhir2-api-2.1-1.0.0-SNAPSHOT.pom
  1311. [INFO] Installing C:\Users\Cliff\Desktop\project\openmrs-module-fhir2\api-2.1\target\fhir2-api-2.1-1.0.0-SNAPSHOT-tests.jar to C:\Users\Cliff\.m2\repository\org\openmrs\module\fhir2-api-2.1\1.0.0-SNAPSHOT\fhir2-api-2.1-1.0.0-SNAPSHOT-tests.jar
  1312. [INFO]
  1313. [INFO] ------------------< org.openmrs.module:fhir2-api-2.2 >------------------
  1314. [INFO] Building FHIR2 API 2.2 1.0.0-SNAPSHOT [5/7]
  1315. [INFO] --------------------------------[ jar ]---------------------------------
  1316. [INFO]
  1317. [INFO] --- maven-clean-plugin:2.5:clean (default-clean) @ fhir2-api-2.2 ---
  1318. [INFO] Deleting C:\Users\Cliff\Desktop\project\openmrs-module-fhir2\api-2.2\target
  1319. [INFO]
  1320. [INFO] --- directory-maven-plugin:0.1:highest-basedir (directories) @ fhir2-api-2.2 ---
  1321. [INFO] Highest basedir set to: C:\Users\Cliff\Desktop\project\openmrs-module-fhir2
  1322. [INFO]
  1323. [INFO] --- license-maven-plugin:3.0:format (add-license) @ fhir2-api-2.2 ---
  1324. [INFO] Updating license headers...
  1325. [INFO]
  1326. [INFO] --- jacoco-maven-plugin:0.8.2:prepare-agent (default) @ fhir2-api-2.2 ---
  1327. [INFO] argLine set to -javaagent:C:\\Users\\Cliff\\.m2\\repository\\org\\jacoco\\org.jacoco.agent\\0.8.2\\org.jacoco.agent-0.8.2-runtime.jar=destfile=C:\\Users\\Cliff\\Desktop\\project\\openmrs-module-fhir2\\api-2.2\\target\\jacoco.exec
  1328. [INFO]
  1329. [INFO] --- formatter-maven-plugin:2.11.0:format (default) @ fhir2-api-2.2 ---
  1330. [INFO] Using 'UTF-8' encoding to format source files.
  1331. [INFO] Number of files to be formatted: 13
  1332. [INFO] Successfully formatted: 0 file(s)
  1333. [INFO] Fail to format: 0 file(s)
  1334. [INFO] Skipped: 13 file(s)
  1335. [INFO] Read only skipped: 0 file(s)
  1336. [INFO] Approximate time taken: 2s
  1337. [INFO]
  1338. [INFO] --- impsort-maven-plugin:1.3.2:sort (default) @ fhir2-api-2.2 ---
  1339. [INFO] Total Files Processed: 13 in 00:00.146
  1340. [INFO] Already Sorted: 13
  1341. [INFO] Needed Sorting: 0
  1342. [INFO]
  1343. [INFO] --- maven-resources-plugin:2.6:resources (default-resources) @ fhir2-api-2.2 ---
  1344. [INFO] Using 'UTF-8' encoding to copy filtered resources.
  1345. [INFO] skip non existing resourceDirectory C:\Users\Cliff\Desktop\project\openmrs-module-fhir2\api-2.2\src\main\resources
  1346. [INFO] skip non existing resourceDirectory C:\Users\Cliff\Desktop\project\openmrs-module-fhir2\api-2.2\src\main\resources
  1347. [INFO] skip non existing resourceDirectory C:\Users\Cliff\Desktop\project\openmrs-module-fhir2\api-2.2\src\main\webapp
  1348. [INFO] skip non existing resourceDirectory C:\Users\Cliff\Desktop\project\openmrs-module-fhir2\api-2.2\src\main\webapp
  1349. [INFO]
  1350. [INFO] --- maven-compiler-plugin:3.1:compile (default-compile) @ fhir2-api-2.2 ---
  1351. [INFO] Changes detected - recompiling the module!
  1352. [INFO] Compiling 5 source files to C:\Users\Cliff\Desktop\project\openmrs-module-fhir2\api-2.2\target\classes
  1353. [INFO]
  1354. [INFO] --- maven-resources-plugin:2.6:testResources (default-testResources) @ fhir2-api-2.2 ---
  1355. [INFO] Using 'UTF-8' encoding to copy filtered resources.
  1356. [INFO] skip non existing resourceDirectory C:\Users\Cliff\Desktop\project\openmrs-module-fhir2\api-2.2\src\test\resources
  1357. [INFO] skip non existing resourceDirectory C:\Users\Cliff\Desktop\project\openmrs-module-fhir2\api-2.2\src\test\resources
  1358. [INFO]
  1359. [INFO] --- maven-compiler-plugin:3.1:testCompile (default-testCompile) @ fhir2-api-2.2 ---
  1360. [INFO] Changes detected - recompiling the module!
  1361. [INFO] Compiling 8 source files to C:\Users\Cliff\Desktop\project\openmrs-module-fhir2\api-2.2\target\test-classes
  1362. [INFO]
  1363. [INFO] --- maven-surefire-plugin:3.0.0-M4:test (default-test) @ fhir2-api-2.2 ---
  1364. [INFO]
  1365. [INFO] -------------------------------------------------------
  1366. [INFO] T E S T S
  1367. [INFO] -------------------------------------------------------
  1368. [INFO] Running org.openmrs.module.fhir2.api.dao.impl.FhirConditionDaoImpl_2_2Test
  1369. [INFO] Tests run: 5, Failures: 0, Errors: 0, Skipped: 0, Time elapsed: 42.497 s - in org.openmrs.module.fhir2.api.dao.impl.FhirConditionDaoImpl_2_2Test
  1370. [INFO] Running org.openmrs.module.fhir2.api.impl.FhirConditionServiceImpl_2_2Test
  1371. [INFO] Tests run: 4, Failures: 0, Errors: 0, Skipped: 0, Time elapsed: 0.495 s - in org.openmrs.module.fhir2.api.impl.FhirConditionServiceImpl_2_2Test
  1372. [INFO] Running org.openmrs.module.fhir2.api.search.ConditionSearchQueryImpl_2_2Test
  1373. [INFO] Tests run: 41, Failures: 0, Errors: 0, Skipped: 0, Time elapsed: 8.372 s - in org.openmrs.module.fhir2.api.search.ConditionSearchQueryImpl_2_2Test
  1374. [INFO] Running org.openmrs.module.fhir2.api.translators.impl.ConditionClinicalStatusTranslatorImpl_2_2Test
  1375. [INFO] Tests run: 5, Failures: 0, Errors: 0, Skipped: 0, Time elapsed: 0.004 s - in org.openmrs.module.fhir2.api.translators.impl.ConditionClinicalStatusTranslatorImpl_2_2Test
  1376. [INFO] Running org.openmrs.module.fhir2.api.translators.impl.ConditionTranslatorImpl_2_2Test
  1377. [INFO] Tests run: 19, Failures: 0, Errors: 0, Skipped: 0, Time elapsed: 0.473 s - in org.openmrs.module.fhir2.api.translators.impl.ConditionTranslatorImpl_2_2Test
  1378. [INFO] Running org.openmrs.module.fhir2.api.translators.impl.ConditionVerificationStatusTranslatorImpl_2_2Test
  1379. [INFO] Tests run: 7, Failures: 0, Errors: 0, Skipped: 0, Time elapsed: 0.013 s - in org.openmrs.module.fhir2.api.translators.impl.ConditionVerificationStatusTranslatorImpl_2_2Test
  1380. [INFO]
  1381. [INFO] Results:
  1382. [INFO]
  1383. [INFO] Tests run: 81, Failures: 0, Errors: 0, Skipped: 0
  1384. [INFO]
  1385. [INFO]
  1386. [INFO] --- jacoco-maven-plugin:0.8.2:report (report) @ fhir2-api-2.2 ---
  1387. [INFO] Loading execution data file C:\Users\Cliff\Desktop\project\openmrs-module-fhir2\api-2.2\target\jacoco.exec
  1388. [INFO] Analyzed bundle 'FHIR2 API 2.2' with 5 classes
  1389. [INFO]
  1390. [INFO] --- maven-jar-plugin:3.2.0:jar (default-jar) @ fhir2-api-2.2 ---
  1391. [INFO] Building jar: C:\Users\Cliff\Desktop\project\openmrs-module-fhir2\api-2.2\target\fhir2-api-2.2-1.0.0-SNAPSHOT.jar
  1392. [INFO]
  1393. [INFO] --- maven-jar-plugin:3.2.0:test-jar (default) @ fhir2-api-2.2 ---
  1394. [INFO] Building jar: C:\Users\Cliff\Desktop\project\openmrs-module-fhir2\api-2.2\target\fhir2-api-2.2-1.0.0-SNAPSHOT-tests.jar
  1395. [INFO]
  1396. [INFO] --- maven-install-plugin:2.4:install (default-install) @ fhir2-api-2.2 ---
  1397. [INFO] Installing C:\Users\Cliff\Desktop\project\openmrs-module-fhir2\api-2.2\target\fhir2-api-2.2-1.0.0-SNAPSHOT.jar to C:\Users\Cliff\.m2\repository\org\openmrs\module\fhir2-api-2.2\1.0.0-SNAPSHOT\fhir2-api-2.2-1.0.0-SNAPSHOT.jar
  1398. [INFO] Installing C:\Users\Cliff\Desktop\project\openmrs-module-fhir2\api-2.2\pom.xml to C:\Users\Cliff\.m2\repository\org\openmrs\module\fhir2-api-2.2\1.0.0-SNAPSHOT\fhir2-api-2.2-1.0.0-SNAPSHOT.pom
  1399. [INFO] Installing C:\Users\Cliff\Desktop\project\openmrs-module-fhir2\api-2.2\target\fhir2-api-2.2-1.0.0-SNAPSHOT-tests.jar to C:\Users\Cliff\.m2\repository\org\openmrs\module\fhir2-api-2.2\1.0.0-SNAPSHOT\fhir2-api-2.2-1.0.0-SNAPSHOT-tests.jar
  1400. [INFO]
  1401. [INFO] -------------------< org.openmrs.module:fhir2-omod >--------------------
  1402. [INFO] Building FHIR2 OMOD 1.0.0-SNAPSHOT [6/7]
  1403. [INFO] --------------------------------[ jar ]---------------------------------
  1404. [INFO]
  1405. [INFO] --- maven-clean-plugin:2.5:clean (default-clean) @ fhir2-omod ---
  1406. [INFO] Deleting C:\Users\Cliff\Desktop\project\openmrs-module-fhir2\omod\target
  1407. [INFO]
  1408. [INFO] --- directory-maven-plugin:0.1:highest-basedir (directories) @ fhir2-omod ---
  1409. [INFO] Highest basedir set to: C:\Users\Cliff\Desktop\project\openmrs-module-fhir2
  1410. [INFO]
  1411. [INFO] --- license-maven-plugin:3.0:format (add-license) @ fhir2-omod ---
  1412. [INFO] Updating license headers...
  1413. [INFO]
  1414. [INFO] --- jacoco-maven-plugin:0.8.2:prepare-agent (default) @ fhir2-omod ---
  1415. [INFO] argLine set to -javaagent:C:\\Users\\Cliff\\.m2\\repository\\org\\jacoco\\org.jacoco.agent\\0.8.2\\org.jacoco.agent-0.8.2-runtime.jar=destfile=C:\\Users\\Cliff\\Desktop\\project\\openmrs-module-fhir2\\omod\\target\\jacoco.exec
  1416. [INFO]
  1417. [INFO] --- formatter-maven-plugin:2.11.0:format (default) @ fhir2-omod ---
  1418. [INFO] Using 'UTF-8' encoding to format source files.
  1419. [INFO] Number of files to be formatted: 61
  1420. [INFO] Successfully formatted: 0 file(s)
  1421. [INFO] Fail to format: 0 file(s)
  1422. [INFO] Skipped: 61 file(s)
  1423. [INFO] Read only skipped: 0 file(s)
  1424. [INFO] Approximate time taken: 5s
  1425. [INFO]
  1426. [INFO] --- impsort-maven-plugin:1.3.2:sort (default) @ fhir2-omod ---
  1427. [INFO] Total Files Processed: 61 in 00:02.417
  1428. [INFO] Already Sorted: 61
  1429. [INFO] Needed Sorting: 0
  1430. [INFO]
  1431. [INFO] --- maven-dependency-plugin:2.8:unpack-dependencies (Expand resources) @ fhir2-omod ---
  1432. [INFO] Unpacking C:\Users\Cliff\Desktop\project\openmrs-module-fhir2\api\target\fhir2-api-1.0.0-SNAPSHOT.jar to C:\Users\Cliff\Desktop\project\openmrs-module-fhir2\omod\target\classes with includes "*.xml,*.properties" and excludes ""
  1433. [INFO]
  1434. [INFO] --- maven-resources-plugin:2.6:resources (default-resources) @ fhir2-omod ---
  1435. [INFO] Using 'UTF-8' encoding to copy filtered resources.
  1436. [INFO] Copying 3 resources
  1437. [INFO] Copying 21 resources
  1438. [INFO] skip non existing resourceDirectory C:\Users\Cliff\Desktop\project\openmrs-module-fhir2\omod\src\main\webapp
  1439. [INFO] skip non existing resourceDirectory C:\Users\Cliff\Desktop\project\openmrs-module-fhir2\omod\src\main\webapp
  1440. [INFO]
  1441. [INFO] --- maven-compiler-plugin:3.1:compile (default-compile) @ fhir2-omod ---
  1442. [INFO] Changes detected - recompiling the module!
  1443. [INFO] Compiling 10 source files to C:\Users\Cliff\Desktop\project\openmrs-module-fhir2\omod\target\classes
  1444. [INFO]
  1445. [INFO] --- maven-resources-plugin:2.6:testResources (default-testResources) @ fhir2-omod ---
  1446. [INFO] Using 'UTF-8' encoding to copy filtered resources.
  1447. [INFO] Copying 2 resources
  1448. [INFO] Copying 1 resource
  1449. [INFO]
  1450. [INFO] --- maven-compiler-plugin:3.1:testCompile (default-testCompile) @ fhir2-omod ---
  1451. [INFO] Changes detected - recompiling the module!
  1452. [INFO] Compiling 51 source files to C:\Users\Cliff\Desktop\project\openmrs-module-fhir2\omod\target\test-classes
  1453. [INFO]
  1454. [INFO] --- maven-surefire-plugin:3.0.0-M4:test (default-test) @ fhir2-omod ---
  1455. [INFO]
  1456. [INFO] -------------------------------------------------------
  1457. [INFO] T E S T S
  1458. [INFO] -------------------------------------------------------
  1459. [INFO] Running org.openmrs.module.fhir2.narrative.AllergyIntoleranceNarrativeTest
  1460. [INFO] Tests run: 1, Failures: 0, Errors: 0, Skipped: 0, Time elapsed: 11.235 s - in org.openmrs.module.fhir2.narrative.AllergyIntoleranceNarrativeTest
  1461. [INFO] Running org.openmrs.module.fhir2.narrative.ConditionNarrativeTest
  1462. [INFO] Tests run: 1, Failures: 0, Errors: 0, Skipped: 0, Time elapsed: 1.087 s - in org.openmrs.module.fhir2.narrative.ConditionNarrativeTest
  1463. [INFO] Running org.openmrs.module.fhir2.narrative.EncounterNarrativeTest
  1464. [INFO] Tests run: 1, Failures: 0, Errors: 0, Skipped: 0, Time elapsed: 0.996 s - in org.openmrs.module.fhir2.narrative.EncounterNarrativeTest
  1465. [INFO] Running org.openmrs.module.fhir2.narrative.LocationNarrativeTest
  1466. [INFO] Tests run: 1, Failures: 0, Errors: 0, Skipped: 0, Time elapsed: 0.47 s - in org.openmrs.module.fhir2.narrative.LocationNarrativeTest
  1467. [INFO] Running org.openmrs.module.fhir2.narrative.MedicationRequestNarrativeTest
  1468. [INFO] Tests run: 1, Failures: 0, Errors: 0, Skipped: 0, Time elapsed: 1.267 s - in org.openmrs.module.fhir2.narrative.MedicationRequestNarrativeTest
  1469. [INFO] Running org.openmrs.module.fhir2.narrative.NarrativeGeneratorTest
  1470. [ERROR] Tests run: 6, Failures: 1, Errors: 0, Skipped: 0, Time elapsed: 0.005 s <<< FAILURE! - in org.openmrs.module.fhir2.narrative.NarrativeGeneratorTest
  1471. [ERROR] org.openmrs.module.fhir2.narrative.NarrativeGeneratorTest.shouldMapValuesFromPropertiesFileToTemplate Time elapsed: 0.001 s <<< FAILURE!
  1472. org.junit.ComparisonFailure:
  1473. ]xpected:<...rrativeContent</div>[
  1474. > but was:<...rrativeContent</div>[]
  1475. >
  1476. at org.openmrs.module.fhir2.narrative.NarrativeGeneratorTest.shouldMapValuesFromPropertiesFileToTemplate(NarrativeGeneratorTest.java:109)
  1477.  
  1478. [INFO] Running org.openmrs.module.fhir2.narrative.ObservationNarrativeTest
  1479. [INFO] Tests run: 1, Failures: 0, Errors: 0, Skipped: 0, Time elapsed: 0.145 s - in org.openmrs.module.fhir2.narrative.ObservationNarrativeTest
  1480. [INFO] Running org.openmrs.module.fhir2.narrative.PersonNarrativeTest
  1481. [INFO] Tests run: 1, Failures: 0, Errors: 0, Skipped: 0, Time elapsed: 0.546 s - in org.openmrs.module.fhir2.narrative.PersonNarrativeTest
  1482. [INFO] Running org.openmrs.module.fhir2.narrative.PractitionerNarrativeTest
  1483. [INFO] Tests run: 1, Failures: 0, Errors: 0, Skipped: 0, Time elapsed: 0.461 s - in org.openmrs.module.fhir2.narrative.PractitionerNarrativeTest
  1484. [INFO] Running org.openmrs.module.fhir2.narrative.PractitionerRoleNarrativeTest
  1485. [INFO] Tests run: 1, Failures: 0, Errors: 0, Skipped: 0, Time elapsed: 0.498 s - in org.openmrs.module.fhir2.narrative.PractitionerRoleNarrativeTest
  1486. [INFO] Running org.openmrs.module.fhir2.narrative.RelatedPersonNarrativeTest
  1487. [INFO] Tests run: 1, Failures: 0, Errors: 0, Skipped: 0, Time elapsed: 0.209 s - in org.openmrs.module.fhir2.narrative.RelatedPersonNarrativeTest
  1488. [INFO] Running org.openmrs.module.fhir2.narrative.ServiceRequestNarrativeTest
  1489. [INFO] Tests run: 1, Failures: 0, Errors: 0, Skipped: 0, Time elapsed: 0.497 s - in org.openmrs.module.fhir2.narrative.ServiceRequestNarrativeTest
  1490. [INFO] Running org.openmrs.module.fhir2.narrative.TaskNarrativeTest
  1491. [INFO] Tests run: 1, Failures: 0, Errors: 0, Skipped: 0, Time elapsed: 0.503 s - in org.openmrs.module.fhir2.narrative.TaskNarrativeTest
  1492. [INFO] Running org.openmrs.module.fhir2.providers.r3.AllergyIntoleranceFhirR3ResourceProviderWebTest
  1493. [INFO] Tests run: 29, Failures: 0, Errors: 0, Skipped: 0, Time elapsed: 7.725 s - in org.openmrs.module.fhir2.providers.r3.AllergyIntoleranceFhirR3ResourceProviderWebTest
  1494. [INFO] Running org.openmrs.module.fhir2.providers.r3.ConditionFhirR3ResourceProviderWebTest
  1495. [INFO] Tests run: 19, Failures: 0, Errors: 0, Skipped: 0, Time elapsed: 1.514 s - in org.openmrs.module.fhir2.providers.r3.ConditionFhirR3ResourceProviderWebTest
  1496. [INFO] Running org.openmrs.module.fhir2.providers.r3.DiagnosticReportFhirResourceProviderWebTest
  1497. [INFO] Tests run: 25, Failures: 0, Errors: 0, Skipped: 0, Time elapsed: 1.749 s - in org.openmrs.module.fhir2.providers.r3.DiagnosticReportFhirResourceProviderWebTest
  1498. [INFO] Running org.openmrs.module.fhir2.providers.r3.EncounterFhirResourceProviderWebTest
  1499. [INFO] Tests run: 35, Failures: 0, Errors: 0, Skipped: 0, Time elapsed: 1.735 s - in org.openmrs.module.fhir2.providers.r3.EncounterFhirResourceProviderWebTest
  1500. [INFO] Running org.openmrs.module.fhir2.providers.r3.ListFhirResourceProviderWebTest
  1501. [INFO] Tests run: 8, Failures: 0, Errors: 0, Skipped: 0, Time elapsed: 0.3 s - in org.openmrs.module.fhir2.providers.r3.ListFhirResourceProviderWebTest
  1502. [INFO] Running org.openmrs.module.fhir2.providers.r3.LocationFhirResourceProviderWebTest
  1503. [INFO] Tests run: 26, Failures: 0, Errors: 0, Skipped: 0, Time elapsed: 1.244 s - in org.openmrs.module.fhir2.providers.r3.LocationFhirResourceProviderWebTest
  1504. [INFO] Running org.openmrs.module.fhir2.providers.r3.MedicationFhirResourceProviderWebTest
  1505. [INFO] Tests run: 14, Failures: 0, Errors: 0, Skipped: 0, Time elapsed: 0.66 s - in org.openmrs.module.fhir2.providers.r3.MedicationFhirResourceProviderWebTest
  1506. [INFO] Running org.openmrs.module.fhir2.providers.r3.MedicationRequestFhirResourceProviderWebTest
  1507. [INFO] Tests run: 32, Failures: 0, Errors: 0, Skipped: 0, Time elapsed: 1.381 s - in org.openmrs.module.fhir2.providers.r3.MedicationRequestFhirResourceProviderWebTest
  1508. [INFO] Running org.openmrs.module.fhir2.providers.r3.ObservationFhirResourceProviderWebTest
  1509. [INFO] Tests run: 39, Failures: 0, Errors: 0, Skipped: 0, Time elapsed: 1.878 s - in org.openmrs.module.fhir2.providers.r3.ObservationFhirResourceProviderWebTest
  1510. [INFO] Running org.openmrs.module.fhir2.providers.r3.PatientFhirR3ResourceProviderWebTest
  1511. [INFO] Tests run: 35, Failures: 0, Errors: 0, Skipped: 0, Time elapsed: 1.556 s - in org.openmrs.module.fhir2.providers.r3.PatientFhirR3ResourceProviderWebTest
  1512. [INFO] Running org.openmrs.module.fhir2.providers.r3.PersonFhirResourceProviderWebTest
  1513. [INFO] Tests run: 26, Failures: 0, Errors: 0, Skipped: 0, Time elapsed: 0.885 s - in org.openmrs.module.fhir2.providers.r3.PersonFhirResourceProviderWebTest
  1514. [INFO] Running org.openmrs.module.fhir2.providers.r3.PractitionerFhirResourceProviderWebTest
  1515. [INFO] Tests run: 22, Failures: 0, Errors: 0, Skipped: 0, Time elapsed: 0.669 s - in org.openmrs.module.fhir2.providers.r3.PractitionerFhirResourceProviderWebTest
  1516. [INFO] Running org.openmrs.module.fhir2.providers.r3.ProcedureRequestFhirResourceProviderWebTest
  1517. [INFO] Tests run: 29, Failures: 0, Errors: 0, Skipped: 0, Time elapsed: 0.854 s - in org.openmrs.module.fhir2.providers.r3.ProcedureRequestFhirResourceProviderWebTest
  1518. [INFO] Running org.openmrs.module.fhir2.providers.r3.RelatedPersonFhirResourceProviderWebTest
  1519. [INFO] Tests run: 17, Failures: 0, Errors: 0, Skipped: 0, Time elapsed: 0.777 s - in org.openmrs.module.fhir2.providers.r3.RelatedPersonFhirResourceProviderWebTest
  1520. [INFO] Running org.openmrs.module.fhir2.providers.r3.TaskFhirResourceProviderWebTest
  1521. [INFO] Tests run: 19, Failures: 0, Errors: 0, Skipped: 0, Time elapsed: 0.551 s - in org.openmrs.module.fhir2.providers.r3.TaskFhirResourceProviderWebTest
  1522. [INFO] Running org.openmrs.module.fhir2.providers.r4.AllergyIntoleranceFhirResourceProviderWebTest
  1523. [INFO] Tests run: 30, Failures: 0, Errors: 0, Skipped: 0, Time elapsed: 1.075 s - in org.openmrs.module.fhir2.providers.r4.AllergyIntoleranceFhirResourceProviderWebTest
  1524. [INFO] Running org.openmrs.module.fhir2.providers.r4.ConditionFhirResourceProviderWebTest
  1525. [INFO] Tests run: 19, Failures: 0, Errors: 0, Skipped: 0, Time elapsed: 0.509 s - in org.openmrs.module.fhir2.providers.r4.ConditionFhirResourceProviderWebTest
  1526. [INFO] Running org.openmrs.module.fhir2.providers.r4.DiagnosticReportFhirResourceProviderWebTest
  1527. [INFO] Tests run: 25, Failures: 0, Errors: 0, Skipped: 0, Time elapsed: 1.326 s - in org.openmrs.module.fhir2.providers.r4.DiagnosticReportFhirResourceProviderWebTest
  1528. [INFO] Running org.openmrs.module.fhir2.providers.r4.EncounterFhirResourceProviderWebTest
  1529. [INFO] Tests run: 37, Failures: 0, Errors: 0, Skipped: 0, Time elapsed: 1.611 s - in org.openmrs.module.fhir2.providers.r4.EncounterFhirResourceProviderWebTest
  1530. [INFO] Running org.openmrs.module.fhir2.providers.r4.ListFhirResourceProviderWebTest
  1531. [INFO] Tests run: 8, Failures: 0, Errors: 0, Skipped: 0, Time elapsed: 0.174 s - in org.openmrs.module.fhir2.providers.r4.ListFhirResourceProviderWebTest
  1532. [INFO] Running org.openmrs.module.fhir2.providers.r4.LocationFhirResourceProviderWebTest
  1533. [INFO] Tests run: 26, Failures: 0, Errors: 0, Skipped: 0, Time elapsed: 0.801 s - in org.openmrs.module.fhir2.providers.r4.LocationFhirResourceProviderWebTest
  1534. [INFO] Running org.openmrs.module.fhir2.providers.r4.MedicationFhirResourceProviderWebTest
  1535. [INFO] Tests run: 14, Failures: 0, Errors: 0, Skipped: 0, Time elapsed: 0.44 s - in org.openmrs.module.fhir2.providers.r4.MedicationFhirResourceProviderWebTest
  1536. [INFO] Running org.openmrs.module.fhir2.providers.r4.MedicationRequestFhirResourceProviderWebTest
  1537. [INFO] Tests run: 32, Failures: 0, Errors: 0, Skipped: 0, Time elapsed: 0.901 s - in org.openmrs.module.fhir2.providers.r4.MedicationRequestFhirResourceProviderWebTest
  1538. [INFO] Running org.openmrs.module.fhir2.providers.r4.ObservationFhirResourceProviderWebTest
  1539. [INFO] Tests run: 39, Failures: 0, Errors: 0, Skipped: 0, Time elapsed: 1.646 s - in org.openmrs.module.fhir2.providers.r4.ObservationFhirResourceProviderWebTest
  1540. [INFO] Running org.openmrs.module.fhir2.providers.r4.PatientFhirResourceProviderWebTest
  1541. [INFO] Tests run: 35, Failures: 0, Errors: 0, Skipped: 0, Time elapsed: 1.021 s - in org.openmrs.module.fhir2.providers.r4.PatientFhirResourceProviderWebTest
  1542. [INFO] Running org.openmrs.module.fhir2.providers.r4.PersonFhirResourceProviderWebTest
  1543. [INFO] Tests run: 26, Failures: 0, Errors: 0, Skipped: 0, Time elapsed: 0.633 s - in org.openmrs.module.fhir2.providers.r4.PersonFhirResourceProviderWebTest
  1544. [INFO] Running org.openmrs.module.fhir2.providers.r4.PractitionerFhirResourceProviderWebTest
  1545. [INFO] Tests run: 22, Failures: 0, Errors: 0, Skipped: 0, Time elapsed: 0.553 s - in org.openmrs.module.fhir2.providers.r4.PractitionerFhirResourceProviderWebTest
  1546. [INFO] Running org.openmrs.module.fhir2.providers.r4.RelatedPersonFhirResourceProviderWebTest
  1547. [INFO] Tests run: 17, Failures: 0, Errors: 0, Skipped: 0, Time elapsed: 0.467 s - in org.openmrs.module.fhir2.providers.r4.RelatedPersonFhirResourceProviderWebTest
  1548. [INFO] Running org.openmrs.module.fhir2.providers.r4.ServiceRequestFhirResourceProviderWebTest
  1549. [INFO] Tests run: 30, Failures: 0, Errors: 0, Skipped: 0, Time elapsed: 0.844 s - in org.openmrs.module.fhir2.providers.r4.ServiceRequestFhirResourceProviderWebTest
  1550. [INFO] Running org.openmrs.module.fhir2.providers.r4.TaskFhirResourceProviderWebTest
  1551. [INFO] Tests run: 19, Failures: 0, Errors: 0, Skipped: 0, Time elapsed: 0.424 s - in org.openmrs.module.fhir2.providers.r4.TaskFhirResourceProviderWebTest
  1552. [INFO] Running org.openmrs.module.fhir2.web.filter.ForwardingFilterTest
  1553. ERROR - FhirVersionUtils.getFhirVersion(60) |2020-08-11 07:18:31,178| Could not determine FHIR version for URI /ws/fhir2//Person and path .
  1554. ERROR - FhirVersionUtils.getFhirVersion(60) |2020-08-11 07:18:31,187| Could not determine FHIR version for URI /ws/fhir2/R27/Person and path .
  1555. ERROR - FhirVersionUtils.getFhirVersion(60) |2020-08-11 07:18:31,190| Could not determine FHIR version for URI /ws/fhir2/Person and path .
  1556. ERROR - FhirVersionUtils.getFhirVersion(45) |2020-08-11 07:18:31,193| Could not determine FHIR version for URI /ws/fhir2 and path .
  1557. ERROR - FhirVersionUtils.getFhirVersion(60) |2020-08-11 07:18:31,196| Could not determine FHIR version for URI /ws/fhir2/ and path .
  1558. [INFO] Tests run: 7, Failures: 0, Errors: 0, Skipped: 0, Time elapsed: 0.035 s - in org.openmrs.module.fhir2.web.filter.ForwardingFilterTest
  1559. [INFO] Running org.openmrs.module.fhir2.web.util.FhirVersionUtilsTest
  1560. ERROR - FhirVersionUtils.getFhirVersion(60) |2020-08-11 07:18:31,447| Could not determine FHIR version for URI /openmrs/ws/fhir2/Patient and path /openmrs.
  1561. [INFO] Tests run: 7, Failures: 0, Errors: 0, Skipped: 0, Time elapsed: 0.276 s - in org.openmrs.module.fhir2.web.util.FhirVersionUtilsTest
  1562. [INFO] Running org.openmrs.module.fhir2.web.util.NarrativeUtilTest
  1563. ERROR - NarrativeUtils.validatePropertiesFilePath(54) |2020-08-11 07:18:31,477| Properties File classpath must not be empty
  1564. ERROR - NarrativeUtils.validatePropertiesFilePath(42) |2020-08-11 07:18:31,478| Properties File path must not be empty
  1565. ERROR - NarrativeUtils.validatePropertiesFilePath(47) |2020-08-11 07:18:31,478| Properties File must have extension '.properties'
  1566. ERROR - NarrativeUtils.validatePropertiesFilePath(61) |2020-08-11 07:18:31,480| Properties File OpenMRS relative path must not be empty
  1567. [INFO] Tests run: 6, Failures: 0, Errors: 0, Skipped: 0, Time elapsed: 0.008 s - in org.openmrs.module.fhir2.web.util.NarrativeUtilTest
  1568. [INFO] Running org.openmrs.module.fhir2.web.util.OpenmrsFhirAddressStrategyTest
  1569. [INFO] Tests run: 8, Failures: 0, Errors: 0, Skipped: 0, Time elapsed: 0.203 s - in org.openmrs.module.fhir2.web.util.OpenmrsFhirAddressStrategyTest
  1570. [INFO]
  1571. [INFO] Results:
  1572. [INFO]
  1573. [ERROR] Failures:
  1574. ]ERROR] NarrativeGeneratorTest.shouldMapValuesFromPropertiesFileToTemplate:109 expected:<...rrativeContent</div>[
  1575. > but was:<...rrativeContent</div>[]
  1576. >
  1577. [INFO]
  1578. [ERROR] Tests run: 800, Failures: 1, Errors: 0, Skipped: 0
  1579. [INFO]
  1580. [INFO] ------------------------------------------------------------------------
  1581. [INFO] Reactor Summary for FHIR2 1.0.0-SNAPSHOT:
  1582. [INFO]
  1583. [INFO] FHIR2 .............................................. SUCCESS [ 0.439 s]
  1584. [INFO] FHIR2 Test Data .................................... SUCCESS [ 4.282 s]
  1585. [INFO] FHIR2 API .......................................... SUCCESS [02:51 min]
  1586. [INFO] FHIR2 API 2.1 ...................................... SUCCESS [ 19.220 s]
  1587. [INFO] FHIR2 API 2.2 ...................................... SUCCESS [01:05 min]
  1588. [INFO] FHIR2 OMOD ......................................... FAILURE [01:28 min]
  1589. [INFO] FHIR2 Integration Tests ............................ SKIPPED
  1590. [INFO] ------------------------------------------------------------------------
  1591. [INFO] BUILD FAILURE
  1592. [INFO] ------------------------------------------------------------------------
  1593. [INFO] Total time: 05:49 min
  1594. [INFO] Finished at: 2020-08-11T10:18:32+03:00
  1595. [INFO] ------------------------------------------------------------------------
  1596. [ERROR] Failed to execute goal org.apache.maven.plugins:maven-surefire-plugin:3.0.0-M4:test (default-test) on project fhir2-omod: There are test failures.
  1597. [ERROR]
  1598. [ERROR] Please refer to C:\Users\Cliff\Desktop\project\openmrs-module-fhir2\omod\target\surefire-reports for the individual test results.
  1599. [ERROR] Please refer to dump files (if any exist) [date].dump, [date]-jvmRun[N].dump and [date].dumpstream.
  1600. [ERROR] -> [Help 1]
  1601. [ERROR]
  1602. [ERROR] To see the full stack trace of the errors, re-run Maven with the -e switch.
  1603. [ERROR] Re-run Maven using the -X switch to enable full debug logging.
  1604. [ERROR]
  1605. [ERROR] For more information about the errors and possible solutions, please read the following articles:
  1606. [ERROR] [Help 1] http://cwiki.apache.org/confluence/display/MAVEN/MojoFailureException
  1607. [ERROR]
  1608. [ERROR] After correcting the problems, you can resume the build with the command
  1609. [ERROR] mvn <goals> -rf :fhir2-omod
  1610.  
  1611. Cliff@Cliff-PC MINGW64 ~/Desktop/project/openmrs-module-fhir2 (master)
  1612. $
  1613.  
Advertisement
Add Comment
Please, Sign In to add comment
Advertisement