Guest User

Untitled

a guest
Jan 1st, 2013
127
Never
Not a member of Pastebin yet? Sign Up, it unlocks many cool features!
  1. DKMS make.log for nvidia-experimental-310-310.14 for kernel 3.7.1-pf (i686)
  2. Вт. янв. 1 18:41:30 FET 2013
  3. NVIDIA: calling KBUILD...
  4. test -e include/generated/autoconf.h -a -e include/config/auto.conf || ( \
  5. echo >&2; \
  6. echo >&2 " ERROR: Kernel configuration is invalid."; \
  7. echo >&2 " include/generated/autoconf.h or include/config/auto.conf are missing.";\
  8. echo >&2 " Run 'make oldconfig && make prepare' on kernel src to fix it."; \
  9. echo >&2 ; \
  10. /bin/false)
  11. mkdir -p /var/lib/dkms/nvidia-experimental-310/310.14/build/.tmp_versions ; rm -f /var/lib/dkms/nvidia-experimental-310/310.14/build/.tmp_versions/*
  12. make -f scripts/Makefile.build obj=/var/lib/dkms/nvidia-experimental-310/310.14/build
  13. cc -Wp,-MD,/var/lib/dkms/nvidia-experimental-310/310.14/build/.nv.o.d -nostdinc -isystem /usr/lib/gcc/i686-linux-gnu/4.6/include -I/usr/src/linux-headers-3.7.1-pf/arch/x86/include -Iarch/x86/include/generated -Iinclude -I/usr/src/linux-headers-3.7.1-pf/arch/x86/include/uapi -Iarch/x86/include/generated/uapi -I/usr/src/linux-headers-3.7.1-pf/include/uapi -Iinclude/generated/uapi -include /usr/src/linux-headers-3.7.1-pf/include/linux/kconfig.h -D__KERNEL__ -Wall -Wundef -Wstrict-prototypes -Wno-trigraphs -fno-strict-aliasing -fno-common -Werror-implicit-function-declaration -Wno-format-security -fno-delete-null-pointer-checks -O2 -m32 -msoft-float -mregparm=3 -freg-struct-return -fno-pic -mpreferred-stack-boundary=2 -march=i686 -mtune=generic -maccumulate-outgoing-args -Wa,-mtune=generic32 -ffreestanding -fstack-protector -DCONFIG_AS_CFI=1 -DCONFIG_AS_CFI_SIGNAL_FRAME=1 -DCONFIG_AS_CFI_SECTIONS=1 -DCONFIG_AS_AVX=1 -pipe -Wno-sign-compare -fno-asynchronous-unwind-tables -mno-sse -mno-mmx -mno-sse2 -mno-
  14. 3dnow -mno-avx -Wframe-larger-than=1024 -Wno-unused-but-set-variable -fno-omit-frame-pointer -fno-optimize-sibling-calls -pg -Wdeclaration-after-statement -Wno-pointer-sign -fno-strict-overflow -fconserve-stack -DCC_HAVE_ASM_GOTO -I/var/lib/dkms/nvidia-experimental-310/310.14/build -Wall -MD -Wsign-compare -Wno-cast-qual -Wno-error -D__KERNEL__ -DMODULE -DNVRM -DNV_VERSION_STRING=\"310.14\" -Wno-unused-function -Wuninitialized -UDEBUG -U_DEBUG -DNDEBUG -D__linux__ -DMODULE -D"KBUILD_STR(s)=#s" -D"KBUILD_BASENAME=KBUILD_STR(nv)" -D"KBUILD_MODNAME=KBUILD_STR(nvidia)" -c -o /var/lib/dkms/nvidia-experimental-310/310.14/build/.tmp_nv.o /var/lib/dkms/nvidia-experimental-310/310.14/build/nv.c
  15. In file included from /var/lib/dkms/nvidia-experimental-310/310.14/build/nv-linux.h:15:0,
  16. from /var/lib/dkms/nvidia-experimental-310/310.14/build/nv.c:13:
  17. /var/lib/dkms/nvidia-experimental-310/310.14/build/conftest.h:10:2: ошибка: #error remap_page_range() conftest failed!
  18. /var/lib/dkms/nvidia-experimental-310/310.14/build/conftest.h:12:2: ошибка: #error vmap() conftest failed!
  19. /var/lib/dkms/nvidia-experimental-310/310.14/build/conftest.h:27:2: ошибка: #error kmem_cache_create() conftest failed!
  20. /var/lib/dkms/nvidia-experimental-310/310.14/build/conftest.h:29:2: ошибка: #error on_each_cpu() conftest failed!
  21. /var/lib/dkms/nvidia-experimental-310/310.14/build/conftest.h:30:2: ошибка: #error smp_call_function() conftest failed!
  22. /var/lib/dkms/nvidia-experimental-310/310.14/build/conftest.h:38:2: ошибка: #error INIT_WORK() conftest failed!
  23. /var/lib/dkms/nvidia-experimental-310/310.14/build/conftest.h:39:2: ошибка: #error acpi_walk_namespace() conftest failed!
  24. /var/lib/dkms/nvidia-experimental-310/310.14/build/conftest.h:40:2: ошибка: #error acpi_os_wait_events_complete() conftest failed!
  25. /var/lib/dkms/nvidia-experimental-310/310.14/build/conftest.h:43:2: ошибка: #error pci_dma_mapping_error() conftest failed!
  26. In file included from include/linux/kernel.h:10:0,
  27. from include/linux/sched.h:15,
  28. from include/linux/utsname.h:5,
  29. from /var/lib/dkms/nvidia-experimental-310/310.14/build/nv-linux.h:44,
  30. from /var/lib/dkms/nvidia-experimental-310/310.14/build/nv.c:13:
  31. include/linux/bitops.h: В функции «hweight_long»:
  32. include/linux/bitops.h:66:26: предупреждение: signed and unsigned type in conditional expression [-Wsign-compare]
  33. In file included from /usr/src/linux-headers-3.7.1-pf/arch/x86/include/asm/uaccess.h:592:0,
  34. from include/linux/poll.h:11,
  35. from /var/lib/dkms/nvidia-experimental-310/310.14/build/nv-linux.h:103,
  36. from /var/lib/dkms/nvidia-experimental-310/310.14/build/nv.c:13:
  37. /usr/src/linux-headers-3.7.1-pf/arch/x86/include/asm/uaccess_32.h: В функции «copy_from_user»:
  38. /usr/src/linux-headers-3.7.1-pf/arch/x86/include/asm/uaccess_32.h:208:6: предупреждение: сравнение знакового и беззнакового целых выражений [-Wsign-compare]
  39. In file included from /var/lib/dkms/nvidia-experimental-310/310.14/build/nv.c:13:0:
  40. /var/lib/dkms/nvidia-experimental-310/310.14/build/nv-linux.h: На верхнем уровне:
  41. /var/lib/dkms/nvidia-experimental-310/310.14/build/nv-linux.h:139:2: ошибка: #error "struct file_operations compile test likely failed!"
  42. In file included from /var/lib/dkms/nvidia-experimental-310/310.14/build/nv.c:13:0:
  43. /var/lib/dkms/nvidia-experimental-310/310.14/build/nv-linux.h:294:2: ошибка: #error "NV_PCI_DMA_MAPPING_ERROR() undefined!"
  44. /var/lib/dkms/nvidia-experimental-310/310.14/build/nv-linux.h:299:4: предупреждение: «NV_ACPI_WALK_NAMESPACE_ARGUMENT_COUNT» не определена [-Wundef]
  45. /var/lib/dkms/nvidia-experimental-310/310.14/build/nv-linux.h:301:8: предупреждение: «NV_ACPI_WALK_NAMESPACE_ARGUMENT_COUNT» не определена [-Wundef]
  46. /var/lib/dkms/nvidia-experimental-310/310.14/build/nv-linux.h:307:2: ошибка: #error "NV_ACPI_WALK_NAMESPACE_ARGUMENT_COUNT value unrecognized!"
  47. /var/lib/dkms/nvidia-experimental-310/310.14/build/nv-linux.h:313:4: предупреждение: «NV_ACPI_OS_WAIT_EVENTS_COMPLETE_ARGUMENT_COUNT» не определена [-Wundef]
  48. /var/lib/dkms/nvidia-experimental-310/310.14/build/nv-linux.h:316:8: предупреждение: «NV_ACPI_OS_WAIT_EVENTS_COMPLETE_ARGUMENT_COUNT» не определена [-Wundef]
  49. /var/lib/dkms/nvidia-experimental-310/310.14/build/nv-linux.h:822:2: ошибка: #error "NV_KMEM_CACHE_CREATE() undefined (kmem_cache_create() unavailable)!"
  50. /var/lib/dkms/nvidia-experimental-310/310.14/build/nv-linux.h:881:2: ошибка: #error "NV_VMAP() undefined (vmap() unavailable)!"
  51. /var/lib/dkms/nvidia-experimental-310/310.14/build/nv-linux.h:953:2: ошибка: #error "NV_SMP_CALL_FUNCTION() undefined (smp_call_function() unavailable)!"
  52. /var/lib/dkms/nvidia-experimental-310/310.14/build/nv-linux.h:973:2: ошибка: #error "NV_ON_EACH_CPU() undefined (on_each_cpu() unavailable)!"
  53. /var/lib/dkms/nvidia-experimental-310/310.14/build/nv-linux.h: В функции «nv_execute_on_all_cpus»:
  54. /var/lib/dkms/nvidia-experimental-310/310.14/build/nv-linux.h:991:5: ошибка: неявная декларация функции «NV_ON_EACH_CPU» [-Werror=implicit-function-declaration]
  55. /var/lib/dkms/nvidia-experimental-310/310.14/build/nv-linux.h: На верхнем уровне:
  56. /var/lib/dkms/nvidia-experimental-310/310.14/build/nv-linux.h:1250:13: ошибка: несовместимые типы для «pm_message_t»
  57. include/linux/pm.h:52:3: замечание: здесь была предыдущая декларация «pm_message_t»
  58. /var/lib/dkms/nvidia-experimental-310/310.14/build/nv-linux.h:1542:6: предупреждение: «NV_INIT_WORK_ARGUMENT_COUNT» не определена [-Wundef]
  59. /var/lib/dkms/nvidia-experimental-310/310.14/build/nv-linux.h:1552:8: предупреждение: «NV_INIT_WORK_ARGUMENT_COUNT» не определена [-Wundef]
  60. /var/lib/dkms/nvidia-experimental-310/310.14/build/nv-linux.h:1562:2: ошибка: #error "NV_INIT_WORK_ARGUMENT_COUNT value unrecognized!"
  61. In file included from /var/lib/dkms/nvidia-experimental-310/310.14/build/nv-linux.h:1761:0,
  62. from /var/lib/dkms/nvidia-experimental-310/310.14/build/nv.c:13:
  63. /var/lib/dkms/nvidia-experimental-310/310.14/build/nv-proto.h:25:29: предупреждение: «NV_INIT_WORK_ARGUMENT_COUNT» не определена [-Wundef]
  64. /var/lib/dkms/nvidia-experimental-310/310.14/build/nv.c:372:5: предупреждение: несовместимый тип указателя в инициализации [по умолчанию включена]
  65. /var/lib/dkms/nvidia-experimental-310/310.14/build/nv.c:372:5: предупреждение: (где-то рядом с инициализацией для «nv_pci_driver.suspend») [по умолчанию включена]
  66. /var/lib/dkms/nvidia-experimental-310/310.14/build/nv.c: В функции «nvidia_init_module»:
  67. /var/lib/dkms/nvidia-experimental-310/310.14/build/nv.c:873:5: ошибка: неявная декларация функции «NV_KMEM_CACHE_CREATE» [-Werror=implicit-function-declaration]
  68. /var/lib/dkms/nvidia-experimental-310/310.14/build/nv.c:873:58: ошибка: expected expression before «nv_stack_t»
  69. /var/lib/dkms/nvidia-experimental-310/310.14/build/nv.c:883:9: ошибка: неявная декларация функции «NV_KMEM_CACHE_DESTROY» [-Werror=implicit-function-declaration]
  70. /var/lib/dkms/nvidia-experimental-310/310.14/build/nv.c:981:54: ошибка: expected expression before «nv_pte_t»
  71. /var/lib/dkms/nvidia-experimental-310/310.14/build/nv.c:990:13: ошибка: expected expression before «nvidia_p2p_page_t»
  72. /var/lib/dkms/nvidia-experimental-310/310.14/build/nv.c: В функции «nv_kern_open»:
  73. /var/lib/dkms/nvidia-experimental-310/310.14/build/nv.c:1521:30: предупреждение: в передаче аргумента 2 «request_irq»: несовместимый тип указателя [по умолчанию включена]
  74. include/linux/interrupt.h:130:1: замечание: expected «irq_handler_t» but argument is of type «enum irqreturn_t (*)(int, void *, struct pt_regs *)»
  75. /var/lib/dkms/nvidia-experimental-310/310.14/build/nv.c:1525:17: ошибка: неявная декларация функции «NV_TASKQUEUE_INIT» [-Werror=implicit-function-declaration]
  76. /var/lib/dkms/nvidia-experimental-310/310.14/build/nv.c:1537:25: предупреждение: в передаче аргумента 2 «request_irq»: несовместимый тип указателя [по умолчанию включена]
  77. include/linux/interrupt.h:130:1: замечание: expected «irq_handler_t» but argument is of type «enum irqreturn_t (*)(int, void *, struct pt_regs *)»
  78. cc1: some warnings being treated as errors
  79. make[3]: *** [/var/lib/dkms/nvidia-experimental-310/310.14/build/nv.o] Ошибка 1
  80. make[2]: *** [_module_/var/lib/dkms/nvidia-experimental-310/310.14/build] Ошибка 2
  81. NVIDIA: left KBUILD.
  82. nvidia.ko failed to build!
  83. make[1]: *** [module] Ошибка 1
  84. make: *** [module] Ошибка 2
RAW Paste Data

Adblocker detected! Please consider disabling it...

We've detected AdBlock Plus or some other adblocking software preventing Pastebin.com from fully loading.

We don't have any obnoxious sound, or popup ads, we actively block these annoying types of ads!

Please add Pastebin.com to your ad blocker whitelist or disable your adblocking software.

×