SHARE
TWEET

Untitled

a guest Mar 22nd, 2018 304 Never
Not a member of Pastebin yet? Sign Up, it unlocks many cool features!
  1. [skoehler@thecount 8192cu-dkms]$ LANG=C makepkg -si
  2. ==> WARNING: A package has already been built, installing existing package...
  3. ==> Installing package 8192cu-dkms with pacman -U...
  4. loading packages...
  5. warning: 8192cu-dkms-v4.0.2_9000-13 is up to date -- reinstalling
  6. resolving dependencies...
  7. looking for conflicting packages...
  8.  
  9. Packages (1) 8192cu-dkms-v4.0.2_9000-13
  10.  
  11. Total Installed Size:  5.16 MiB
  12. Net Upgrade Size:      0.00 MiB
  13.  
  14. :: Proceed with installation? [Y/n]
  15. (1/1) checking keys in keyring                                                                                     [####################################################################] 100%
  16. (1/1) checking package integrity                                                                                   [####################################################################] 100%
  17. (1/1) loading package files                                                                                        [####################################################################] 100%
  18. (1/1) checking for file conflicts                                                                                  [####################################################################] 100%
  19. (1/1) checking available disk space                                                                                [####################################################################] 100%
  20. :: Running pre-transaction hooks...
  21. (1/1) Remove DKMS modules
  22. ==> dkms remove 8192cu/v4.0.2_9000 -k 4.15.11-1-ARCH
  23. Error! There is no instance of 8192cu v4.0.2_9000
  24. for kernel 4.15.11-1-ARCH (x86_64) located in the DKMS tree.
  25. :: Processing package changes...
  26. (1/1) reinstalling 8192cu-dkms                                                                                     [####################################################################] 100%
  27. :: Running post-transaction hooks...
  28. (1/2) Install DKMS modules
  29. ==> dkms install 8192cu/v4.0.2_9000 -k 4.15.11-1-ARCH
  30. Error! Bad return status for module build on kernel: 4.15.11-1-ARCH (x86_64)
  31. Consult /var/lib/dkms/8192cu/v4.0.2_9000/build/make.log for more information.
  32. (2/2) Arming ConditionNeedsUpdate...
  33. [skoehler@thecount 8192cu-dkms]$ cat /var/lib/dkms/8192cu/v4.0.2_9000/build/make.log
  34. DKMS make.log for 8192cu-v4.0.2_9000 for kernel 4.15.11-1-ARCH (x86_64)
  35. Thu Mar 22 22:46:53 CET 2018
  36. make: Entering directory '/usr/lib/modules/4.15.11-1-ARCH/build'
  37.   CC [M]  /var/lib/dkms/8192cu/v4.0.2_9000/build/core/rtw_cmd.o
  38.   CC [M]  /var/lib/dkms/8192cu/v4.0.2_9000/build/core/rtw_security.o
  39.   CC [M]  /var/lib/dkms/8192cu/v4.0.2_9000/build/core/rtw_debug.o
  40.   CC [M]  /var/lib/dkms/8192cu/v4.0.2_9000/build/core/rtw_io.o
  41.   CC [M]  /var/lib/dkms/8192cu/v4.0.2_9000/build/core/rtw_ioctl_query.o
  42.   CC [M]  /var/lib/dkms/8192cu/v4.0.2_9000/build/core/rtw_ioctl_set.o
  43.   CC [M]  /var/lib/dkms/8192cu/v4.0.2_9000/build/core/rtw_ieee80211.o
  44.   CC [M]  /var/lib/dkms/8192cu/v4.0.2_9000/build/core/rtw_mlme.o
  45. In file included from /var/lib/dkms/8192cu/v4.0.2_9000/build/core/rtw_cmd.c:23:0:
  46. /var/lib/dkms/8192cu/v4.0.2_9000/build/include/osdep_service.h: In function '_init_timer':
  47. /var/lib/dkms/8192cu/v4.0.2_9000/build/include/osdep_service.h:962:8: error: '_timer {aka struct timer_list}' has no member named 'data'
  48.   ptimer->data = (unsigned long)cntx;
  49.         ^~
  50. /var/lib/dkms/8192cu/v4.0.2_9000/build/include/osdep_service.h:963:2: error: implicit declaration of function 'init_timer'; did you mean '_init_timer'? [-Werror=implicit-function-declaration]
  51.   init_timer(ptimer);
  52.   ^~~~~~~~~~
  53.   _init_timer
  54. In file included from /var/lib/dkms/8192cu/v4.0.2_9000/build/include/rtw_debug.h:24:0,
  55.                  from /var/lib/dkms/8192cu/v4.0.2_9000/build/core/rtw_debug.c:23:
  56. /var/lib/dkms/8192cu/v4.0.2_9000/build/include/osdep_service.h: In function '_init_timer':
  57. /var/lib/dkms/8192cu/v4.0.2_9000/build/include/osdep_service.h:962:8: error: '_timer {aka struct timer_list}' has no member named 'data'
  58.   ptimer->data = (unsigned long)cntx;
  59.         ^~
  60. In file included from /var/lib/dkms/8192cu/v4.0.2_9000/build/core/rtw_io.c:52:0:
  61. /var/lib/dkms/8192cu/v4.0.2_9000/build/include/osdep_service.h: In function '_init_timer':
  62. /var/lib/dkms/8192cu/v4.0.2_9000/build/include/osdep_service.h:962:8: error: '_timer {aka struct timer_list}' has no member named 'data'
  63.   ptimer->data = (unsigned long)cntx;
  64.         ^~
  65. /var/lib/dkms/8192cu/v4.0.2_9000/build/include/osdep_service.h:963:2: error: implicit declaration of function 'init_timer'; did you mean '_init_timer'? [-Werror=implicit-function-declaration]
  66.   init_timer(ptimer);
  67.   ^~~~~~~~~~
  68.   _init_timer
  69. /var/lib/dkms/8192cu/v4.0.2_9000/build/include/osdep_service.h:963:2: error: implicit declaration of function 'init_timer'; did you mean '_init_timer'? [-Werror=implicit-function-declaration]
  70.   init_timer(ptimer);
  71.   ^~~~~~~~~~
  72.   _init_timer
  73. In file included from /var/lib/dkms/8192cu/v4.0.2_9000/build/core/rtw_ioctl_query.c:23:0:
  74. /var/lib/dkms/8192cu/v4.0.2_9000/build/include/osdep_service.h: In function '_init_timer':
  75. /var/lib/dkms/8192cu/v4.0.2_9000/build/include/osdep_service.h:962:8: error: '_timer {aka struct timer_list}' has no member named 'data'
  76.   ptimer->data = (unsigned long)cntx;
  77.         ^~
  78. /var/lib/dkms/8192cu/v4.0.2_9000/build/include/osdep_service.h:963:2: error: implicit declaration of function 'init_timer'; did you mean '_init_timer'? [-Werror=implicit-function-declaration]
  79.   init_timer(ptimer);
  80.   ^~~~~~~~~~
  81.   _init_timer
  82. In file included from /var/lib/dkms/8192cu/v4.0.2_9000/build/include/drv_types.h:31:0,
  83.                  from /var/lib/dkms/8192cu/v4.0.2_9000/build/core/rtw_ieee80211.c:22:
  84. /var/lib/dkms/8192cu/v4.0.2_9000/build/include/osdep_service.h: In function '_init_timer':
  85. /var/lib/dkms/8192cu/v4.0.2_9000/build/include/osdep_service.h:962:8: error: '_timer {aka struct timer_list}' has no member named 'data'
  86.   ptimer->data = (unsigned long)cntx;
  87.         ^~
  88. /var/lib/dkms/8192cu/v4.0.2_9000/build/include/osdep_service.h:963:2: error: implicit declaration of function 'init_timer'; did you mean '_init_timer'? [-Werror=implicit-function-declaration]
  89.   init_timer(ptimer);
  90.   ^~~~~~~~~~
  91.   _init_timer
  92. In file included from /var/lib/dkms/8192cu/v4.0.2_9000/build/core/rtw_security.c:23:0:
  93. /var/lib/dkms/8192cu/v4.0.2_9000/build/include/osdep_service.h: In function '_init_timer':
  94. /var/lib/dkms/8192cu/v4.0.2_9000/build/include/osdep_service.h:962:8: error: '_timer {aka struct timer_list}' has no member named 'data'
  95.   ptimer->data = (unsigned long)cntx;
  96.         ^~
  97. /var/lib/dkms/8192cu/v4.0.2_9000/build/include/osdep_service.h:963:2: error: implicit declaration of function 'init_timer'; did you mean '_init_timer'? [-Werror=implicit-function-declaration]
  98.   init_timer(ptimer);
  99.   ^~~~~~~~~~
  100.   _init_timer
  101. In file included from /var/lib/dkms/8192cu/v4.0.2_9000/build/core/rtw_ioctl_set.c:24:0:
  102. /var/lib/dkms/8192cu/v4.0.2_9000/build/include/osdep_service.h: In function '_init_timer':
  103. /var/lib/dkms/8192cu/v4.0.2_9000/build/include/osdep_service.h:962:8: error: '_timer {aka struct timer_list}' has no member named 'data'
  104.   ptimer->data = (unsigned long)cntx;
  105.         ^~
  106. /var/lib/dkms/8192cu/v4.0.2_9000/build/include/osdep_service.h:963:2: error: implicit declaration of function 'init_timer'; did you mean '_init_timer'? [-Werror=implicit-function-declaration]
  107.   init_timer(ptimer);
  108.   ^~~~~~~~~~
  109.   _init_timer
  110. cc1: some warnings being treated as errors
  111. make[1]: *** [scripts/Makefile.build:324: /var/lib/dkms/8192cu/v4.0.2_9000/build/core/rtw_io.o] Error 1
  112. make[1]: *** Waiting for unfinished jobs....
  113. cc1: some warnings being treated as errors
  114. cc1: some warnings being treated as errors
  115. make[1]: *** [scripts/Makefile.build:324: /var/lib/dkms/8192cu/v4.0.2_9000/build/core/rtw_cmd.o] Error 1
  116. make[1]: *** [scripts/Makefile.build:324: /var/lib/dkms/8192cu/v4.0.2_9000/build/core/rtw_ioctl_query.o] Error 1
  117. cc1: some warnings being treated as errors
  118. In file included from /var/lib/dkms/8192cu/v4.0.2_9000/build/core/rtw_mlme.c:24:0:
  119. /var/lib/dkms/8192cu/v4.0.2_9000/build/include/osdep_service.h: In function '_init_timer':
  120. /var/lib/dkms/8192cu/v4.0.2_9000/build/include/osdep_service.h:962:8: error: '_timer {aka struct timer_list}' has no member named 'data'
  121.   ptimer->data = (unsigned long)cntx;
  122.         ^~
  123. /var/lib/dkms/8192cu/v4.0.2_9000/build/core/rtw_security.c: In function 'aes_cipher':
  124. /var/lib/dkms/8192cu/v4.0.2_9000/build/core/rtw_security.c:1504:5: warning: this 'for' clause does not guard... [-Wmisleading-indentation]
  125.      for (j = 0; j < 8; j++)
  126.      ^~~
  127. /var/lib/dkms/8192cu/v4.0.2_9000/build/core/rtw_security.c:1507:2: note: ...this statement, but the latter is misleadingly indented as if it were guarded by the 'for'
  128.   payload_index = hdrlen + 8;
  129.   ^~~~~~~~~~~~~
  130. /var/lib/dkms/8192cu/v4.0.2_9000/build/include/osdep_service.h:963:2: error: implicit declaration of function 'init_timer'; did you mean '_init_timer'? [-Werror=implicit-function-declaration]
  131.   init_timer(ptimer);
  132.   ^~~~~~~~~~
  133.   _init_timer
  134. cc1: some warnings being treated as errors
  135. make[1]: *** [scripts/Makefile.build:324: /var/lib/dkms/8192cu/v4.0.2_9000/build/core/rtw_debug.o] Error 1
  136. /var/lib/dkms/8192cu/v4.0.2_9000/build/core/rtw_security.c: In function 'aes_decipher':
  137. /var/lib/dkms/8192cu/v4.0.2_9000/build/core/rtw_security.c:1878:5: warning: this 'for' clause does not guard... [-Wmisleading-indentation]
  138.      for (j = 0; j < 8; j++)
  139.      ^~~
  140. /var/lib/dkms/8192cu/v4.0.2_9000/build/core/rtw_security.c:1881:2: note: ...this statement, but the latter is misleadingly indented as if it were guarded by the 'for'
  141.   payload_index = hdrlen + 8;
  142.   ^~~~~~~~~~~~~
  143. make[1]: *** [scripts/Makefile.build:324: /var/lib/dkms/8192cu/v4.0.2_9000/build/core/rtw_ieee80211.o] Error 1
  144. cc1: some warnings being treated as errors
  145. make[1]: *** [scripts/Makefile.build:324: /var/lib/dkms/8192cu/v4.0.2_9000/build/core/rtw_ioctl_set.o] Error 1
  146. cc1: some warnings being treated as errors
  147. make[1]: *** [scripts/Makefile.build:324: /var/lib/dkms/8192cu/v4.0.2_9000/build/core/rtw_security.o] Error 1
  148. cc1: some warnings being treated as errors
  149. make[1]: *** [scripts/Makefile.build:324: /var/lib/dkms/8192cu/v4.0.2_9000/build/core/rtw_mlme.o] Error 1
  150. make: *** [Makefile:1515: _module_/var/lib/dkms/8192cu/v4.0.2_9000/build] Error 2
  151. make: Leaving directory '/usr/lib/modules/4.15.11-1-ARCH/build'
RAW Paste Data
We use cookies for various purposes including analytics. By continuing to use Pastebin, you agree to our use of cookies as described in the Cookies Policy. OK, I Understand
 
Top