SHARE
TWEET

Untitled

a guest May 4th, 2019 107 Never
Not a member of Pastebin yet? Sign Up, it unlocks many cool features!
  1. ./wtf/HashSet.h: In instantiation of ‘std::pair<WTF::HashTableConstIteratorAdapter<WTF::HashTable<typename TraitsArg::TraitType, typename TraitsArg::TraitType, WTF::IdentityExtractor<typename TraitsArg::TraitType>, HashArg, TraitsArg, TraitsArg>, typename TraitsArg::TraitType>, bool> WTF::HashSet<Value, HashFunctions, Traits>::add(const ValueType&) [with ValueArg = void*; HashArg = WTF::PtrHash<void*>; TraitsArg = WTF::HashTraits<void*>; typename TraitsArg::TraitType = void*; WTF::HashSet<Value, HashFunctions, Traits>::ValueType = void*]’:
  2. heap/MarkStack.h:74:71:   required from here
  3. ./wtf/HashSet.h:191:32: error: could not convert ‘((WTF::HashSet<void*>*)this)->WTF::HashSet<void*>::m_impl.WTF::HashTable<void*, void*, WTF::IdentityExtractor<void*>, WTF::PtrHash<void*>, WTF::HashTraits<void*>, WTF::HashTraits<void*> >::add((* & value))’ from ‘pair<WTF::HashTableIterator<void*, void*, WTF::IdentityExtractor<void*>, WTF::PtrHash<void*>, WTF::HashTraits<void*>, WTF::HashTraits<void*> >,[...]>’ to ‘pair<WTF::HashTableConstIteratorAdapter<WTF::HashTable<void*, void*, WTF::IdentityExtractor<void*>, WTF::PtrHash<void*>, WTF::HashTraits<void*>, WTF::HashTraits<void*> >, void*>,[...]>’
  4.          return m_impl.add(value);
  5.                                 ^
  6. yarr/YarrInterpreter.cpp: In member function ‘bool JSC::Yarr::Interpreter::backtrackParenthesesOnceEnd(JSC::Yarr::ByteTerm&, JSC::Yarr::Interpreter::DisjunctionContext*)’:
  7. yarr/YarrInterpreter.cpp:707:13: warning: this statement may fall through [-Wimplicit-fallthrough=]
  8.              if (backTrack->begin == notFound) {
  9.              ^~
  10. yarr/YarrInterpreter.cpp:711:9: note: here
  11.          case QuantifierNonGreedy:
  12.          ^~~~
  13. make[2]: *** [Makefile.WebKit:2552: .obj/release-static/MainThread.o] Error 1
  14. make[2]: *** [Makefile.WebKit:1062: .obj/release-static/YarrInterpreter.o] Error 1
  15. make[2]: *** [Makefile.WebKit:1788: .obj/release-static/DateMath.o] Error 1
  16. make[2]: Leaving directory '/tmp/makepkg/qt4/src/qt-everywhere-opensource-src-4.8.7/src/3rdparty/webkit/Source/JavaScriptCore'
  17. make[1]: *** [Makefile.WebKit:43: sub-JavaScriptCore-JavaScriptCore-pro-make_default-ordered] Error 2
  18. make[1]: *** Waiting for unfinished jobs....
  19. make[1]: Leaving directory '/tmp/makepkg/qt4/src/qt-everywhere-opensource-src-4.8.7/src/3rdparty/webkit/Source'
  20. make: *** [Makefile:747: sub-webkit-make_default-ordered] Error 2
  21. ==> ERROR: A failure occurred in build().
  22.     Aborting...
  23. Error making: qt4
RAW Paste Data
We use cookies for various purposes including analytics. By continuing to use Pastebin, you agree to our use of cookies as described in the Cookies Policy. OK, I Understand
 
Top