indigoparadox

Untitled

May 11th, 2013
80
0
Never
Not a member of Pastebin yet? Sign Up, it unlocks many cool features!
text 44.74 KB | None | 0 0
  1.  * Package: sys-fs/zfs-kmod-0.6.1
  2.  * Repository: gentoo
  3.  * Maintainer: [email protected]
  4.  * USE: abi_x86_64 amd64 debug elibc_glibc kernel_linux multilib rootfs userland_GNU
  5.  * FEATURES: distcc sandbox
  6. * Determining the location of the kernel source code
  7. * Found kernel source directory:
  8. * /usr/src/linux
  9. * Found kernel object directory:
  10. * /lib/modules/3.8.6-hardened/build
  11. * Found sources for kernel version:
  12. * 3.8.6-hardened
  13. * Checking for suitable kernel configuration options...
  14.  [ ok ]
  15. >>> Unpacking source...
  16. >>> Unpacking zfs-0.6.1.tar.gz to /var/tmp/portage/sys-fs/zfs-kmod-0.6.1/work
  17. >>> Source unpacked in /var/tmp/portage/sys-fs/zfs-kmod-0.6.1/work
  18. >>> Preparing source in /var/tmp/portage/sys-fs/zfs-kmod-0.6.1/work/zfs-zfs-0.6.1 ...
  19. * Running eautoreconf in '/var/tmp/portage/sys-fs/zfs-kmod-0.6.1/work/zfs-zfs-0.6.1' ...
  20. * Running libtoolize --install --copy --force --automake ...
  21.  [ ok ]
  22. * Running aclocal -I config ...
  23.  [ ok ]
  24. * Running autoconf -I config ...
  25.  [ ok ]
  26. * Running autoheader -I config ...
  27.  [ ok ]
  28. * Running automake --add-missing --copy --foreign ...
  29.  [ ok ]
  30. * Running elibtoolize in: zfs-zfs-0.6.1/config/
  31. * Applying portage/1.2.0 patch ...
  32. * Applying sed/1.5.6 patch ...
  33. * Applying as-needed/2.2.6 patch ...
  34. >>> Source prepared.
  35. >>> Configuring source in /var/tmp/portage/sys-fs/zfs-kmod-0.6.1/work/zfs-zfs-0.6.1 ...
  36. >>> Working in BUILD_DIR: "/var/tmp/portage/sys-fs/zfs-kmod-0.6.1/work/zfs-zfs-0.6.1"
  37. * econf: updating zfs-zfs-0.6.1/config/config.sub with /usr/share/gnuconfig/config.sub
  38. * econf: updating zfs-zfs-0.6.1/config/config.guess with /usr/share/gnuconfig/config.guess
  39. /var/tmp/portage/sys-fs/zfs-kmod-0.6.1/work/zfs-zfs-0.6.1/configure --prefix=/usr --build=x86_64-pc-linux-gnu --host=x86_64-pc-linux-gnu --mandir=/usr/share/man --infodir=/usr/share/info --datadir=/usr/share --sysconfdir=/etc --localstatedir=/var/lib --libdir=/usr/lib64 --disable-dependency-tracking --docdir=/usr/share/doc/zfs-kmod-0.6.1 --bindir=/bin --sbindir=/sbin --with-config=kernel --with-linux=/usr/src/linux --with-linux-obj=/lib/modules/3.8.6-hardened/build --enable-debug
  40. checking metadata... META file
  41. checking build system type... x86_64-pc-linux-gnu
  42. checking host system type... x86_64-pc-linux-gnu
  43. checking target system type... x86_64-pc-linux-gnu
  44. checking whether to enable maintainer-specific portions of Makefiles... no
  45. checking whether make supports nested variables... yes
  46. checking for a BSD-compatible install... /usr/bin/install -c
  47. checking whether build environment is sane... yes
  48. checking for a thread-safe mkdir -p... /bin/mkdir -p
  49. checking for gawk... gawk
  50. checking whether make sets $(MAKE)... yes
  51. checking for x86_64-pc-linux-gnu-gcc... x86_64-pc-linux-gnu-gcc
  52. checking whether the C compiler works... yes
  53. checking for C compiler default output file name... a.out
  54. checking for suffix of executables...
  55. checking whether we are cross compiling... no
  56. checking for suffix of object files... o
  57. checking whether we are using the GNU C compiler... yes
  58. checking whether x86_64-pc-linux-gnu-gcc accepts -g... yes
  59. checking for x86_64-pc-linux-gnu-gcc option to accept ISO C89... none needed
  60. checking for style of include used by make... GNU
  61. checking dependency style of x86_64-pc-linux-gnu-gcc... none
  62. checking how to print strings... printf
  63. checking for a sed that does not truncate output... /bin/sed
  64. checking for grep that handles long lines and -e... /bin/grep
  65. checking for egrep... /bin/grep -E
  66. checking for fgrep... /bin/grep -F
  67. checking for ld used by x86_64-pc-linux-gnu-gcc... /usr/x86_64-pc-linux-gnu/bin/ld
  68. checking if the linker (/usr/x86_64-pc-linux-gnu/bin/ld) is GNU ld... yes
  69. checking for BSD- or MS-compatible name lister (nm)... /usr/bin/nm -B
  70. checking the name lister (/usr/bin/nm -B) interface... BSD nm
  71. checking whether ln -s works... yes
  72. checking the maximum length of command line arguments... 1572864
  73. checking whether the shell understands some XSI constructs... yes
  74. checking whether the shell understands "+="... yes
  75. checking how to convert x86_64-pc-linux-gnu file names to x86_64-pc-linux-gnu format... func_convert_file_noop
  76. checking how to convert x86_64-pc-linux-gnu file names to toolchain format... func_convert_file_noop
  77. checking for /usr/x86_64-pc-linux-gnu/bin/ld option to reload object files... -r
  78. checking for x86_64-pc-linux-gnu-objdump... x86_64-pc-linux-gnu-objdump
  79. checking how to recognize dependent libraries... pass_all
  80. checking for x86_64-pc-linux-gnu-dlltool... no
  81. checking for dlltool... no
  82. checking how to associate runtime and link libraries... printf %s\n
  83. checking for x86_64-pc-linux-gnu-ar... x86_64-pc-linux-gnu-ar
  84. checking for archiver @FILE support... @
  85. checking for x86_64-pc-linux-gnu-strip... x86_64-pc-linux-gnu-strip
  86. checking for x86_64-pc-linux-gnu-ranlib... x86_64-pc-linux-gnu-ranlib
  87. checking command to parse /usr/bin/nm -B output from x86_64-pc-linux-gnu-gcc object... ok
  88. checking for sysroot... no
  89. checking for x86_64-pc-linux-gnu-mt... no
  90. checking for mt... no
  91. checking if : is a manifest tool... no
  92. checking how to run the C preprocessor... x86_64-pc-linux-gnu-gcc -E
  93. checking for ANSI C header files... yes
  94. checking for sys/types.h... yes
  95. checking for sys/stat.h... yes
  96. checking for stdlib.h... yes
  97. checking for string.h... yes
  98. checking for memory.h... yes
  99. checking for strings.h... yes
  100. checking for inttypes.h... yes
  101. checking for stdint.h... yes
  102. checking for unistd.h... yes
  103. checking for dlfcn.h... yes
  104. checking for objdir... .libs
  105. checking if x86_64-pc-linux-gnu-gcc supports -fno-rtti -fno-exceptions... no
  106. checking for x86_64-pc-linux-gnu-gcc option to produce PIC... -fPIC -DPIC
  107. checking if x86_64-pc-linux-gnu-gcc PIC flag -fPIC -DPIC works... yes
  108. checking if x86_64-pc-linux-gnu-gcc static flag -static works... yes
  109. checking if x86_64-pc-linux-gnu-gcc supports -c -o file.o... yes
  110. checking if x86_64-pc-linux-gnu-gcc supports -c -o file.o... (cached) yes
  111. checking whether the x86_64-pc-linux-gnu-gcc linker (/usr/x86_64-pc-linux-gnu/bin/ld -m elf_x86_64) supports shared libraries... yes
  112. checking whether -lc should be explicitly linked in... no
  113. checking dynamic linker characteristics... GNU/Linux ld.so
  114. checking how to hardcode library paths into programs... immediate
  115. checking whether stripping libraries is possible... yes
  116. checking if libtool supports shared libraries... yes
  117. checking whether to build shared libraries... yes
  118. checking whether to build static libraries... yes
  119. checking dependency style of x86_64-pc-linux-gnu-gcc... none
  120. checking zfs author... Sun Microsystems/Oracle, Lawrence Livermore National Laboratory
  121. checking zfs license... CDDL
  122. checking linux distribution... gentoo
  123. checking default package type... tgz
  124. checking default init directory... /etc/init.d
  125. checking default init script type... gentoo
  126. checking whether rpm is available... no
  127. checking whether rpmbuild is available... no
  128. checking whether spec files are available... yes (rpm/generic/*.spec.in)
  129. checking whether dpkg is available... no
  130. checking whether dpkg-buildpackage is available... no
  131. checking whether alien is available... no
  132. checking zfs config... kernel
  133. checking for -Wno-unused-but-set-variable support... no
  134. checking kernel source directory... /usr/src/linux
  135. checking kernel build directory... /lib/modules/3.8.6-hardened/build
  136. checking kernel source version... 3.8.6-hardened
  137. checking kernel file name for module symbols... Module.symvers
  138. checking spl source directory... /usr/src/spl-0.6.1
  139. checking spl build directory... /usr/src/spl-0.6.1/3.8.6-hardened
  140. checking spl source version... 0.6.1-1
  141. checking spl file name for module symbols... Module.symvers
  142. checking whether modules can be built... yes
  143. checking whether Linux was built with CONFIG_DEBUG_LOCK_ALLOC... no
  144. checking block device operation prototypes... struct block_device
  145. checking whether kernel defines fmode_t... yes
  146. checking whether kernel defines KOBJ_NAME_LEN... no
  147. checking whether blkdev_get() wants 3 args... yes
  148. checking whether blkdev_get_by_path() is available... yes
  149. checking whether open_bdev_exclusive() is available... no
  150. checking whether lookup_bdev() is available... yes
  151. checking whether invalidate_bdev() wants 1 arg... yes
  152. checking whether bdev_logical_block_size() is available... yes
  153. checking whether bdev_physical_block_size() is available... yes
  154. checking whether BIO_RW_FAILFAST is defined... no
  155. checking whether BIO_RW_FAILFAST_* are defined... no
  156. checking whether REQ_FAILFAST_MASK is defined... yes
  157. checking whether bio_end_io_t wants 2 args... yes
  158. checking whether BIO_RW_SYNC is defined... no
  159. checking whether BIO_RW_SYNCIO is defined... no
  160. checking whether REQ_SYNC is defined... yes
  161. checking whether blk_end_request() is available... yes
  162. checking whether blk_end_request() is GPL-only... no
  163. checking whether blk_queue_flush() is available... yes
  164. checking whether blk_queue_flush() is GPL-only... yes
  165. checking whether blk_queue_max_hw_sectors() is available... yes
  166. checking whether blk_queue_max_segments() is available... yes
  167. checking whether blk_queue_physical_block_size() is available... yes
  168. checking whether blk_queue_io_opt() is available... yes
  169. checking whether blk_queue_nonrot() is available... yes
  170. checking whether blk_queue_discard() is available... yes
  171. checking whether blk_fetch_request() is available... yes
  172. checking whether blk_requeue_request() is available... yes
  173. checking whether blk_rq_bytes() is available... yes
  174. checking whether blk_rq_bytes() is GPL-only... no
  175. checking whether blk_rq_pos() is available... yes
  176. checking whether blk_rq_sectors() is available... yes
  177. checking whether get_disk_ro() is available... yes
  178. checking whether get_gendisk() is available... yes
  179. checking whether rq_is_sync() is available... yes
  180. checking whether rq_for_each_segment() is available... yes
  181. checking whether ql->discard_granularity is available... yes
  182. checking whether super_block uses const struct xattr_hander... yes
  183. checking whether xattr_handler->get() wants dentry... no
  184. checking whether xattr_handler->set() wants dentry... no
  185. checking whether sops->show_options() wants dentry... yes
  186. checking whether fops->fsync() wants... range
  187. checking whether sops->evict_inode() exists... yes
  188. checking whether sops->dirty_inode() wants flags... yes
  189. checking whether sops->nr_cached_objects() exists... yes
  190. checking whether sops->free_cached_objects() exists... yes
  191. checking whether fops->fallocate() exists... yes
  192. checking whether iops->fallocate() exists... no
  193. checking whether iops->create()/mkdir()/mknod() take umode_t... yes
  194. checking whether iops->lookup() takes struct nameidata... no
  195. checking whether iops->create() takes struct nameidata... no
  196. checking whether iops->truncate_range() exists... no
  197. checking whether dops->d_automount() exists... yes
  198. checking whether eops->encode_fh() wants inode... yes
  199. checking whether eops->commit_metadata() exists... yes
  200. checking whether clear_inode() is available... yes
  201. checking whether insert_inode_locked() is available... yes
  202. checking whether d_make_root() is available... yes
  203. checking whether d_obtain_alias() is available... yes
  204. checking whether d_set_d_op() is available... yes
  205. checking whether dops->d_revalidate() takes struct nameidata... no
  206. checking whether dentry uses const struct dentry_operations... yes
  207. checking whether check_disk_size_change() is available... yes
  208. checking whether truncate_setsize() is available... yes
  209. checking whether security_inode_init_security wants 6 args... no
  210. checking whether security_inode_init_security wants callback... yes
  211. checking whether mount_nodev() is available... yes
  212. checking whether super_block has s_shrink... yes
  213. checking whether super_block has s_d_op... yes
  214. checking whether super_block has s_bdi... yes
  215. checking whether bdi_setup_and_register() is available... yes
  216. checking whether set_nlink() is available... yes
  217. checking whether elevator_change() is available... yes
  218. checking whether sget() wants 5 args... yes
  219. checking whether debugging is enabled... yes
  220. checking whether dmu tx validation is enabled... no
  221. checking that generated files are newer than configure... done
  222. configure: creating ./config.status
  223. config.status: creating Makefile
  224. config.status: creating dracut/Makefile
  225. config.status: creating dracut/90zfs/Makefile
  226. config.status: creating udev/Makefile
  227. config.status: creating udev/rules.d/Makefile
  228. config.status: creating etc/Makefile
  229. config.status: creating etc/init.d/Makefile
  230. config.status: creating etc/zfs/Makefile
  231. config.status: creating man/Makefile
  232. config.status: creating man/man1/Makefile
  233. config.status: creating man/man5/Makefile
  234. config.status: creating man/man8/Makefile
  235. config.status: creating lib/Makefile
  236. config.status: creating lib/libspl/Makefile
  237. config.status: creating lib/libspl/asm-generic/Makefile
  238. config.status: creating lib/libspl/asm-i386/Makefile
  239. config.status: creating lib/libspl/asm-x86_64/Makefile
  240. config.status: creating lib/libspl/include/Makefile
  241. config.status: creating lib/libspl/include/ia32/Makefile
  242. config.status: creating lib/libspl/include/ia32/sys/Makefile
  243. config.status: creating lib/libspl/include/rpc/Makefile
  244. config.status: creating lib/libspl/include/sys/Makefile
  245. config.status: creating lib/libspl/include/sys/sysevent/Makefile
  246. config.status: creating lib/libspl/include/sys/dktp/Makefile
  247. config.status: creating lib/libspl/include/util/Makefile
  248. config.status: creating lib/libavl/Makefile
  249. config.status: creating lib/libefi/Makefile
  250. config.status: creating lib/libnvpair/Makefile
  251. config.status: creating lib/libunicode/Makefile
  252. config.status: creating lib/libuutil/Makefile
  253. config.status: creating lib/libzpool/Makefile
  254. config.status: creating lib/libzfs/Makefile
  255. config.status: creating lib/libshare/Makefile
  256. config.status: creating cmd/Makefile
  257. config.status: creating cmd/zdb/Makefile
  258. config.status: creating cmd/zhack/Makefile
  259. config.status: creating cmd/zfs/Makefile
  260. config.status: creating cmd/zinject/Makefile
  261. config.status: creating cmd/zpool/Makefile
  262. config.status: creating cmd/zstreamdump/Makefile
  263. config.status: creating cmd/ztest/Makefile
  264. config.status: creating cmd/zpios/Makefile
  265. config.status: creating cmd/mount_zfs/Makefile
  266. config.status: creating cmd/fsck_zfs/Makefile
  267. config.status: creating cmd/zvol_id/Makefile
  268. config.status: creating cmd/vdev_id/Makefile
  269. config.status: creating module/Makefile
  270. config.status: creating module/avl/Makefile
  271. config.status: creating module/nvpair/Makefile
  272. config.status: creating module/unicode/Makefile
  273. config.status: creating module/zcommon/Makefile
  274. config.status: creating module/zfs/Makefile
  275. config.status: creating module/zpios/Makefile
  276. config.status: creating include/Makefile
  277. config.status: creating include/linux/Makefile
  278. config.status: creating include/sys/Makefile
  279. config.status: creating include/sys/fs/Makefile
  280. config.status: creating include/sys/fm/Makefile
  281. config.status: creating include/sys/fm/fs/Makefile
  282. config.status: creating scripts/Makefile
  283. config.status: creating scripts/zpios-profile/Makefile
  284. config.status: creating scripts/zpios-test/Makefile
  285. config.status: creating scripts/zpool-config/Makefile
  286. config.status: creating scripts/common.sh
  287. config.status: creating rpm/Makefile
  288. config.status: creating rpm/fedora/Makefile
  289. config.status: creating rpm/fedora/zfs.spec
  290. config.status: creating rpm/fedora/zfs-kmod.spec
  291. config.status: creating rpm/fedora/zfs-dkms.spec
  292. config.status: creating rpm/generic/Makefile
  293. config.status: creating rpm/generic/zfs.spec
  294. config.status: creating rpm/generic/zfs-kmod.spec
  295. config.status: creating rpm/generic/zfs-dkms.spec
  296. config.status: creating zfs-script-config.sh
  297. config.status: creating zfs.release
  298. config.status: creating zfs_config.h
  299. config.status: executing depfiles commands
  300. config.status: executing libtool commands
  301. >>> Source configured.
  302. >>> Compiling source in /var/tmp/portage/sys-fs/zfs-kmod-0.6.1/work/zfs-zfs-0.6.1 ...
  303. >>> Working in BUILD_DIR: "/var/tmp/portage/sys-fs/zfs-kmod-0.6.1/work/zfs-zfs-0.6.1"
  304. make
  305. make all-recursive
  306. make[1]: Entering directory `/var/tmp/portage/sys-fs/zfs-kmod-0.6.1/work/zfs-zfs-0.6.1'
  307. Making all in include
  308. make[2]: Entering directory `/var/tmp/portage/sys-fs/zfs-kmod-0.6.1/work/zfs-zfs-0.6.1/include'
  309. Making all in linux
  310. make[3]: Entering directory `/var/tmp/portage/sys-fs/zfs-kmod-0.6.1/work/zfs-zfs-0.6.1/include/linux'
  311. make[3]: Nothing to be done for `all'.
  312. make[3]: Leaving directory `/var/tmp/portage/sys-fs/zfs-kmod-0.6.1/work/zfs-zfs-0.6.1/include/linux'
  313. Making all in sys
  314. make[3]: Entering directory `/var/tmp/portage/sys-fs/zfs-kmod-0.6.1/work/zfs-zfs-0.6.1/include/sys'
  315. Making all in fm
  316. make[4]: Entering directory `/var/tmp/portage/sys-fs/zfs-kmod-0.6.1/work/zfs-zfs-0.6.1/include/sys/fm'
  317. Making all in fs
  318. make[5]: Entering directory `/var/tmp/portage/sys-fs/zfs-kmod-0.6.1/work/zfs-zfs-0.6.1/include/sys/fm/fs'
  319. make[5]: Nothing to be done for `all'.
  320. make[5]: Leaving directory `/var/tmp/portage/sys-fs/zfs-kmod-0.6.1/work/zfs-zfs-0.6.1/include/sys/fm/fs'
  321. make[5]: Entering directory `/var/tmp/portage/sys-fs/zfs-kmod-0.6.1/work/zfs-zfs-0.6.1/include/sys/fm'
  322. make[5]: Nothing to be done for `all-am'.
  323. make[5]: Leaving directory `/var/tmp/portage/sys-fs/zfs-kmod-0.6.1/work/zfs-zfs-0.6.1/include/sys/fm'
  324. make[4]: Leaving directory `/var/tmp/portage/sys-fs/zfs-kmod-0.6.1/work/zfs-zfs-0.6.1/include/sys/fm'
  325. Making all in fs
  326. make[4]: Entering directory `/var/tmp/portage/sys-fs/zfs-kmod-0.6.1/work/zfs-zfs-0.6.1/include/sys/fs'
  327. make[4]: Nothing to be done for `all'.
  328. make[4]: Leaving directory `/var/tmp/portage/sys-fs/zfs-kmod-0.6.1/work/zfs-zfs-0.6.1/include/sys/fs'
  329. make[4]: Entering directory `/var/tmp/portage/sys-fs/zfs-kmod-0.6.1/work/zfs-zfs-0.6.1/include/sys'
  330. make[4]: Nothing to be done for `all-am'.
  331. make[4]: Leaving directory `/var/tmp/portage/sys-fs/zfs-kmod-0.6.1/work/zfs-zfs-0.6.1/include/sys'
  332. make[3]: Leaving directory `/var/tmp/portage/sys-fs/zfs-kmod-0.6.1/work/zfs-zfs-0.6.1/include/sys'
  333. make[3]: Entering directory `/var/tmp/portage/sys-fs/zfs-kmod-0.6.1/work/zfs-zfs-0.6.1/include'
  334. make[3]: Nothing to be done for `all-am'.
  335. make[3]: Leaving directory `/var/tmp/portage/sys-fs/zfs-kmod-0.6.1/work/zfs-zfs-0.6.1/include'
  336. make[2]: Leaving directory `/var/tmp/portage/sys-fs/zfs-kmod-0.6.1/work/zfs-zfs-0.6.1/include'
  337. Making all in rpm
  338. make[2]: Entering directory `/var/tmp/portage/sys-fs/zfs-kmod-0.6.1/work/zfs-zfs-0.6.1/rpm'
  339. Making all in fedora
  340. make[3]: Entering directory `/var/tmp/portage/sys-fs/zfs-kmod-0.6.1/work/zfs-zfs-0.6.1/rpm/fedora'
  341. make[3]: Nothing to be done for `all'.
  342. make[3]: Leaving directory `/var/tmp/portage/sys-fs/zfs-kmod-0.6.1/work/zfs-zfs-0.6.1/rpm/fedora'
  343. Making all in generic
  344. make[3]: Entering directory `/var/tmp/portage/sys-fs/zfs-kmod-0.6.1/work/zfs-zfs-0.6.1/rpm/generic'
  345. make[3]: Nothing to be done for `all'.
  346. make[3]: Leaving directory `/var/tmp/portage/sys-fs/zfs-kmod-0.6.1/work/zfs-zfs-0.6.1/rpm/generic'
  347. make[3]: Entering directory `/var/tmp/portage/sys-fs/zfs-kmod-0.6.1/work/zfs-zfs-0.6.1/rpm'
  348. make[3]: Nothing to be done for `all-am'.
  349. make[3]: Leaving directory `/var/tmp/portage/sys-fs/zfs-kmod-0.6.1/work/zfs-zfs-0.6.1/rpm'
  350. make[2]: Leaving directory `/var/tmp/portage/sys-fs/zfs-kmod-0.6.1/work/zfs-zfs-0.6.1/rpm'
  351. Making all in module
  352. make[2]: Entering directory `/var/tmp/portage/sys-fs/zfs-kmod-0.6.1/work/zfs-zfs-0.6.1/module'
  353. make -C /lib/modules/3.8.6-hardened/build SUBDIRS=`pwd` O=/lib/modules/3.8.6-hardened/build CONFIG_ZFS=m modules
  354. make[3]: Entering directory `/usr/src/linux-3.8.6-hardened'
  355. CC [M] /var/tmp/portage/sys-fs/zfs-kmod-0.6.1/work/zfs-zfs-0.6.1/module/avl/../../module/avl/avl.o
  356. distcc[16848] ERROR: compile /var/tmp/portage/sys-fs/zfs-kmod-0.6.1/work/zfs-zfs-0.6.1/module/avl/../../module/avl/avl.c on 10.250.80.2 failed
  357. distcc[16848] (dcc_build_somewhere) Warning: remote compilation of '/var/tmp/portage/sys-fs/zfs-kmod-0.6.1/work/zfs-zfs-0.6.1/module/avl/../../module/avl/avl.c' failed, retrying locally
  358. distcc[16848] Warning: failed to distribute /var/tmp/portage/sys-fs/zfs-kmod-0.6.1/work/zfs-zfs-0.6.1/module/avl/../../module/avl/avl.c to 10.250.80.2, running locally instead
  359. distcc[16848] (dcc_please_send_email_after_investigation) Warning: remote compilation of '/var/tmp/portage/sys-fs/zfs-kmod-0.6.1/work/zfs-zfs-0.6.1/module/avl/../../module/avl/avl.c' failed, retried locally and got a different result.
  360. LD [M] /var/tmp/portage/sys-fs/zfs-kmod-0.6.1/work/zfs-zfs-0.6.1/module/avl/zavl.o
  361. CC [M] /var/tmp/portage/sys-fs/zfs-kmod-0.6.1/work/zfs-zfs-0.6.1/module/nvpair/../../module/nvpair/nvpair.o
  362. distcc[16872] (dcc_build_somewhere) Warning: failed to distribute, running locally instead
  363. CC [M] /var/tmp/portage/sys-fs/zfs-kmod-0.6.1/work/zfs-zfs-0.6.1/module/nvpair/../../module/nvpair/fnvpair.o
  364. distcc[16886] (dcc_build_somewhere) Warning: failed to distribute, running locally instead
  365. CC [M] /var/tmp/portage/sys-fs/zfs-kmod-0.6.1/work/zfs-zfs-0.6.1/module/nvpair/../../module/nvpair/nvpair_alloc_spl.o
  366. distcc[16895] (dcc_build_somewhere) Warning: failed to distribute, running locally instead
  367. CC [M] /var/tmp/portage/sys-fs/zfs-kmod-0.6.1/work/zfs-zfs-0.6.1/module/nvpair/../../module/nvpair/nvpair_alloc_fixed.o
  368. distcc[16904] (dcc_build_somewhere) Warning: failed to distribute, running locally instead
  369. LD [M] /var/tmp/portage/sys-fs/zfs-kmod-0.6.1/work/zfs-zfs-0.6.1/module/nvpair/znvpair.o
  370. CC [M] /var/tmp/portage/sys-fs/zfs-kmod-0.6.1/work/zfs-zfs-0.6.1/module/unicode/../../module/unicode/u8_textprep.o
  371. distcc[16925] (dcc_build_somewhere) Warning: failed to distribute, running locally instead
  372. CC [M] /var/tmp/portage/sys-fs/zfs-kmod-0.6.1/work/zfs-zfs-0.6.1/module/unicode/../../module/unicode/uconv.o
  373. distcc[16939] (dcc_build_somewhere) Warning: failed to distribute, running locally instead
  374. LD [M] /var/tmp/portage/sys-fs/zfs-kmod-0.6.1/work/zfs-zfs-0.6.1/module/unicode/zunicode.o
  375. CC [M] /var/tmp/portage/sys-fs/zfs-kmod-0.6.1/work/zfs-zfs-0.6.1/module/zcommon/../../module/zcommon/zfs_deleg.o
  376. distcc[16969] (dcc_build_somewhere) Warning: failed to distribute, running locally instead
  377. CC [M] /var/tmp/portage/sys-fs/zfs-kmod-0.6.1/work/zfs-zfs-0.6.1/module/zcommon/../../module/zcommon/zfs_prop.o
  378. distcc[16980] (dcc_build_somewhere) Warning: failed to distribute, running locally instead
  379. CC [M] /var/tmp/portage/sys-fs/zfs-kmod-0.6.1/work/zfs-zfs-0.6.1/module/zcommon/../../module/zcommon/zprop_common.o
  380. distcc[16993] (dcc_build_somewhere) Warning: failed to distribute, running locally instead
  381. CC [M] /var/tmp/portage/sys-fs/zfs-kmod-0.6.1/work/zfs-zfs-0.6.1/module/zcommon/../../module/zcommon/zfs_namecheck.o
  382. distcc[17004] (dcc_build_somewhere) Warning: failed to distribute, running locally instead
  383. CC [M] /var/tmp/portage/sys-fs/zfs-kmod-0.6.1/work/zfs-zfs-0.6.1/module/zcommon/../../module/zcommon/zfs_comutil.o
  384. distcc[17015] (dcc_build_somewhere) Warning: failed to distribute, running locally instead
  385. CC [M] /var/tmp/portage/sys-fs/zfs-kmod-0.6.1/work/zfs-zfs-0.6.1/module/zcommon/../../module/zcommon/zfs_fletcher.o
  386. distcc[17024] (dcc_build_somewhere) Warning: failed to distribute, running locally instead
  387. CC [M] /var/tmp/portage/sys-fs/zfs-kmod-0.6.1/work/zfs-zfs-0.6.1/module/zcommon/../../module/zcommon/zfs_uio.o
  388. distcc[17037] (dcc_build_somewhere) Warning: failed to distribute, running locally instead
  389. CC [M] /var/tmp/portage/sys-fs/zfs-kmod-0.6.1/work/zfs-zfs-0.6.1/module/zcommon/../../module/zcommon/zpool_prop.o
  390. distcc[17046] (dcc_build_somewhere) Warning: failed to distribute, running locally instead
  391. LD [M] /var/tmp/portage/sys-fs/zfs-kmod-0.6.1/work/zfs-zfs-0.6.1/module/zcommon/zcommon.o
  392. CC [M] /var/tmp/portage/sys-fs/zfs-kmod-0.6.1/work/zfs-zfs-0.6.1/module/zfs/../../module/zfs/arc.o
  393. distcc[17152] (dcc_build_somewhere) Warning: failed to distribute, running locally instead
  394. CC [M] /var/tmp/portage/sys-fs/zfs-kmod-0.6.1/work/zfs-zfs-0.6.1/module/zfs/../../module/zfs/bplist.o
  395. distcc[17165] (dcc_build_somewhere) Warning: failed to distribute, running locally instead
  396. CC [M] /var/tmp/portage/sys-fs/zfs-kmod-0.6.1/work/zfs-zfs-0.6.1/module/zfs/../../module/zfs/bpobj.o
  397. distcc[17179] (dcc_build_somewhere) Warning: failed to distribute, running locally instead
  398. CC [M] /var/tmp/portage/sys-fs/zfs-kmod-0.6.1/work/zfs-zfs-0.6.1/module/zfs/../../module/zfs/dbuf.o
  399. distcc[17188] (dcc_build_somewhere) Warning: failed to distribute, running locally instead
  400. CC [M] /var/tmp/portage/sys-fs/zfs-kmod-0.6.1/work/zfs-zfs-0.6.1/module/zfs/../../module/zfs/bptree.o
  401. distcc[17220] (dcc_build_somewhere) Warning: failed to distribute, running locally instead
  402. CC [M] /var/tmp/portage/sys-fs/zfs-kmod-0.6.1/work/zfs-zfs-0.6.1/module/zfs/../../module/zfs/ddt.o
  403. distcc[17229] (dcc_build_somewhere) Warning: failed to distribute, running locally instead
  404. CC [M] /var/tmp/portage/sys-fs/zfs-kmod-0.6.1/work/zfs-zfs-0.6.1/module/zfs/../../module/zfs/ddt_zap.o
  405. distcc[17256] (dcc_build_somewhere) Warning: failed to distribute, running locally instead
  406. CC [M] /var/tmp/portage/sys-fs/zfs-kmod-0.6.1/work/zfs-zfs-0.6.1/module/zfs/../../module/zfs/dmu.o
  407. distcc[17269] (dcc_build_somewhere) Warning: failed to distribute, running locally instead
  408. CC [M] /var/tmp/portage/sys-fs/zfs-kmod-0.6.1/work/zfs-zfs-0.6.1/module/zfs/../../module/zfs/dmu_diff.o
  409. distcc[17278] (dcc_build_somewhere) Warning: failed to distribute, running locally instead
  410. CC [M] /var/tmp/portage/sys-fs/zfs-kmod-0.6.1/work/zfs-zfs-0.6.1/module/zfs/../../module/zfs/dmu_object.o
  411. distcc[17291] (dcc_build_somewhere) Warning: failed to distribute, running locally instead
  412. CC [M] /var/tmp/portage/sys-fs/zfs-kmod-0.6.1/work/zfs-zfs-0.6.1/module/zfs/../../module/zfs/dmu_objset.o
  413. distcc[17300] (dcc_build_somewhere) Warning: failed to distribute, running locally instead
  414. CC [M] /var/tmp/portage/sys-fs/zfs-kmod-0.6.1/work/zfs-zfs-0.6.1/module/zfs/../../module/zfs/dmu_send.o
  415. distcc[17313] (dcc_build_somewhere) Warning: failed to distribute, running locally instead
  416. CC [M] /var/tmp/portage/sys-fs/zfs-kmod-0.6.1/work/zfs-zfs-0.6.1/module/zfs/../../module/zfs/dmu_traverse.o
  417. distcc[17326] (dcc_build_somewhere) Warning: failed to distribute, running locally instead
  418. CC [M] /var/tmp/portage/sys-fs/zfs-kmod-0.6.1/work/zfs-zfs-0.6.1/module/zfs/../../module/zfs/dmu_tx.o
  419. distcc[17337] (dcc_build_somewhere) Warning: failed to distribute, running locally instead
  420. CC [M] /var/tmp/portage/sys-fs/zfs-kmod-0.6.1/work/zfs-zfs-0.6.1/module/zfs/../../module/zfs/dmu_zfetch.o
  421. distcc[17371] (dcc_build_somewhere) Warning: failed to distribute, running locally instead
  422. CC [M] /var/tmp/portage/sys-fs/zfs-kmod-0.6.1/work/zfs-zfs-0.6.1/module/zfs/../../module/zfs/dnode.o
  423. distcc[17381] (dcc_build_somewhere) Warning: failed to distribute, running locally instead
  424. CC [M] /var/tmp/portage/sys-fs/zfs-kmod-0.6.1/work/zfs-zfs-0.6.1/module/zfs/../../module/zfs/dnode_sync.o
  425. distcc[17394] (dcc_build_somewhere) Warning: failed to distribute, running locally instead
  426. CC [M] /var/tmp/portage/sys-fs/zfs-kmod-0.6.1/work/zfs-zfs-0.6.1/module/zfs/../../module/zfs/dsl_dataset.o
  427. distcc[17403] (dcc_build_somewhere) Warning: failed to distribute, running locally instead
  428. CC [M] /var/tmp/portage/sys-fs/zfs-kmod-0.6.1/work/zfs-zfs-0.6.1/module/zfs/../../module/zfs/dsl_deadlist.o
  429. distcc[17417] ERROR: compile /var/tmp/portage/sys-fs/zfs-kmod-0.6.1/work/zfs-zfs-0.6.1/module/zfs/../../module/zfs/dsl_deadlist.c on 10.250.80.2 failed
  430. distcc[17417] (dcc_build_somewhere) Warning: remote compilation of '/var/tmp/portage/sys-fs/zfs-kmod-0.6.1/work/zfs-zfs-0.6.1/module/zfs/../../module/zfs/dsl_deadlist.c' failed, retrying locally
  431. distcc[17417] Warning: failed to distribute /var/tmp/portage/sys-fs/zfs-kmod-0.6.1/work/zfs-zfs-0.6.1/module/zfs/../../module/zfs/dsl_deadlist.c to 10.250.80.2, running locally instead
  432. distcc[17417] (dcc_please_send_email_after_investigation) Warning: remote compilation of '/var/tmp/portage/sys-fs/zfs-kmod-0.6.1/work/zfs-zfs-0.6.1/module/zfs/../../module/zfs/dsl_deadlist.c' failed, retried locally and got a different result.
  433. CC [M] /var/tmp/portage/sys-fs/zfs-kmod-0.6.1/work/zfs-zfs-0.6.1/module/zfs/../../module/zfs/dsl_deleg.o
  434. distcc[17434] (dcc_build_somewhere) Warning: failed to distribute, running locally instead
  435. CC [M] /var/tmp/portage/sys-fs/zfs-kmod-0.6.1/work/zfs-zfs-0.6.1/module/zfs/../../module/zfs/dsl_dir.o
  436. distcc[17444] (dcc_build_somewhere) Warning: failed to distribute, running locally instead
  437. CC [M] /var/tmp/portage/sys-fs/zfs-kmod-0.6.1/work/zfs-zfs-0.6.1/module/zfs/../../module/zfs/dsl_pool.o
  438. distcc[17459] (dcc_build_somewhere) Warning: failed to distribute, running locally instead
  439. CC [M] /var/tmp/portage/sys-fs/zfs-kmod-0.6.1/work/zfs-zfs-0.6.1/module/zfs/../../module/zfs/dsl_prop.o
  440. distcc[17471] (dcc_build_somewhere) Warning: failed to distribute, running locally instead
  441. CC [M] /var/tmp/portage/sys-fs/zfs-kmod-0.6.1/work/zfs-zfs-0.6.1/module/zfs/../../module/zfs/dsl_scan.o
  442. distcc[17484] (dcc_build_somewhere) Warning: failed to distribute, running locally instead
  443. CC [M] /var/tmp/portage/sys-fs/zfs-kmod-0.6.1/work/zfs-zfs-0.6.1/module/zfs/../../module/zfs/dsl_synctask.o
  444. distcc[17506] (dcc_build_somewhere) Warning: failed to distribute, running locally instead
  445. CC [M] /var/tmp/portage/sys-fs/zfs-kmod-0.6.1/work/zfs-zfs-0.6.1/module/zfs/../../module/zfs/fm.o
  446. distcc[17518] (dcc_build_somewhere) Warning: failed to distribute, running locally instead
  447. CC [M] /var/tmp/portage/sys-fs/zfs-kmod-0.6.1/work/zfs-zfs-0.6.1/module/zfs/../../module/zfs/gzip.o
  448. distcc[17531] (dcc_build_somewhere) Warning: failed to distribute, running locally instead
  449. CC [M] /var/tmp/portage/sys-fs/zfs-kmod-0.6.1/work/zfs-zfs-0.6.1/module/zfs/../../module/zfs/lzjb.o
  450. distcc[17544] (dcc_build_somewhere) Warning: failed to distribute, running locally instead
  451. CC [M] /var/tmp/portage/sys-fs/zfs-kmod-0.6.1/work/zfs-zfs-0.6.1/module/zfs/../../module/zfs/lz4.o
  452. distcc[17553] (dcc_build_somewhere) Warning: failed to distribute, running locally instead
  453. CC [M] /var/tmp/portage/sys-fs/zfs-kmod-0.6.1/work/zfs-zfs-0.6.1/module/zfs/../../module/zfs/metaslab.o
  454. distcc[17562] (dcc_build_somewhere) Warning: failed to distribute, running locally instead
  455. CC [M] /var/tmp/portage/sys-fs/zfs-kmod-0.6.1/work/zfs-zfs-0.6.1/module/zfs/../../module/zfs/refcount.o
  456. distcc[17576] (dcc_build_somewhere) Warning: failed to distribute, running locally instead
  457. CC [M] /var/tmp/portage/sys-fs/zfs-kmod-0.6.1/work/zfs-zfs-0.6.1/module/zfs/../../module/zfs/rrwlock.o
  458. distcc[17588] (dcc_build_somewhere) Warning: failed to distribute, running locally instead
  459. CC [M] /var/tmp/portage/sys-fs/zfs-kmod-0.6.1/work/zfs-zfs-0.6.1/module/zfs/../../module/zfs/sa.o
  460. distcc[17599] (dcc_build_somewhere) Warning: failed to distribute, running locally instead
  461. CC [M] /var/tmp/portage/sys-fs/zfs-kmod-0.6.1/work/zfs-zfs-0.6.1/module/zfs/../../module/zfs/sha256.o
  462. distcc[17612] (dcc_build_somewhere) Warning: failed to distribute, running locally instead
  463. CC [M] /var/tmp/portage/sys-fs/zfs-kmod-0.6.1/work/zfs-zfs-0.6.1/module/zfs/../../module/zfs/spa.o
  464. distcc[17621] (dcc_build_somewhere) Warning: failed to distribute, running locally instead
  465. CC [M] /var/tmp/portage/sys-fs/zfs-kmod-0.6.1/work/zfs-zfs-0.6.1/module/zfs/../../module/zfs/spa_boot.o
  466. distcc[17640] (dcc_build_somewhere) Warning: failed to distribute, running locally instead
  467. CC [M] /var/tmp/portage/sys-fs/zfs-kmod-0.6.1/work/zfs-zfs-0.6.1/module/zfs/../../module/zfs/spa_config.o
  468. distcc[17649] (dcc_build_somewhere) Warning: failed to distribute, running locally instead
  469. CC [M] /var/tmp/portage/sys-fs/zfs-kmod-0.6.1/work/zfs-zfs-0.6.1/module/zfs/../../module/zfs/spa_errlog.o
  470. distcc[17663] (dcc_build_somewhere) Warning: failed to distribute, running locally instead
  471. CC [M] /var/tmp/portage/sys-fs/zfs-kmod-0.6.1/work/zfs-zfs-0.6.1/module/zfs/../../module/zfs/spa_history.o
  472. distcc[17674] (dcc_build_somewhere) Warning: failed to distribute, running locally instead
  473. CC [M] /var/tmp/portage/sys-fs/zfs-kmod-0.6.1/work/zfs-zfs-0.6.1/module/zfs/../../module/zfs/spa_misc.o
  474. distcc[17683] (dcc_build_somewhere) Warning: failed to distribute, running locally instead
  475. CC [M] /var/tmp/portage/sys-fs/zfs-kmod-0.6.1/work/zfs-zfs-0.6.1/module/zfs/../../module/zfs/space_map.o
  476. distcc[17699] (dcc_build_somewhere) Warning: failed to distribute, running locally instead
  477. CC [M] /var/tmp/portage/sys-fs/zfs-kmod-0.6.1/work/zfs-zfs-0.6.1/module/zfs/../../module/zfs/txg.o
  478. distcc[17713] (dcc_build_somewhere) Warning: failed to distribute, running locally instead
  479. CC [M] /var/tmp/portage/sys-fs/zfs-kmod-0.6.1/work/zfs-zfs-0.6.1/module/zfs/../../module/zfs/uberblock.o
  480. distcc[17727] (dcc_build_somewhere) Warning: failed to distribute, running locally instead
  481. CC [M] /var/tmp/portage/sys-fs/zfs-kmod-0.6.1/work/zfs-zfs-0.6.1/module/zfs/../../module/zfs/unique.o
  482. distcc[17736] (dcc_build_somewhere) Warning: failed to distribute, running locally instead
  483. CC [M] /var/tmp/portage/sys-fs/zfs-kmod-0.6.1/work/zfs-zfs-0.6.1/module/zfs/../../module/zfs/vdev.o
  484. distcc[17763] (dcc_build_somewhere) Warning: failed to distribute, running locally instead
  485. CC [M] /var/tmp/portage/sys-fs/zfs-kmod-0.6.1/work/zfs-zfs-0.6.1/module/zfs/../../module/zfs/vdev_cache.o
  486. distcc[17776] (dcc_build_somewhere) Warning: failed to distribute, running locally instead
  487. CC [M] /var/tmp/portage/sys-fs/zfs-kmod-0.6.1/work/zfs-zfs-0.6.1/module/zfs/../../module/zfs/vdev_disk.o
  488. distcc[17785] (dcc_build_somewhere) Warning: failed to distribute, running locally instead
  489. CC [M] /var/tmp/portage/sys-fs/zfs-kmod-0.6.1/work/zfs-zfs-0.6.1/module/zfs/../../module/zfs/vdev_file.o
  490. distcc[17798] (dcc_build_somewhere) Warning: failed to distribute, running locally instead
  491. CC [M] /var/tmp/portage/sys-fs/zfs-kmod-0.6.1/work/zfs-zfs-0.6.1/module/zfs/../../module/zfs/vdev_label.o
  492. distcc[17807] (dcc_build_somewhere) Warning: failed to distribute, running locally instead
  493. CC [M] /var/tmp/portage/sys-fs/zfs-kmod-0.6.1/work/zfs-zfs-0.6.1/module/zfs/../../module/zfs/vdev_mirror.o
  494. distcc[17816] (dcc_build_somewhere) Warning: failed to distribute, running locally instead
  495. CC [M] /var/tmp/portage/sys-fs/zfs-kmod-0.6.1/work/zfs-zfs-0.6.1/module/zfs/../../module/zfs/vdev_missing.o
  496. distcc[17827] (dcc_build_somewhere) Warning: failed to distribute, running locally instead
  497. CC [M] /var/tmp/portage/sys-fs/zfs-kmod-0.6.1/work/zfs-zfs-0.6.1/module/zfs/../../module/zfs/vdev_queue.o
  498. distcc[17841] (dcc_build_somewhere) Warning: failed to distribute, running locally instead
  499. CC [M] /var/tmp/portage/sys-fs/zfs-kmod-0.6.1/work/zfs-zfs-0.6.1/module/zfs/../../module/zfs/vdev_raidz.o
  500. distcc[17850] (dcc_build_somewhere) Warning: failed to distribute, running locally instead
  501. CC [M] /var/tmp/portage/sys-fs/zfs-kmod-0.6.1/work/zfs-zfs-0.6.1/module/zfs/../../module/zfs/vdev_root.o
  502. distcc[17864] ERROR: compile /var/tmp/portage/sys-fs/zfs-kmod-0.6.1/work/zfs-zfs-0.6.1/module/zfs/../../module/zfs/vdev_root.c on 10.250.80.2 failed
  503. distcc[17864] (dcc_build_somewhere) Warning: remote compilation of '/var/tmp/portage/sys-fs/zfs-kmod-0.6.1/work/zfs-zfs-0.6.1/module/zfs/../../module/zfs/vdev_root.c' failed, retrying locally
  504. distcc[17864] Warning: failed to distribute /var/tmp/portage/sys-fs/zfs-kmod-0.6.1/work/zfs-zfs-0.6.1/module/zfs/../../module/zfs/vdev_root.c to 10.250.80.2, running locally instead
  505. distcc[17864] (dcc_please_send_email_after_investigation) Warning: remote compilation of '/var/tmp/portage/sys-fs/zfs-kmod-0.6.1/work/zfs-zfs-0.6.1/module/zfs/../../module/zfs/vdev_root.c' failed, retried locally and got a different result.
  506. CC [M] /var/tmp/portage/sys-fs/zfs-kmod-0.6.1/work/zfs-zfs-0.6.1/module/zfs/../../module/zfs/zap.o
  507. distcc[17878] (dcc_build_somewhere) Warning: failed to distribute, running locally instead
  508. CC [M] /var/tmp/portage/sys-fs/zfs-kmod-0.6.1/work/zfs-zfs-0.6.1/module/zfs/../../module/zfs/zap_leaf.o
  509. distcc[17887] (dcc_build_somewhere) Warning: failed to distribute, running locally instead
  510. CC [M] /var/tmp/portage/sys-fs/zfs-kmod-0.6.1/work/zfs-zfs-0.6.1/module/zfs/../../module/zfs/zap_micro.o
  511. distcc[17900] (dcc_build_somewhere) Warning: failed to distribute, running locally instead
  512. CC [M] /var/tmp/portage/sys-fs/zfs-kmod-0.6.1/work/zfs-zfs-0.6.1/module/zfs/../../module/zfs/zfeature.o
  513. distcc[17909] (dcc_build_somewhere) Warning: failed to distribute, running locally instead
  514. CC [M] /var/tmp/portage/sys-fs/zfs-kmod-0.6.1/work/zfs-zfs-0.6.1/module/zfs/../../module/zfs/zfeature_common.o
  515. distcc[17919] (dcc_build_somewhere) Warning: failed to distribute, running locally instead
  516. CC [M] /var/tmp/portage/sys-fs/zfs-kmod-0.6.1/work/zfs-zfs-0.6.1/module/zfs/../../module/zfs/zfs_acl.o
  517. distcc[17931] (dcc_build_somewhere) Warning: failed to distribute, running locally instead
  518. CC [M] /var/tmp/portage/sys-fs/zfs-kmod-0.6.1/work/zfs-zfs-0.6.1/module/zfs/../../module/zfs/zfs_byteswap.o
  519. distcc[17940] (dcc_build_somewhere) Warning: failed to distribute, running locally instead
  520. CC [M] /var/tmp/portage/sys-fs/zfs-kmod-0.6.1/work/zfs-zfs-0.6.1/module/zfs/../../module/zfs/zfs_ctldir.o
  521. distcc[17956] (dcc_build_somewhere) Warning: failed to distribute, running locally instead
  522. CC [M] /var/tmp/portage/sys-fs/zfs-kmod-0.6.1/work/zfs-zfs-0.6.1/module/zfs/../../module/zfs/zfs_debug.o
  523. distcc[17965] (dcc_build_somewhere) Warning: failed to distribute, running locally instead
  524. CC [M] /var/tmp/portage/sys-fs/zfs-kmod-0.6.1/work/zfs-zfs-0.6.1/module/zfs/../../module/zfs/zfs_dir.o
  525. distcc[17974] (dcc_build_somewhere) Warning: failed to distribute, running locally instead
  526. CC [M] /var/tmp/portage/sys-fs/zfs-kmod-0.6.1/work/zfs-zfs-0.6.1/module/zfs/../../module/zfs/zfs_fm.o
  527. distcc[17986] (dcc_build_somewhere) Warning: failed to distribute, running locally instead
  528. CC [M] /var/tmp/portage/sys-fs/zfs-kmod-0.6.1/work/zfs-zfs-0.6.1/module/zfs/../../module/zfs/zfs_fuid.o
  529. distcc[17997] (dcc_build_somewhere) Warning: failed to distribute, running locally instead
  530. CC [M] /var/tmp/portage/sys-fs/zfs-kmod-0.6.1/work/zfs-zfs-0.6.1/module/zfs/../../module/zfs/zfs_ioctl.o
  531. distcc[18006] (dcc_build_somewhere) Warning: failed to distribute, running locally instead
  532. CC [M] /var/tmp/portage/sys-fs/zfs-kmod-0.6.1/work/zfs-zfs-0.6.1/module/zfs/../../module/zfs/zfs_log.o
  533. distcc[18020] (dcc_build_somewhere) Warning: failed to distribute, running locally instead
  534. CC [M] /var/tmp/portage/sys-fs/zfs-kmod-0.6.1/work/zfs-zfs-0.6.1/module/zfs/../../module/zfs/zfs_onexit.o
  535. distcc[18032] (dcc_build_somewhere) Warning: failed to distribute, running locally instead
  536. CC [M] /var/tmp/portage/sys-fs/zfs-kmod-0.6.1/work/zfs-zfs-0.6.1/module/zfs/../../module/zfs/zfs_replay.o
  537. distcc[18046] (dcc_build_somewhere) Warning: failed to distribute, running locally instead
  538. CC [M] /var/tmp/portage/sys-fs/zfs-kmod-0.6.1/work/zfs-zfs-0.6.1/module/zfs/../../module/zfs/zfs_rlock.o
  539. distcc[18056] (dcc_build_somewhere) Warning: failed to distribute, running locally instead
  540. CC [M] /var/tmp/portage/sys-fs/zfs-kmod-0.6.1/work/zfs-zfs-0.6.1/module/zfs/../../module/zfs/zfs_sa.o
  541. distcc[18072] (dcc_build_somewhere) Warning: failed to distribute, running locally instead
  542. CC [M] /var/tmp/portage/sys-fs/zfs-kmod-0.6.1/work/zfs-zfs-0.6.1/module/zfs/../../module/zfs/zfs_vfsops.o
  543. distcc[18108] (dcc_build_somewhere) Warning: failed to distribute, running locally instead
  544. CC [M] /var/tmp/portage/sys-fs/zfs-kmod-0.6.1/work/zfs-zfs-0.6.1/module/zfs/../../module/zfs/zfs_vnops.o
  545. distcc[18118] (dcc_build_somewhere) Warning: failed to distribute, running locally instead
  546. CC [M] /var/tmp/portage/sys-fs/zfs-kmod-0.6.1/work/zfs-zfs-0.6.1/module/zfs/../../module/zfs/zfs_znode.o
  547. distcc[18132] (dcc_build_somewhere) Warning: failed to distribute, running locally instead
  548. CC [M] /var/tmp/portage/sys-fs/zfs-kmod-0.6.1/work/zfs-zfs-0.6.1/module/zfs/../../module/zfs/zil.o
  549. distcc[18145] (dcc_build_somewhere) Warning: failed to distribute, running locally instead
  550. CC [M] /var/tmp/portage/sys-fs/zfs-kmod-0.6.1/work/zfs-zfs-0.6.1/module/zfs/../../module/zfs/zio.o
  551. distcc[18154] (dcc_build_somewhere) Warning: failed to distribute, running locally instead
  552. CC [M] /var/tmp/portage/sys-fs/zfs-kmod-0.6.1/work/zfs-zfs-0.6.1/module/zfs/../../module/zfs/zio_checksum.o
  553. distcc[18168] (dcc_build_somewhere) Warning: failed to distribute, running locally instead
  554. CC [M] /var/tmp/portage/sys-fs/zfs-kmod-0.6.1/work/zfs-zfs-0.6.1/module/zfs/../../module/zfs/zio_compress.o
  555. distcc[18178] (dcc_build_somewhere) Warning: failed to distribute, running locally instead
  556. CC [M] /var/tmp/portage/sys-fs/zfs-kmod-0.6.1/work/zfs-zfs-0.6.1/module/zfs/../../module/zfs/zio_inject.o
  557. distcc[18191] (dcc_build_somewhere) Warning: failed to distribute, running locally instead
  558. CC [M] /var/tmp/portage/sys-fs/zfs-kmod-0.6.1/work/zfs-zfs-0.6.1/module/zfs/../../module/zfs/zle.o
  559. distcc[18203] (dcc_build_somewhere) Warning: failed to distribute, running locally instead
  560. CC [M] /var/tmp/portage/sys-fs/zfs-kmod-0.6.1/work/zfs-zfs-0.6.1/module/zfs/../../module/zfs/zpl_ctldir.o
  561. distcc[18213] (dcc_build_somewhere) Warning: failed to distribute, running locally instead
  562. CC [M] /var/tmp/portage/sys-fs/zfs-kmod-0.6.1/work/zfs-zfs-0.6.1/module/zfs/../../module/zfs/zpl_export.o
  563. distcc[18225] (dcc_build_somewhere) Warning: failed to distribute, running locally instead
  564. CC [M] /var/tmp/portage/sys-fs/zfs-kmod-0.6.1/work/zfs-zfs-0.6.1/module/zfs/../../module/zfs/zpl_file.o
  565. distcc[18237] (dcc_build_somewhere) Warning: failed to distribute, running locally instead
  566. CC [M] /var/tmp/portage/sys-fs/zfs-kmod-0.6.1/work/zfs-zfs-0.6.1/module/zfs/../../module/zfs/zpl_inode.o
  567. distcc[18246] (dcc_build_somewhere) Warning: failed to distribute, running locally instead
  568. CC [M] /var/tmp/portage/sys-fs/zfs-kmod-0.6.1/work/zfs-zfs-0.6.1/module/zfs/../../module/zfs/zpl_super.o
  569. distcc[18255] (dcc_build_somewhere) Warning: failed to distribute, running locally instead
  570. CC [M] /var/tmp/portage/sys-fs/zfs-kmod-0.6.1/work/zfs-zfs-0.6.1/module/zfs/../../module/zfs/zpl_xattr.o
  571. distcc[18268] (dcc_build_somewhere) Warning: failed to distribute, running locally instead
  572. cc1: warnings being treated as errors
  573. /var/tmp/portage/sys-fs/zfs-kmod-0.6.1/work/zfs-zfs-0.6.1/module/zfs/../../module/zfs/zpl_xattr.c:521:2: error: initialization from incompatible pointer type
  574. /var/tmp/portage/sys-fs/zfs-kmod-0.6.1/work/zfs-zfs-0.6.1/module/zfs/../../module/zfs/zpl_xattr.c:522:2: error: initialization from incompatible pointer type
  575. /var/tmp/portage/sys-fs/zfs-kmod-0.6.1/work/zfs-zfs-0.6.1/module/zfs/../../module/zfs/zpl_xattr.c:569:2: error: initialization from incompatible pointer type
  576. /var/tmp/portage/sys-fs/zfs-kmod-0.6.1/work/zfs-zfs-0.6.1/module/zfs/../../module/zfs/zpl_xattr.c:570:2: error: initialization from incompatible pointer type
  577. /var/tmp/portage/sys-fs/zfs-kmod-0.6.1/work/zfs-zfs-0.6.1/module/zfs/../../module/zfs/zpl_xattr.c:665:2: error: initialization from incompatible pointer type
  578. /var/tmp/portage/sys-fs/zfs-kmod-0.6.1/work/zfs-zfs-0.6.1/module/zfs/../../module/zfs/zpl_xattr.c:666:2: error: initialization from incompatible pointer type
  579. distcc[18269] ERROR: compile (null) on localhost failed
  580. distcc[18268] ERROR: compile /var/tmp/portage/sys-fs/zfs-kmod-0.6.1/work/zfs-zfs-0.6.1/module/zfs/../../module/zfs/zpl_xattr.c on localhost failed
  581. make[6]: *** [/var/tmp/portage/sys-fs/zfs-kmod-0.6.1/work/zfs-zfs-0.6.1/module/zfs/../../module/zfs/zpl_xattr.o] Error 1
  582. make[5]: *** [/var/tmp/portage/sys-fs/zfs-kmod-0.6.1/work/zfs-zfs-0.6.1/module/zfs] Error 2
  583. make[4]: *** [_module_/var/tmp/portage/sys-fs/zfs-kmod-0.6.1/work/zfs-zfs-0.6.1/module] Error 2
  584. make[3]: *** [sub-make] Error 2
  585. make[3]: Leaving directory `/usr/src/linux-3.8.6-hardened'
  586. make[2]: *** [modules] Error 2
  587. make[2]: Leaving directory `/var/tmp/portage/sys-fs/zfs-kmod-0.6.1/work/zfs-zfs-0.6.1/module'
  588. make[1]: *** [all-recursive] Error 1
  589. make[1]: Leaving directory `/var/tmp/portage/sys-fs/zfs-kmod-0.6.1/work/zfs-zfs-0.6.1'
  590. make: *** [all] Error 2
  591. * ERROR: sys-fs/zfs-kmod-0.6.1 failed (compile phase):
  592. * emake failed
  593. *
  594. * If you need support, post the output of `emerge --info '=sys-fs/zfs-kmod-0.6.1'`,
  595. * the complete build log and the output of `emerge -pqv '=sys-fs/zfs-kmod-0.6.1'`.
  596. * The complete build log is located at '/var/tmp/portage/sys-fs/zfs-kmod-0.6.1/temp/build.log'.
  597. * The ebuild environment file is located at '/var/tmp/portage/sys-fs/zfs-kmod-0.6.1/temp/environment'.
  598. * Working directory: '/var/tmp/portage/sys-fs/zfs-kmod-0.6.1/work/zfs-zfs-0.6.1'
  599. * S: '/var/tmp/portage/sys-fs/zfs-kmod-0.6.1/work/zfs-zfs-0.6.1'
Advertisement
Add Comment
Please, Sign In to add comment