SHARE
TWEET

cado-nfs bug

a guest Jun 21st, 2016 96 Never
Not a member of Pastebin yet? Sign Up, it unlocks many cool features!
  1. [ 58%] Building C object linalg/bwc/CMakeFiles/bwc_mpfq.dir/mpfq/mpfq_u64k1.c.o
  2. In file included from aur-cado-nfs-git/src/cado-nfs/linalg/bwc/mpfq/mpfq_u64k1.c:4:0: aur-cado-nfs-git/src/cado-nfs/linalg/bwc/mpfq/mpfq_u64k1.c: In function ‘mpfq_u64k1_wrapper_vec_ur_rev’: aur-cado-nfs-git/src/cado-nfs/linalg/bwc/mpfq/mpfq_u64k1.h:652:23: error: ‘tmp’ may be used uninitialized in this function [-Werror=maybe-uninitialized]
  3.      mpfq_u64k1_elt_ur tmp[1];
  4.                        ^~~
  5. aur-cado-nfs-git/src/cado-nfs/linalg/bwc/mpfq/mpfq_u64k1.c: In function ‘mpfq_u64k1_wrapper_vec_rev’:
  6. aur-cado-nfs-git/src/cado-nfs/linalg/bwc/mpfq/mpfq_u64k1.h:652:23: error: ‘tmp’ may be used uninitialized in this function [-Werror=maybe-uninitialized]
  7. cc1: some warnings being treated as errors
  8. make[2]: *** [linalg/bwc/CMakeFiles/bwc_mpfq.dir/build.make:87: linalg/bwc/CMakeFiles/bwc_mpfq.dir/mpfq/mpfq_u64k1.c.o] Error 1
  9. make[1]: *** [CMakeFiles/Makefile2:4109: linalg/bwc/CMakeFiles/bwc_mpfq.dir/all] Error 2
  10. make: *** [Makefile:139: all] Error 2
  11. make: *** [Makefile:7: all] Error 1
RAW Paste Data
We use cookies for various purposes including analytics. By continuing to use Pastebin, you agree to our use of cookies as described in the Cookies Policy. OK, I Understand
 
Top