Not a member of Pastebin yet?
Sign Up,
it unlocks many cool features!
- % make
- make[1]: Entering directory '/home/joel/Documents/cuda/samples/0_Simple/simplePrintf'
- "/opt/cuda"/bin/nvcc -ccbin g++ -I../../common/inc -m64 -gencode arch=compute_20,code=sm_20 -gencode arch=compute_30,code=sm_30 -gencode arch=compute_35,code=sm_35 -gencode arch=compute_37,code=sm_37 -gencode arch=compute_50,code=sm_50 -gencode arch=compute_52,code=sm_52 -gencode arch=compute_60,code=sm_60 -gencode arch=compute_60,code=compute_60 -o simplePrintf.o -c simplePrintf.cu
- nvcc warning : The 'compute_20', 'sm_20', and 'sm_21' architectures are deprecated, and may be removed in a future release (Use -Wno-deprecated-gpu-targets to suppress warning).
- /usr/include/bits/floatn.h(61): error: invalid argument to attribute "__mode__"
- /usr/include/bits/floatn.h(73): error: identifier "__float128" is undefined
- 2 errors detected in the compilation of "/tmp/tmpxft_00005767_00000000-19_simplePrintf.compute_60.cpp1.ii".
- make[1]: *** [Makefile:250: simplePrintf.o] Error 2
- make[1]: Leaving directory '/home/joel/Documents/cuda/samples/0_Simple/simplePrintf'
- make: *** [Makefile:52: 0_Simple/simplePrintf/Makefile.ph_build] Error 2
Advertisement