Guest User

Untitled

a guest
May 10th, 2026
48
0
Never
Not a member of Pastebin yet? Sign Up, it unlocks many cool features!
text 4.03 KB | None | 0 0
  1. > Task :compileJava FAILED
  2. /home/john/MCreatorWorkspaces/jacks_cool_fun_mod/src/main/java/net/mcreator/jackscoolfunmod/client/model/ModelCustomModel.java:41: error: ';' expected
  3. PartDefinition ear1 top_r1 = ear1.addOrReplaceChild("ear1 top_r1", CubeListBuilder.create().texOffs(4, 6).addBox(-1.0F, -1.0F, 1.0F, 1.0F, 1.0F, 1.0F, new CubeDeformation(0.0F)), PartPose.offsetAndRotation(-3.85F, -1.825F, 0.0F, 0.0F, 0.0F, -0.1745F));
  4. ^
  5. /home/john/MCreatorWorkspaces/jacks_cool_fun_mod/src/main/java/net/mcreator/jackscoolfunmod/client/model/ModelCustomModel.java:42: error: ';' expected
  6. PartDefinition ear1 inside_r1 = ear1.addOrReplaceChild("ear1 inside_r1", CubeListBuilder.create().texOffs(0, 0).addBox(-2.0F, -2.0F, 1.0F, 3.0F, 2.0F, 1.0F, new CubeDeformation(0.0F)), PartPose.offsetAndRotation(-3.5F, 0.15F, 0.0F, 0.0F, 0.0F, -0.1745F));
  7. ^
  8. /home/john/MCreatorWorkspaces/jacks_cool_fun_mod/src/main/java/net/mcreator/jackscoolfunmod/client/model/ModelCustomModel.java:44: error: ';' expected
  9. PartDefinition ear2 top_r1 = ear2.addOrReplaceChild("ear2 top_r1", CubeListBuilder.create().texOffs(0, 6).addBox(-1.0F, -1.0F, 1.0F, 1.0F, 1.0F, 1.0F, new CubeDeformation(0.0F)), PartPose.offsetAndRotation(0.825F, -1.625F, 0.0F, 0.0F, 0.0F, 0.1745F));
  10. ^
  11. /home/john/MCreatorWorkspaces/jacks_cool_fun_mod/src/main/java/net/mcreator/jackscoolfunmod/client/model/ModelCustomModel.java:45: error: ';' expected
  12. PartDefinition ear2 inside_r1 = ear2.addOrReplaceChild("ear2 inside_r1", CubeListBuilder.create().texOffs(0, 3).addBox(-1.0F, -2.0F, 1.0F, 3.0F, 2.0F, 1.0F, new CubeDeformation(0.0F)), PartPose.offsetAndRotation(-0.5F, 0.175F, 0.0F, 0.0F, 0.0F, 0.1745F));
  13. ^
  14. 4 errors
  15. FAILURE: Build failed with an exception.
  16. * What went wrong:
  17. Execution failed for task ':compileJava'.
  18. > Compilation failed; see the compiler output below.
  19. /home/john/MCreatorWorkspaces/jacks_cool_fun_mod/src/main/java/net/mcreator/jackscoolfunmod/client/model/ModelCustomModel.java:41: error: ';' expected
  20. PartDefinition ear1 top_r1 = ear1.addOrReplaceChild("ear1 top_r1", CubeListBuilder.create().texOffs(4, 6).addBox(-1.0F, -1.0F, 1.0F, 1.0F, 1.0F, 1.0F, new CubeDeformation(0.0F)), PartPose.offsetAndRotation(-3.85F, -1.825F, 0.0F, 0.0F, 0.0F, -0.1745F));
  21. ^
  22. /home/john/MCreatorWorkspaces/jacks_cool_fun_mod/src/main/java/net/mcreator/jackscoolfunmod/client/model/ModelCustomModel.java:42: error: ';' expected
  23. PartDefinition ear1 inside_r1 = ear1.addOrReplaceChild("ear1 inside_r1", CubeListBuilder.create().texOffs(0, 0).addBox(-2.0F, -2.0F, 1.0F, 3.0F, 2.0F, 1.0F, new CubeDeformation(0.0F)), PartPose.offsetAndRotation(-3.5F, 0.15F, 0.0F, 0.0F, 0.0F, -0.1745F));
  24. ^
  25. /home/john/MCreatorWorkspaces/jacks_cool_fun_mod/src/main/java/net/mcreator/jackscoolfunmod/client/model/ModelCustomModel.java:44: error: ';' expected
  26. PartDefinition ear2 top_r1 = ear2.addOrReplaceChild("ear2 top_r1", CubeListBuilder.create().texOffs(0, 6).addBox(-1.0F, -1.0F, 1.0F, 1.0F, 1.0F, 1.0F, new CubeDeformation(0.0F)), PartPose.offsetAndRotation(0.825F, -1.625F, 0.0F, 0.0F, 0.0F, 0.1745F));
  27. ^
  28. /home/john/MCreatorWorkspaces/jacks_cool_fun_mod/src/main/java/net/mcreator/jackscoolfunmod/client/model/ModelCustomModel.java:45: error: ';' expected
  29. PartDefinition ear2 inside_r1 = ear2.addOrReplaceChild("ear2 inside_r1", CubeListBuilder.create().texOffs(0, 3).addBox(-1.0F, -2.0F, 1.0F, 3.0F, 2.0F, 1.0F, new CubeDeformation(0.0F)), PartPose.offsetAndRotation(-0.5F, 0.175F, 0.0F, 0.0F, 0.0F, 0.1745F));
  30. ^
  31. 4 errors
  32. * Try:
  33. > Check your code and dependencies to fix the compilation error(s)
  34. > Run with --scan to get full insights from a Build Scan (powered by Develocity).
  35. BUILD FAILED in 1s
  36. 6 actionable tasks: 1 executed, 5 up-to-date
  37. Configuration cache entry reused.
  38.  
  39. BUILD FAILED
  40. Task completed in 1 second
Advertisement
Add Comment
Please, Sign In to add comment