Advertisement
Guest User

Untitled

a guest
Dec 2nd, 2020
683
Never
Not a member of Pastebin yet? Sign Up, it unlocks many cool features!
  1. DKMS make.log for amdgpu-5.6.0.13-1089974 for kernel 5.4.0-56-generic (x86_64)
  2. Mi 2. Dez 21:35:27 CET 2020
  3. make: Entering directory '/usr/src/linux-headers-5.4.0-56-generic'
  4. AR /var/lib/dkms/amdgpu/5.6.0.13-1089974/build/built-in.a
  5. CC [M] /var/lib/dkms/amdgpu/5.6.0.13-1089974/build/amd/amdkcl/main.o
  6. CC [M] /var/lib/dkms/amdgpu/5.6.0.13-1089974/build/amd/amdkcl/symbols.o
  7. CC [M] /var/lib/dkms/amdgpu/5.6.0.13-1089974/build/scheduler/sched_main.o
  8. CC [M] /var/lib/dkms/amdgpu/5.6.0.13-1089974/build/amd/amdkcl/kcl_mn.o
  9. CC [M] /var/lib/dkms/amdgpu/5.6.0.13-1089974/build/ttm/ttm_memory.o
  10. CC [M] /var/lib/dkms/amdgpu/5.6.0.13-1089974/build/amd/amdgpu/amdgpu_drv.o
  11. CC [M] /var/lib/dkms/amdgpu/5.6.0.13-1089974/build/amd/amdgpu/amdgpu_device.o
  12. CC [M] /var/lib/dkms/amdgpu/5.6.0.13-1089974/build/amd/amdkcl/kcl_memory.o
  13. CC [M] /var/lib/dkms/amdgpu/5.6.0.13-1089974/build/amd/amdkcl/kcl_ioctl.o
  14. CC [M] /var/lib/dkms/amdgpu/5.6.0.13-1089974/build/amd/amdkcl/kcl_device_cgroup.o
  15. CC [M] /var/lib/dkms/amdgpu/5.6.0.13-1089974/build/amd/amdkcl/kcl_drm_cache.o
  16. CC [M] /var/lib/dkms/amdgpu/5.6.0.13-1089974/build/ttm/ttm_tt.o
  17. CC [M] /var/lib/dkms/amdgpu/5.6.0.13-1089974/build/amd/amdgpu/amdgpu_kms.o
  18. CC [M] /var/lib/dkms/amdgpu/5.6.0.13-1089974/build/amd/amdkcl/kcl_drm.o
  19. CC [M] /var/lib/dkms/amdgpu/5.6.0.13-1089974/build/amd/amdkcl/kcl_fence_array.o
  20. CC [M] /var/lib/dkms/amdgpu/5.6.0.13-1089974/build/scheduler/sched_fence.o
  21. CC [M] /var/lib/dkms/amdgpu/5.6.0.13-1089974/build/amd/amdkcl/kcl_fence.o
  22. CC [M] /var/lib/dkms/amdgpu/5.6.0.13-1089974/build/scheduler/sched_entity.o
  23. CC [M] /var/lib/dkms/amdgpu/5.6.0.13-1089974/build/ttm/ttm_bo.o
  24. CC [M] /var/lib/dkms/amdgpu/5.6.0.13-1089974/build/amd/amdkcl/kcl_io.o
  25. /var/lib/dkms/amdgpu/5.6.0.13-1089974/build/amd/amdkcl/kcl_fence.c:29:1: warning: ‘dma_fence_test_signaled_any’ defined but not used [-Wunused-function]
  26. 29 | dma_fence_test_signaled_any(struct dma_fence **fences, uint32_t count,
  27. | ^~~~~~~~~~~~~~~~~~~~~~~~~~~
  28. CC [M] /var/lib/dkms/amdgpu/5.6.0.13-1089974/build/amd/amdkcl/kcl_kthread.o
  29. CC [M] /var/lib/dkms/amdgpu/5.6.0.13-1089974/build/amd/amdkcl/kcl_mm.o
  30. CC [M] /var/lib/dkms/amdgpu/5.6.0.13-1089974/build/amd/amdgpu/amdgpu_atombios.o
  31. CC [M] /var/lib/dkms/amdgpu/5.6.0.13-1089974/build/amd/amdgpu/atombios_crtc.o
  32. CC [M] /var/lib/dkms/amdgpu/5.6.0.13-1089974/build/amd/amdkcl/kcl_pci.o
  33. LD [M] /var/lib/dkms/amdgpu/5.6.0.13-1089974/build/scheduler/amd-sched.o
  34. CC [M] /var/lib/dkms/amdgpu/5.6.0.13-1089974/build/amd/amdgpu/amdgpu_connectors.o
  35. CC [M] /var/lib/dkms/amdgpu/5.6.0.13-1089974/build/amd/amdkcl/kcl_perf_event.o
  36. /var/lib/dkms/amdgpu/5.6.0.13-1089974/build/amd/amdkcl/kcl_pci.c: In function ‘amdkcl_pci_init’:
  37. /var/lib/dkms/amdgpu/5.6.0.13-1089974/build/amd/amdkcl/kcl_pci.c:102:84: warning: passing argument 2 of ‘amdkcl_fp_setup’ discards ‘const’ qualifier from pointer target type [-Wdiscarded-qualifiers]
  38. 102 | _kcl_pcie_link_speed = (const unsigned char *) amdkcl_fp_setup("pcie_link_speed", _kcl_pcie_link_speed_stub);
  39. | ^~~~~~~~~~~~~~~~~~~~~~~~~
  40. In file included from /var/lib/dkms/amdgpu/5.6.0.13-1089974/build/amd/amdkcl/kcl_pci.c:3:
  41. /var/lib/dkms/amdgpu/5.6.0.13-1089974/build/amd/amdkcl/kcl_common.h:23:63: note: expected ‘void *’ but argument is of type ‘const unsigned char *’
  42. 23 | static inline void *amdkcl_fp_setup(const char *symbol, void *fp_stup)
  43. | ~~~~~~^~~~~~~
  44. CC [M] /var/lib/dkms/amdgpu/5.6.0.13-1089974/build/amd/amdkcl/kcl_reservation.o
  45. CC [M] /var/lib/dkms/amdgpu/5.6.0.13-1089974/build/ttm/ttm_bo_util.o
  46. CC [M] /var/lib/dkms/amdgpu/5.6.0.13-1089974/build/amd/amdkcl/dma-resv.o
  47. CC [M] /var/lib/dkms/amdgpu/5.6.0.13-1089974/build/amd/amdgpu/atom.o
  48. /var/lib/dkms/amdgpu/5.6.0.13-1089974/build/amd/amdkcl/kcl_reservation.c: In function ‘amdkcl_reservation_init’:
  49. /var/lib/dkms/amdgpu/5.6.0.13-1089974/build/amd/amdkcl/kcl_reservation.c:58:10: warning: passing argument 2 of ‘amdkcl_fp_setup’ discards ‘const’ qualifier from pointer target type [-Wdiscarded-array-qualifiers]
  50. 58 | &_kcl_reservation_seqcount_string_stub);
  51. | ^~~~~~~~~~~~~~~~~~~~~~~~~~~~~~~~~~~~~~
  52. In file included from /var/lib/dkms/amdgpu/5.6.0.13-1089974/build/amd/amdkcl/kcl_reservation.c:32:
  53. /var/lib/dkms/amdgpu/5.6.0.13-1089974/build/amd/amdkcl/kcl_common.h:23:63: note: expected ‘void *’ but argument is of type ‘const char (*)[21]’
  54. 23 | static inline void *amdkcl_fp_setup(const char *symbol, void *fp_stup)
  55. | ~~~~~~^~~~~~~
  56. CC [M] /var/lib/dkms/amdgpu/5.6.0.13-1089974/build/amd/amdkcl/kcl_suspend.o
  57. CC [M] /var/lib/dkms/amdgpu/5.6.0.13-1089974/build/amd/amdgpu/amdgpu_fence.o
  58. CC [M] /var/lib/dkms/amdgpu/5.6.0.13-1089974/build/amd/amdkcl/kcl_workqueue.o
  59. CC [M] /var/lib/dkms/amdgpu/5.6.0.13-1089974/build/amd/amdgpu/amdgpu_ttm.o
  60. CC [M] /var/lib/dkms/amdgpu/5.6.0.13-1089974/build/amd/amdkcl/kcl_seq_file.o
  61. CC [M] /var/lib/dkms/amdgpu/5.6.0.13-1089974/build/amd/amdkcl/kcl_connector.o
  62. CC [M] /var/lib/dkms/amdgpu/5.6.0.13-1089974/build/ttm/ttm_bo_vm.o
  63. CC [M] /var/lib/dkms/amdgpu/5.6.0.13-1089974/build/ttm/ttm_module.o
  64. LD [M] /var/lib/dkms/amdgpu/5.6.0.13-1089974/build/amd/amdkcl/amdkcl.o
  65. CC [M] /var/lib/dkms/amdgpu/5.6.0.13-1089974/build/amd/amdgpu/amdgpu_object.o
  66. CC [M] /var/lib/dkms/amdgpu/5.6.0.13-1089974/build/amd/amdgpu/amdgpu_gart.o
  67. CC [M] /var/lib/dkms/amdgpu/5.6.0.13-1089974/build/ttm/ttm_execbuf_util.o
  68. CC [M] /var/lib/dkms/amdgpu/5.6.0.13-1089974/build/ttm/ttm_page_alloc.o
  69. CC [M] /var/lib/dkms/amdgpu/5.6.0.13-1089974/build/amd/amdgpu/amdgpu_encoders.o
  70. CC [M] /var/lib/dkms/amdgpu/5.6.0.13-1089974/build/ttm/ttm_bo_manager.o
  71. CC [M] /var/lib/dkms/amdgpu/5.6.0.13-1089974/build/amd/amdgpu/amdgpu_display.o
  72. CC [M] /var/lib/dkms/amdgpu/5.6.0.13-1089974/build/amd/amdgpu/amdgpu_i2c.o
  73. CC [M] /var/lib/dkms/amdgpu/5.6.0.13-1089974/build/amd/amdgpu/amdgpu_fb.o
  74. CC [M] /var/lib/dkms/amdgpu/5.6.0.13-1089974/build/amd/amdgpu/amdgpu_gem.o
  75. CC [M] /var/lib/dkms/amdgpu/5.6.0.13-1089974/build/ttm/ttm_agp_backend.o
  76. CC [M] /var/lib/dkms/amdgpu/5.6.0.13-1089974/build/ttm/ttm_page_alloc_dma.o
  77. /var/lib/dkms/amdgpu/5.6.0.13-1089974/build/amd/amdgpu/amdgpu_fb.c: In function ‘amdgpufb_create’:
  78. /var/lib/dkms/amdgpu/5.6.0.13-1089974/build/amd/amdgpu/amdgpu_fb.c:253:14: warning: assignment discards ‘const’ qualifier from pointer target type [-Wdiscarded-qualifiers]
  79. 253 | info->fbops = &amdgpufb_ops;
  80. | ^
  81. CC [M] /var/lib/dkms/amdgpu/5.6.0.13-1089974/build/amd/amdgpu/amdgpu_ring.o
  82. CC [M] /var/lib/dkms/amdgpu/5.6.0.13-1089974/build/amd/amdgpu/amdgpu_bios.o
  83. CC [M] /var/lib/dkms/amdgpu/5.6.0.13-1089974/build/amd/amdgpu/amdgpu_cs.o
  84. CC [M] /var/lib/dkms/amdgpu/5.6.0.13-1089974/build/amd/amdgpu/amdgpu_benchmark.o
  85. CC [M] /var/lib/dkms/amdgpu/5.6.0.13-1089974/build/amd/amdgpu/amdgpu_test.o
  86. LD [M] /var/lib/dkms/amdgpu/5.6.0.13-1089974/build/ttm/amdttm.o
  87. CC [M] /var/lib/dkms/amdgpu/5.6.0.13-1089974/build/amd/amdgpu/amdgpu_pm.o
  88. /var/lib/dkms/amdgpu/5.6.0.13-1089974/build/amd/amdgpu/amdgpu_bios.c: In function ‘amdgpu_read_platform_bios’:
  89. /var/lib/dkms/amdgpu/5.6.0.13-1089974/build/amd/amdgpu/amdgpu_bios.c:200:9: error: implicit declaration of function ‘pci_platform_rom’ [-Werror=implicit-function-declaration]
  90. 200 | bios = pci_platform_rom(adev->pdev, &size);
  91. | ^~~~~~~~~~~~~~~~
  92. /var/lib/dkms/amdgpu/5.6.0.13-1089974/build/amd/amdgpu/amdgpu_bios.c:200:7: warning: assignment to ‘uint8_t *’ {aka ‘unsigned char *’} from ‘int’ makes pointer from integer without a cast [-Wint-conversion]
  93. 200 | bios = pci_platform_rom(adev->pdev, &size);
  94. | ^
  95. CC [M] /var/lib/dkms/amdgpu/5.6.0.13-1089974/build/amd/amdgpu/atombios_dp.o
  96. CC [M] /var/lib/dkms/amdgpu/5.6.0.13-1089974/build/amd/amdgpu/amdgpu_afmt.o
  97. cc1: some warnings being treated as errors
  98. make[2]: *** [scripts/Makefile.build:275: /var/lib/dkms/amdgpu/5.6.0.13-1089974/build/amd/amdgpu/amdgpu_bios.o] Error 1
  99. make[2]: *** Waiting for unfinished jobs....
  100. make[1]: *** [scripts/Makefile.build:522: /var/lib/dkms/amdgpu/5.6.0.13-1089974/build/amd/amdgpu] Error 2
  101. make: *** [Makefile:1757: /var/lib/dkms/amdgpu/5.6.0.13-1089974/build] Error 2
  102. make: Leaving directory '/usr/src/linux-headers-5.4.0-56-generic'
  103.  
Advertisement
RAW Paste Data Copied
Advertisement