Advertisement
hgichuhi

OpenMRS API - UserServiceTest ErrorComplete

Jul 24th, 2020 (edited)
338
0
Never
Not a member of Pastebin yet? Sign Up, it unlocks many cool features!
Bash 67.16 KB | None | 0 0
  1. patrick@emr:~/openmrs-core$ mvn clean package
  2. [INFO] Scanning for projects...
  3. [INFO] ------------------------------------------------------------------------
  4. [INFO] Reactor Build Order:
  5. [INFO]
  6. [INFO] OpenMRS                                                            [pom]
  7. [INFO] openmrs-tools                                                      [jar]
  8. [INFO] openmrs-test                                                       [pom]
  9. [INFO] openmrs-api                                                        [jar]
  10. [INFO] openmrs-web                                                        [jar]
  11. [INFO] openmrs-webapp                                                     [war]
  12. [INFO] openmrs-liquibase                                                  [jar]
  13. [INFO]
  14. [INFO] ------------------------< org.openmrs:openmrs >-------------------------
  15. [INFO] Building OpenMRS 2.4.0-SNAPSHOT                                    [1/7]
  16. [INFO] --------------------------------[ pom ]---------------------------------
  17. [INFO]
  18. [INFO] --- maven-clean-plugin:2.5:clean (default-clean) @ openmrs ---
  19. [INFO]
  20. [INFO] --- buildnumber-maven-plugin:1.1:create (default) @ openmrs ---
  21. [INFO] Checking for local modifications: skipped.
  22. [INFO] Updating project files from SCM: skipped.
  23. [INFO] ShortRevision tag detected. The value is '6'.
  24. [INFO] Executing: /bin/sh -c cd /home/patrick/openmrs-core && git rev-parse --verify --short=6 HEAD
  25. [INFO] Working directory: /home/patrick/openmrs-core
  26. [INFO] Storing buildNumber: b885df at timestamp: 1595586348138
  27. [INFO] ShortRevision tag detected. The value is '6'.
  28. [INFO] Executing: /bin/sh -c cd /home/patrick/openmrs-core && git rev-parse --verify --short=6 HEAD
  29. [INFO] Working directory: /home/patrick/openmrs-core
  30. [INFO] Storing buildScmBranch: UNKNOWN
  31. [INFO]
  32. [INFO] --- build-helper-maven-plugin:1.5:parse-version (parse-version) @ openmrs ---
  33. [INFO]
  34. [INFO] --- maven-jar-plugin:2.3.2:test-jar (default) @ openmrs ---
  35. [WARNING] JAR will be empty - no content was marked for inclusion!
  36. [INFO] Building jar: /home/patrick/openmrs-core/target/openmrs-2.4.0-SNAPSHOT-tests.jar
  37. [INFO]
  38. [INFO] ------------------< org.openmrs.tools:openmrs-tools >-------------------
  39. [INFO] Building openmrs-tools 2.4.0-SNAPSHOT                              [2/7]
  40. [INFO] --------------------------------[ jar ]---------------------------------
  41. [INFO]
  42. [INFO] --- maven-clean-plugin:2.5:clean (default-clean) @ openmrs-tools ---
  43. [INFO]
  44. [INFO] --- buildnumber-maven-plugin:1.1:create (default) @ openmrs-tools ---
  45. [INFO]
  46. [INFO] --- build-helper-maven-plugin:1.5:parse-version (parse-version) @ openmrs-tools ---
  47. [INFO]
  48. [INFO] --- maven-resources-plugin:2.4:resources (default-resources) @ openmrs-tools ---
  49. [INFO] Using 'UTF-8' encoding to copy filtered resources.
  50. [INFO] Copying 4 resources
  51. [INFO]
  52. [INFO] --- maven-compiler-plugin:3.8.1:compile (default-compile) @ openmrs-tools ---
  53. [INFO] No sources to compile
  54. [INFO]
  55. [INFO] --- maven-resources-plugin:2.4:testResources (default-testResources) @ openmrs-tools ---
  56. [INFO] Using 'UTF-8' encoding to copy filtered resources.
  57. [INFO] skip non existing resourceDirectory /home/patrick/openmrs-core/tools/src/test/resources
  58. [INFO]
  59. [INFO] --- maven-compiler-plugin:3.8.1:testCompile (default-testCompile) @ openmrs-tools ---
  60. [INFO] No sources to compile
  61. [INFO]
  62. [INFO] --- maven-surefire-plugin:2.22.2:test (default-test) @ openmrs-tools ---
  63. [INFO] No tests to run.
  64. [INFO]
  65. [INFO] --- maven-jar-plugin:2.3.2:jar (default-jar) @ openmrs-tools ---
  66. [INFO] Building jar: /home/patrick/openmrs-core/tools/target/openmrs-tools-2.4.0-SNAPSHOT.jar
  67. [INFO]
  68. [INFO] --- maven-jar-plugin:2.3.2:test-jar (default) @ openmrs-tools ---
  69. [WARNING] JAR will be empty - no content was marked for inclusion!
  70. [INFO] Building jar: /home/patrick/openmrs-core/tools/target/openmrs-tools-2.4.0-SNAPSHOT-tests.jar
  71. [INFO]
  72. [INFO] -------------------< org.openmrs.test:openmrs-test >--------------------
  73. [INFO] Building openmrs-test 2.4.0-SNAPSHOT                               [3/7]
  74. [INFO] --------------------------------[ pom ]---------------------------------
  75. [INFO]
  76. [INFO] --- maven-clean-plugin:2.5:clean (default-clean) @ openmrs-test ---
  77. [INFO]
  78. [INFO] --- buildnumber-maven-plugin:1.1:create (default) @ openmrs-test ---
  79. [INFO]
  80. [INFO] --- build-helper-maven-plugin:1.5:parse-version (parse-version) @ openmrs-test ---
  81. [INFO]
  82. [INFO] --- maven-jar-plugin:2.3.2:test-jar (default) @ openmrs-test ---
  83. [WARNING] JAR will be empty - no content was marked for inclusion!
  84. [INFO] Building jar: /home/patrick/openmrs-core/test/target/openmrs-test-2.4.0-SNAPSHOT-tests.jar
  85. [INFO]
  86. [INFO] --------------------< org.openmrs.api:openmrs-api >---------------------
  87. [INFO] Building openmrs-api 2.4.0-SNAPSHOT                                [4/7]
  88. [INFO] --------------------------------[ jar ]---------------------------------
  89. [INFO]
  90. [INFO] --- maven-clean-plugin:2.5:clean (default-clean) @ openmrs-api ---
  91. [INFO]
  92. [INFO] --- buildnumber-maven-plugin:1.1:create (default) @ openmrs-api ---
  93. [INFO]
  94. [INFO] --- build-helper-maven-plugin:1.5:parse-version (parse-version) @ openmrs-api ---
  95. [INFO]
  96. [INFO] --- jacoco-maven-plugin:0.8.5:prepare-agent (prepare-agent) @ openmrs-api ---
  97. [INFO] argLine set to -javaagent:/home/patrick/.m2/repository/org/jacoco/org.jacoco.agent/0.8.5/org.jacoco.agent-0.8.5-runtime.jar=destfile=/home/patrick/openmrs-core/api/target/jacoco.exec,includes=org/openmrs/** -Duser.language=en -Duser.region=US -Xmx2g -Djava.locale.providers=COMPAT
  98. [INFO]
  99. [INFO] --- maven-java-formatter-plugin:0.3:format (default) @ openmrs-api ---
  100. [INFO] Using 'UTF-8' encoding to format source files.
  101. [INFO] Number of files to be formatted: 1078
  102. [INFO] Successfully formatted: 0 file(s)
  103. [INFO] Fail to format        : 0 file(s)
  104. [INFO] Skipped               : 1078 file(s)
  105. [INFO] Approximate time taken: 2s
  106. [INFO]
  107. [INFO] --- maven-resources-plugin:2.4:resources (default-resources) @ openmrs-api ---
  108. [INFO] Using 'UTF-8' encoding to copy filtered resources.
  109. [INFO] Copying 1 resource
  110. [INFO] Copying 146 resources
  111. [INFO]
  112. [INFO] --- maven-compiler-plugin:3.8.1:compile (default-compile) @ openmrs-api ---
  113. [INFO] Changes detected - recompiling the module!
  114. [INFO] Compiling 719 source files to /home/patrick/openmrs-core/api/target/classes
  115. [INFO] /home/patrick/openmrs-core/api/src/main/java/org/openmrs/PersonName.java: Some input files use or override a deprecated API.
  116. [INFO] /home/patrick/openmrs-core/api/src/main/java/org/openmrs/PersonName.java: Recompile with -Xlint:deprecation for details.
  117. [INFO] /home/patrick/openmrs-core/api/src/main/java/org/openmrs/BaseCustomizableMetadata.java: Some input files use unchecked or unsafe operations.
  118. [INFO] /home/patrick/openmrs-core/api/src/main/java/org/openmrs/BaseCustomizableMetadata.java: Recompile with -Xlint:unchecked for details.
  119. [INFO]
  120. [INFO] --- maven-resources-plugin:2.4:testResources (default-testResources) @ openmrs-api ---
  121. [INFO] Using 'UTF-8' encoding to copy filtered resources.
  122. [INFO] Copying 145 resources
  123. [INFO]
  124. [INFO] --- maven-compiler-plugin:3.8.1:testCompile (default-testCompile) @ openmrs-api ---
  125. [INFO] Changes detected - recompiling the module!
  126. [INFO] Compiling 359 source files to /home/patrick/openmrs-core/api/target/test-classes
  127. [INFO] /home/patrick/openmrs-core/api/src/test/java/org/openmrs/test/jupiter/BaseContextSensitiveTest.java: Some input files use or override a deprecated API.
  128. [INFO] /home/patrick/openmrs-core/api/src/test/java/org/openmrs/test/jupiter/BaseContextSensitiveTest.java: Recompile with -Xlint:deprecation for details.
  129. [INFO] /home/patrick/openmrs-core/api/src/test/java/org/openmrs/api/db/hibernate/PersonAttributeHelper.java: Some input files use unchecked or unsafe operations.
  130. [INFO] /home/patrick/openmrs-core/api/src/test/java/org/openmrs/api/db/hibernate/PersonAttributeHelper.java: Recompile with -Xlint:unchecked for details.
  131. [INFO]
  132. [INFO] --- maven-surefire-plugin:2.22.2:test (default-test) @ openmrs-api ---
  133. [INFO]
  134. [INFO] -------------------------------------------------------
  135. [INFO]  T E S T S
  136. [INFO] -------------------------------------------------------
  137. [INFO] Running liquibase.ext.datatype.core.MySQLBooleanTypeTest
  138. [INFO] Tests run: 3, Failures: 0, Errors: 0, Skipped: 0, Time elapsed: 0.133 s - in liquibase.ext.datatype.core.MySQLBooleanTypeTest
  139. [INFO] Running liquibase.ext.sqlgenerator.core.ModifyColumnChangeTest
  140. [INFO] Tests run: 2, Failures: 0, Errors: 0, Skipped: 0, Time elapsed: 0 s - in liquibase.ext.sqlgenerator.core.ModifyColumnChangeTest
  141. [INFO] Running liquibase.ext.sqlgenerator.core.ModifyColumnGeneratorTest
  142. [INFO] Tests run: 8, Failures: 0, Errors: 0, Skipped: 0, Time elapsed: 0.632 s - in liquibase.ext.sqlgenerator.core.ModifyColumnGeneratorTest
  143. [INFO] Running liquibase.ext.change.core.InsertWithUuidDataChangeTest
  144. [INFO] Tests run: 2, Failures: 0, Errors: 0, Skipped: 0, Time elapsed: 0 s - in liquibase.ext.change.core.InsertWithUuidDataChangeTest
  145. [INFO] Running org.openmrs.serialization.SimpleXStreamSerializerTest
  146. Security framework of XStream not initialized, XStream is probably vulnerable.
  147. Security framework of XStream not initialized, XStream is probably vulnerable.
  148. Security framework of XStream not initialized, XStream is probably vulnerable.
  149. [INFO] Tests run: 5, Failures: 0, Errors: 0, Skipped: 0, Time elapsed: 0.238 s - in org.openmrs.serialization.SimpleXStreamSerializerTest
  150. [INFO] Running org.openmrs.serialization.JavaSerializationTest
  151. [INFO] Tests run: 2, Failures: 0, Errors: 0, Skipped: 0, Time elapsed: 0.021 s - in org.openmrs.serialization.JavaSerializationTest
  152. [INFO] Running org.openmrs.propertyeditor.EncounterEditorTest
  153. [INFO] Tests run: 8, Failures: 0, Errors: 0, Skipped: 0, Time elapsed: 9.52 s - in org.openmrs.propertyeditor.EncounterEditorTest
  154. [INFO] Running org.openmrs.propertyeditor.PatientEditorTest
  155. [INFO] Tests run: 8, Failures: 0, Errors: 0, Skipped: 0, Time elapsed: 0.105 s - in org.openmrs.propertyeditor.PatientEditorTest
  156. [INFO] Running org.openmrs.propertyeditor.PersonAttributeTypeEditorTest
  157. [INFO] Tests run: 8, Failures: 0, Errors: 0, Skipped: 0, Time elapsed: 0.081 s - in org.openmrs.propertyeditor.PersonAttributeTypeEditorTest
  158. [INFO] Running org.openmrs.propertyeditor.UserEditorTest
  159. [INFO] Tests run: 8, Failures: 0, Errors: 0, Skipped: 0, Time elapsed: 0.1 s - in org.openmrs.propertyeditor.UserEditorTest
  160. [INFO] Running org.openmrs.propertyeditor.ConceptClassEditorTest
  161. [INFO] Tests run: 8, Failures: 0, Errors: 0, Skipped: 0, Time elapsed: 0.075 s - in org.openmrs.propertyeditor.ConceptClassEditorTest
  162. [INFO] Running org.openmrs.propertyeditor.OrderEditorTest
  163. [INFO] Tests run: 8, Failures: 0, Errors: 0, Skipped: 0, Time elapsed: 0.076 s - in org.openmrs.propertyeditor.OrderEditorTest
  164. [INFO] Running org.openmrs.propertyeditor.ConceptDatatypeEditorTest
  165. [INFO] Tests run: 8, Failures: 0, Errors: 0, Skipped: 0, Time elapsed: 0.278 s - in org.openmrs.propertyeditor.ConceptDatatypeEditorTest
  166. [INFO] Running org.openmrs.propertyeditor.ProgramWorkflowStateEditorTest
  167. [INFO] Tests run: 8, Failures: 0, Errors: 0, Skipped: 0, Time elapsed: 0.064 s - in org.openmrs.propertyeditor.ProgramWorkflowStateEditorTest
  168. [INFO] Running org.openmrs.propertyeditor.ProgramEditorTest
  169. [INFO] Tests run: 4, Failures: 0, Errors: 0, Skipped: 0, Time elapsed: 0.048 s - in org.openmrs.propertyeditor.ProgramEditorTest
  170. [INFO] Running org.openmrs.propertyeditor.RoleEditorTest
  171. [INFO] Tests run: 2, Failures: 0, Errors: 0, Skipped: 0, Time elapsed: 0.018 s - in org.openmrs.propertyeditor.RoleEditorTest
  172. [INFO] Running org.openmrs.propertyeditor.VisitTypeEditorTest
  173. [INFO] Tests run: 8, Failures: 0, Errors: 0, Skipped: 0, Time elapsed: 0.056 s - in org.openmrs.propertyeditor.VisitTypeEditorTest
  174. [INFO] Running org.openmrs.propertyeditor.LocationEditorTest
  175. [INFO] Tests run: 8, Failures: 0, Errors: 0, Skipped: 0, Time elapsed: 0.055 s - in org.openmrs.propertyeditor.LocationEditorTest
  176. [INFO] Running org.openmrs.propertyeditor.ConceptAttributeTypeEditorTest
  177. [INFO] Tests run: 8, Failures: 0, Errors: 0, Skipped: 0, Time elapsed: 0.182 s - in org.openmrs.propertyeditor.ConceptAttributeTypeEditorTest
  178. [INFO] Running org.openmrs.propertyeditor.PatientIdentifierTypeEditorTest
  179. [INFO] Tests run: 8, Failures: 0, Errors: 0, Skipped: 0, Time elapsed: 0.045 s - in org.openmrs.propertyeditor.PatientIdentifierTypeEditorTest
  180. [INFO] Running org.openmrs.propertyeditor.ConceptAnswersEditorTest
  181. [INFO] Tests run: 1, Failures: 0, Errors: 0, Skipped: 0, Time elapsed: 0.008 s - in org.openmrs.propertyeditor.ConceptAnswersEditorTest
  182. [INFO] Running org.openmrs.propertyeditor.EncounterTypeEditorTest
  183. [INFO] Tests run: 8, Failures: 0, Errors: 0, Skipped: 0, Time elapsed: 0.046 s - in org.openmrs.propertyeditor.EncounterTypeEditorTest
  184. [INFO] Running org.openmrs.propertyeditor.LocationAttributeTypeEditorTest
  185. [INFO] Tests run: 8, Failures: 0, Errors: 0, Skipped: 0, Time elapsed: 0.186 s - in org.openmrs.propertyeditor.LocationAttributeTypeEditorTest
  186. [INFO] Running org.openmrs.propertyeditor.ProviderEditorTest
  187. [WARNING] Tests run: 8, Failures: 0, Errors: 0, Skipped: 1, Time elapsed: 0.047 s - in org.openmrs.propertyeditor.ProviderEditorTest
  188. [INFO] Running org.openmrs.propertyeditor.DateOrDatetimeEditorTest
  189. [INFO] Tests run: 6, Failures: 0, Errors: 0, Skipped: 0, Time elapsed: 0.004 s - in org.openmrs.propertyeditor.DateOrDatetimeEditorTest
  190. [INFO] Running org.openmrs.propertyeditor.ConceptReferenceTermEditorTest
  191. [INFO] Tests run: 8, Failures: 0, Errors: 0, Skipped: 0, Time elapsed: 0.056 s - in org.openmrs.propertyeditor.ConceptReferenceTermEditorTest
  192. [INFO] Running org.openmrs.propertyeditor.PersonAttributeEditorTest
  193. [INFO] Tests run: 8, Failures: 0, Errors: 0, Skipped: 0, Time elapsed: 0.043 s - in org.openmrs.propertyeditor.PersonAttributeEditorTest
  194. [INFO] Running org.openmrs.propertyeditor.ProgramWorkflowEditorTest
  195. [INFO] Tests run: 8, Failures: 0, Errors: 0, Skipped: 0, Time elapsed: 0.046 s - in org.openmrs.propertyeditor.ProgramWorkflowEditorTest
  196. [INFO] Running org.openmrs.propertyeditor.ConceptNameEditorTest
  197. [INFO] Tests run: 8, Failures: 0, Errors: 0, Skipped: 0, Time elapsed: 0.045 s - in org.openmrs.propertyeditor.ConceptNameEditorTest
  198. [INFO] Running org.openmrs.propertyeditor.ConceptMapTypeEditorTest
  199. [INFO] Tests run: 8, Failures: 0, Errors: 0, Skipped: 0, Time elapsed: 0.041 s - in org.openmrs.propertyeditor.ConceptMapTypeEditorTest
  200. [INFO] Running org.openmrs.propertyeditor.WorkflowCollectionEditorTest
  201. [INFO] Tests run: 1, Failures: 0, Errors: 0, Skipped: 0, Time elapsed: 0.01 s - in org.openmrs.propertyeditor.WorkflowCollectionEditorTest
  202. [INFO] Running org.openmrs.propertyeditor.FormEditorTest
  203. [INFO] Tests run: 8, Failures: 0, Errors: 0, Skipped: 0, Time elapsed: 0.044 s - in org.openmrs.propertyeditor.FormEditorTest
  204. [INFO] Running org.openmrs.propertyeditor.CohortEditorTest
  205. [INFO] Tests run: 8, Failures: 0, Errors: 0, Skipped: 0, Time elapsed: 0.474 s - in org.openmrs.propertyeditor.CohortEditorTest
  206. [INFO] Running org.openmrs.propertyeditor.PersonEditorTest
  207. [INFO] Tests run: 8, Failures: 0, Errors: 0, Skipped: 0, Time elapsed: 0.05 s - in org.openmrs.propertyeditor.PersonEditorTest
  208. [INFO] Running org.openmrs.propertyeditor.LocationTagEditorTest
  209. [INFO] Tests run: 8, Failures: 0, Errors: 0, Skipped: 0, Time elapsed: 0.302 s - in org.openmrs.propertyeditor.LocationTagEditorTest
  210. [INFO] Running org.openmrs.propertyeditor.ConceptAnswerEditorTest
  211. [INFO] Tests run: 8, Failures: 0, Errors: 0, Skipped: 0, Time elapsed: 0.037 s - in org.openmrs.propertyeditor.ConceptAnswerEditorTest
  212. [INFO] Running org.openmrs.propertyeditor.ConceptNumericEditorTest
  213. [INFO] Tests run: 8, Failures: 0, Errors: 0, Skipped: 0, Time elapsed: 0.041 s - in org.openmrs.propertyeditor.ConceptNumericEditorTest
  214. [INFO] Running org.openmrs.propertyeditor.ConceptEditorTest
  215. [INFO] Tests run: 8, Failures: 0, Errors: 0, Skipped: 0, Time elapsed: 0.042 s - in org.openmrs.propertyeditor.ConceptEditorTest
  216. [INFO] Running org.openmrs.propertyeditor.DrugEditorTest
  217. [INFO] Tests run: 8, Failures: 0, Errors: 0, Skipped: 0, Time elapsed: 0.036 s - in org.openmrs.propertyeditor.DrugEditorTest
  218. [INFO] Running org.openmrs.propertyeditor.VisitEditorTest
  219. [INFO] Tests run: 8, Failures: 0, Errors: 0, Skipped: 0, Time elapsed: 0.046 s - in org.openmrs.propertyeditor.VisitEditorTest
  220. [INFO] Running org.openmrs.propertyeditor.ConceptSourceEditorTest
  221. [INFO] Tests run: 8, Failures: 0, Errors: 0, Skipped: 0, Time elapsed: 0.032 s - in org.openmrs.propertyeditor.ConceptSourceEditorTest
  222. [INFO] Running org.openmrs.propertyeditor.PrivilegeEditorTest
  223. [INFO] Tests run: 2, Failures: 0, Errors: 0, Skipped: 0, Time elapsed: 0.166 s - in org.openmrs.propertyeditor.PrivilegeEditorTest
  224. [INFO] Running org.openmrs.RoleTest
  225. [INFO] Tests run: 8, Failures: 0, Errors: 0, Skipped: 0, Time elapsed: 0 s - in org.openmrs.RoleTest
  226. [INFO] Running org.openmrs.test.matchers.HasGlobalErrorsTest
  227. [INFO] Tests run: 7, Failures: 0, Errors: 0, Skipped: 0, Time elapsed: 0.001 s - in org.openmrs.test.matchers.HasGlobalErrorsTest
  228. [INFO] Running org.openmrs.test.matchers.HasFieldErrorsTest
  229. [INFO] Tests run: 13, Failures: 0, Errors: 0, Skipped: 0, Time elapsed: 0.008 s - in org.openmrs.test.matchers.HasFieldErrorsTest
  230. [INFO] Running org.openmrs.CohortTest
  231. [INFO] Tests run: 15, Failures: 0, Errors: 0, Skipped: 0, Time elapsed: 0.389 s - in org.openmrs.CohortTest
  232. [INFO] Running org.openmrs.PersonNameTest
  233. [INFO] Tests run: 19, Failures: 0, Errors: 0, Skipped: 0, Time elapsed: 0.003 s - in org.openmrs.PersonNameTest
  234. [INFO] Running org.openmrs.BaseFormRecordableOpenmrsDataTest
  235. [INFO] Tests run: 10, Failures: 0, Errors: 0, Skipped: 0, Time elapsed: 0.01 s - in org.openmrs.BaseFormRecordableOpenmrsDataTest
  236. [INFO] Running org.openmrs.ConceptComponentTest
  237. [INFO] Tests run: 1, Failures: 0, Errors: 0, Skipped: 0, Time elapsed: 0.006 s - in org.openmrs.ConceptComponentTest
  238. [INFO] Running org.openmrs.FormTest
  239. [INFO] Tests run: 1, Failures: 0, Errors: 0, Skipped: 0, Time elapsed: 0.001 s - in org.openmrs.FormTest
  240. [INFO] Running org.openmrs.DrugTest
  241. [INFO] Tests run: 2, Failures: 0, Errors: 0, Skipped: 0, Time elapsed: 0.008 s - in org.openmrs.DrugTest
  242. [INFO] Running org.openmrs.PatientTest
  243. [INFO] Tests run: 9, Failures: 0, Errors: 0, Skipped: 0, Time elapsed: 0.003 s - in org.openmrs.PatientTest
  244. [INFO] Running org.openmrs.ConceptReferenceTermTest
  245. [INFO] Tests run: 3, Failures: 0, Errors: 0, Skipped: 0, Time elapsed: 0 s - in org.openmrs.ConceptReferenceTermTest
  246. [INFO] Running org.openmrs.patient.impl.LuhnIdentifierValidatorTest
  247. [INFO] Tests run: 3, Failures: 0, Errors: 0, Skipped: 0, Time elapsed: 0 s - in org.openmrs.patient.impl.LuhnIdentifierValidatorTest
  248. [INFO] Running org.openmrs.patient.impl.VerhoeffIdentifierValidatorTest
  249. [INFO] Tests run: 8, Failures: 0, Errors: 0, Skipped: 0, Time elapsed: 0.008 s - in org.openmrs.patient.impl.VerhoeffIdentifierValidatorTest
  250. [INFO] Running org.openmrs.EncounterProviderTest
  251. [INFO] Tests run: 1, Failures: 0, Errors: 0, Skipped: 0, Time elapsed: 0.001 s - in org.openmrs.EncounterProviderTest
  252. [INFO] Running org.openmrs.logic.result.ResultTest
  253. [INFO] Tests run: 17, Failures: 0, Errors: 0, Skipped: 0, Time elapsed: 0.006 s - in org.openmrs.logic.result.ResultTest
  254. [INFO] Running org.openmrs.logic.result.EmptyResultTest
  255. [INFO] Tests run: 2, Failures: 0, Errors: 0, Skipped: 0, Time elapsed: 0 s - in org.openmrs.logic.result.EmptyResultTest
  256. [INFO] Running org.openmrs.BaseCustomizableMetadataTest
  257. [INFO] Tests run: 2, Failures: 0, Errors: 0, Skipped: 0, Time elapsed: 0.202 s - in org.openmrs.BaseCustomizableMetadataTest
  258. [INFO] Running org.openmrs.obs.BinaryDataHandlerTest
  259. [INFO] Tests run: 4, Failures: 0, Errors: 0, Skipped: 0, Time elapsed: 0.062 s - in org.openmrs.obs.BinaryDataHandlerTest
  260. [INFO] Running org.openmrs.obs.ImageHandlerTest
  261. [INFO] Tests run: 4, Failures: 0, Errors: 0, Skipped: 0, Time elapsed: 0.041 s - in org.openmrs.obs.ImageHandlerTest
  262. [INFO] Running org.openmrs.obs.MediaHandlerTest
  263. [INFO] Tests run: 4, Failures: 0, Errors: 0, Skipped: 0, Time elapsed: 0.027 s - in org.openmrs.obs.MediaHandlerTest
  264. [INFO] Running org.openmrs.obs.TextHandlerTest
  265. [INFO] Tests run: 4, Failures: 0, Errors: 0, Skipped: 0, Time elapsed: 0.026 s - in org.openmrs.obs.TextHandlerTest
  266. [INFO] Running org.openmrs.obs.AbstractHandlerTest
  267. [INFO] Tests run: 4, Failures: 0, Errors: 0, Skipped: 0, Time elapsed: 0.088 s - in org.openmrs.obs.AbstractHandlerTest
  268. [INFO] Running org.openmrs.obs.BinaryStreamHandlerTest
  269. [INFO] Tests run: 4, Failures: 0, Errors: 0, Skipped: 0, Time elapsed: 0.024 s - in org.openmrs.obs.BinaryStreamHandlerTest
  270. [INFO] Running org.openmrs.OrderEntryIntegrationTest
  271. [INFO] Tests run: 15, Failures: 0, Errors: 0, Skipped: 0, Time elapsed: 0.748 s - in org.openmrs.OrderEntryIntegrationTest
  272. [INFO] Running org.openmrs.layout.name.NameTemplateTest
  273. [INFO] Tests run: 2, Failures: 0, Errors: 0, Skipped: 0, Time elapsed: 0.01 s - in org.openmrs.layout.name.NameTemplateTest
  274. [INFO] Running org.openmrs.PersonAddressTest
  275. [INFO] Tests run: 15, Failures: 0, Errors: 0, Skipped: 0, Time elapsed: 0 s - in org.openmrs.PersonAddressTest
  276. [INFO] Running org.openmrs.UserTest
  277. [INFO] Tests run: 9, Failures: 0, Errors: 0, Skipped: 0, Time elapsed: 0 s - in org.openmrs.UserTest
  278. [INFO] Running org.openmrs.liquibase.ChangeLogVersionFinderTest
  279. [INFO] Tests run: 15, Failures: 0, Errors: 0, Skipped: 0, Time elapsed: 0.076 s - in org.openmrs.liquibase.ChangeLogVersionFinderTest
  280. [INFO] Running org.openmrs.liquibase.ChangeLogDetectiveTest
  281. [INFO] Tests run: 11, Failures: 0, Errors: 0, Skipped: 0, Time elapsed: 0.077 s - in org.openmrs.liquibase.ChangeLogDetectiveTest
  282. [INFO] Running org.openmrs.liquibase.ChangeLogVersionsTest
  283. [INFO] Tests run: 3, Failures: 0, Errors: 0, Skipped: 0, Time elapsed: 0.001 s - in org.openmrs.liquibase.ChangeLogVersionsTest
  284. [INFO] Running org.openmrs.ConceptNumericTest
  285. [INFO] Tests run: 8, Failures: 0, Errors: 0, Skipped: 0, Time elapsed: 0.071 s - in org.openmrs.ConceptNumericTest
  286. [INFO] Running org.openmrs.EncounterTest
  287. [INFO] Tests run: 63, Failures: 0, Errors: 0, Skipped: 0, Time elapsed: 0.324 s - in org.openmrs.EncounterTest
  288. [INFO] Running org.openmrs.OrderGroupTest
  289. [INFO] Tests run: 3, Failures: 0, Errors: 0, Skipped: 0, Time elapsed: 0 s - in org.openmrs.OrderGroupTest
  290. [INFO] Running org.openmrs.util.HttpUrlTest
  291. [INFO] Tests run: 6, Failures: 0, Errors: 0, Skipped: 0, Time elapsed: 0 s - in org.openmrs.util.HttpUrlTest
  292. [INFO] Running org.openmrs.util.ProviderByPersonNameComparatorTest
  293. [INFO] Tests run: 6, Failures: 0, Errors: 0, Skipped: 0, Time elapsed: 0 s - in org.openmrs.util.ProviderByPersonNameComparatorTest
  294. [INFO] Running org.openmrs.util.OpenmrsUtilUnitTest
  295. [INFO] Tests run: 49, Failures: 0, Errors: 0, Skipped: 0, Time elapsed: 0.008 s - in org.openmrs.util.OpenmrsUtilUnitTest
  296. [INFO] Running org.openmrs.util.Log4JCompatibilityTest
  297. [INFO] Tests run: 1, Failures: 0, Errors: 0, Skipped: 0, Time elapsed: 0.009 s - in org.openmrs.util.Log4JCompatibilityTest
  298. [INFO] Running org.openmrs.util.DrugsByNameComparatorTest
  299. [INFO] Tests run: 4, Failures: 0, Errors: 0, Skipped: 0, Time elapsed: 0.003 s - in org.openmrs.util.DrugsByNameComparatorTest
  300. [INFO] Running org.openmrs.util.NaturalStringsTest
  301. [INFO] Tests run: 40, Failures: 0, Errors: 0, Skipped: 0, Time elapsed: 0.022 s - in org.openmrs.util.NaturalStringsTest
  302. [INFO] Running org.openmrs.util.DateUtilTest
  303. [INFO] Tests run: 1, Failures: 0, Errors: 0, Skipped: 0, Time elapsed: 0 s - in org.openmrs.util.DateUtilTest
  304. [INFO] Running org.openmrs.util.DatabaseUpdaterTest
  305. [INFO] Tests run: 5, Failures: 0, Errors: 0, Skipped: 0, Time elapsed: 1.885 s - in org.openmrs.util.DatabaseUpdaterTest
  306. [INFO] Running org.openmrs.util.DoubleRangeTest
  307. [INFO] Tests run: 28, Failures: 0, Errors: 0, Skipped: 0, Time elapsed: 0.004 s - in org.openmrs.util.DoubleRangeTest
  308. [INFO] Running org.openmrs.util.ReflectTest
  309. [INFO] Tests run: 18, Failures: 0, Errors: 0, Skipped: 0, Time elapsed: 0.001 s - in org.openmrs.util.ReflectTest
  310. [INFO] Running org.openmrs.util.ExceptionUtilTest
  311. [INFO] Tests run: 1, Failures: 0, Errors: 0, Skipped: 0, Time elapsed: 0 s - in org.openmrs.util.ExceptionUtilTest
  312. [INFO] Running org.openmrs.util.HandlerUtilTest
  313. [INFO] Tests run: 6, Failures: 0, Errors: 0, Skipped: 0, Time elapsed: 0 s - in org.openmrs.util.HandlerUtilTest
  314. [INFO] Running org.openmrs.util.PersonByNameComparatorTest
  315. [INFO] Tests run: 4, Failures: 0, Errors: 0, Skipped: 0, Time elapsed: 0 s - in org.openmrs.util.PersonByNameComparatorTest
  316. [INFO] Running org.openmrs.util.JavaVersionTest
  317. [INFO] Tests run: 1, Failures: 0, Errors: 0, Skipped: 0, Time elapsed: 0.001 s - in org.openmrs.util.JavaVersionTest
  318. [INFO] Running org.openmrs.util.MemoryAppenderTest
  319. [INFO] Tests run: 3, Failures: 0, Errors: 0, Skipped: 0, Time elapsed: 0.002 s - in org.openmrs.util.MemoryAppenderTest
  320. [INFO] Running org.openmrs.util.LocaleUtilityTest
  321. [INFO] Tests run: 21, Failures: 0, Errors: 0, Skipped: 0, Time elapsed: 0.12 s - in org.openmrs.util.LocaleUtilityTest
  322. [INFO] Running org.openmrs.util.OpenmrsSecurityManagerTest
  323. [INFO] Tests run: 2, Failures: 0, Errors: 0, Skipped: 0, Time elapsed: 0 s - in org.openmrs.util.OpenmrsSecurityManagerTest
  324. [INFO] Running org.openmrs.util.GraphTest
  325. [INFO] Tests run: 2, Failures: 0, Errors: 0, Skipped: 0, Time elapsed: 0 s - in org.openmrs.util.GraphTest
  326. [INFO] Running org.openmrs.util.FormatTest
  327. [INFO] Tests run: 8, Failures: 0, Errors: 0, Skipped: 0, Time elapsed: 0 s - in org.openmrs.util.FormatTest
  328. [INFO] Running org.openmrs.util.databasechange.ClassLoaderFileOpenerTest
  329. [INFO] Tests run: 3, Failures: 0, Errors: 0, Skipped: 0, Time elapsed: 0.029 s - in org.openmrs.util.databasechange.ClassLoaderFileOpenerTest
  330. [INFO] Running org.openmrs.util.OpenmrsUtilTest
  331. DEBUG - LoggingAdvice.invoke(115) |2020-07-24T10:26:22,679| In method AdministrationService.getGlobalProperty. Arguments: String=log.level, String=,
  332. DEBUG - LoggingAdvice.invoke(115) |2020-07-24T10:26:22,681| In method AdministrationService.getGlobalProperty. Arguments: String=log.level,
  333. DEBUG - LoggingAdvice.invoke(155) |2020-07-24T10:26:22,682| Exiting method getGlobalProperty. execution time: 1 ms
  334. DEBUG - LoggingAdvice.invoke(155) |2020-07-24T10:26:22,682| Exiting method getGlobalProperty. execution time: 3 ms
  335. WARN - OpenmrsUtil.applyLogLevel(614) |2020-07-24T10:26:23,382| Log level invalid string is invalid. Valid values are trace, debug, info, warn, error or fatal
  336. DEBUG - LoggingAdvice.invoke(115) |2020-07-24T10:26:24,430| In method AdministrationService.getGlobalProperty. Arguments: String=log.level, String=,
  337. DEBUG - LoggingAdvice.invoke(115) |2020-07-24T10:26:24,430| In method AdministrationService.getGlobalProperty. Arguments: String=log.level,
  338. DEBUG - LoggingAdvice.invoke(155) |2020-07-24T10:26:24,431| Exiting method getGlobalProperty. execution time: 1 ms
  339. DEBUG - LoggingAdvice.invoke(155) |2020-07-24T10:26:24,431| Exiting method getGlobalProperty. execution time: 2 ms
  340. [INFO] Tests run: 57, Failures: 0, Errors: 0, Skipped: 0, Time elapsed: 2.639 s - in org.openmrs.util.OpenmrsUtilTest
  341. [INFO] Running org.openmrs.util.UpgradeUtilTest
  342. [INFO] Tests run: 2, Failures: 0, Errors: 0, Skipped: 0, Time elapsed: 0.01 s - in org.openmrs.util.UpgradeUtilTest
  343. [INFO] Running org.openmrs.util.HttpClientTest
  344. [INFO] Tests run: 1, Failures: 0, Errors: 0, Skipped: 0, Time elapsed: 0.043 s - in org.openmrs.util.HttpClientTest
  345. [INFO] Running org.openmrs.util.SecurityTest
  346. [INFO] Tests run: 7, Failures: 0, Errors: 0, Skipped: 0, Time elapsed: 0.039 s - in org.openmrs.util.SecurityTest
  347. [INFO] Running org.openmrs.util.UserByNameComparatorTest
  348. [INFO] Tests run: 1, Failures: 0, Errors: 0, Skipped: 0, Time elapsed: 0 s - in org.openmrs.util.UserByNameComparatorTest
  349. [INFO] Running org.openmrs.util.LocationUtilityTest
  350. [INFO] Tests run: 2, Failures: 0, Errors: 0, Skipped: 0, Time elapsed: 0.028 s - in org.openmrs.util.LocationUtilityTest
  351. [INFO] Running org.openmrs.LocationTest
  352. [INFO] Tests run: 3, Failures: 0, Errors: 0, Skipped: 0, Time elapsed: 0.001 s - in org.openmrs.LocationTest
  353. [INFO] Running org.openmrs.AllergenTest
  354. [INFO] Tests run: 6, Failures: 0, Errors: 0, Skipped: 0, Time elapsed: 0.15 s - in org.openmrs.AllergenTest
  355. [INFO] Running org.openmrs.EncounterRoleTest
  356. [INFO] Tests run: 1, Failures: 0, Errors: 0, Skipped: 0, Time elapsed: 0 s - in org.openmrs.EncounterRoleTest
  357. [INFO] Running org.openmrs.PersonTest
  358. [INFO] Tests run: 36, Failures: 0, Errors: 0, Skipped: 0, Time elapsed: 0.111 s - in org.openmrs.PersonTest
  359. [INFO] Running org.openmrs.PatientStateTest
  360. [INFO] Tests run: 13, Failures: 0, Errors: 0, Skipped: 0, Time elapsed: 0.001 s - in org.openmrs.PatientStateTest
  361. [INFO] Running org.openmrs.scheduler.timer.TimerSchedulerServiceImplTest
  362. [INFO] Tests run: 1, Failures: 0, Errors: 0, Skipped: 0, Time elapsed: 0.007 s - in org.openmrs.scheduler.timer.TimerSchedulerServiceImplTest
  363. [INFO] Running org.openmrs.scheduler.SchedulerServiceTest
  364. [WARNING] Tests run: 1, Failures: 0, Errors: 0, Skipped: 1, Time elapsed: 0.001 s - in org.openmrs.scheduler.SchedulerServiceTest
  365. [INFO] Running org.openmrs.scheduler.SchedulerUtilTest
  366. [INFO] Tests run: 1, Failures: 0, Errors: 0, Skipped: 0, Time elapsed: 0 s - in org.openmrs.scheduler.SchedulerUtilTest
  367. [INFO] Running org.openmrs.hl7.HL7ServiceTest
  368. [WARNING] Tests run: 29, Failures: 0, Errors: 0, Skipped: 2, Time elapsed: 1.646 s - in org.openmrs.hl7.HL7ServiceTest
  369. [INFO] Running org.openmrs.hl7.handler.ORUR01HandlerTest
  370. [INFO] Tests run: 39, Failures: 0, Errors: 0, Skipped: 0, Time elapsed: 4.344 s - in org.openmrs.hl7.handler.ORUR01HandlerTest
  371. [INFO] Running org.openmrs.hl7.HL7UtilTest
  372. [INFO] Tests run: 5, Failures: 0, Errors: 0, Skipped: 0, Time elapsed: 0.002 s - in org.openmrs.hl7.HL7UtilTest
  373. [INFO] Running org.openmrs.customdatatype.datatype.BaseOpenmrsDatatypeTest
  374. [INFO] Tests run: 1, Failures: 0, Errors: 0, Skipped: 0, Time elapsed: 0 s - in org.openmrs.customdatatype.datatype.BaseOpenmrsDatatypeTest
  375. [INFO] Running org.openmrs.customdatatype.datatype.BaseMetadataDatatypeTest
  376. [INFO] Tests run: 1, Failures: 0, Errors: 0, Skipped: 0, Time elapsed: 0 s - in org.openmrs.customdatatype.datatype.BaseMetadataDatatypeTest
  377. [INFO] Running org.openmrs.customdatatype.datatype.RegexValidatedTextTest
  378. [INFO] Tests run: 3, Failures: 0, Errors: 0, Skipped: 0, Time elapsed: 0.001 s - in org.openmrs.customdatatype.datatype.RegexValidatedTextTest
  379. [INFO] Running org.openmrs.customdatatype.datatype.DateDatatypeTest
  380. [INFO] Tests run: 2, Failures: 0, Errors: 0, Skipped: 0, Time elapsed: 0 s - in org.openmrs.customdatatype.datatype.DateDatatypeTest
  381. [INFO] Running org.openmrs.customdatatype.CustomDatatypeUtilTest
  382. Security framework of XStream not initialized, XStream is probably vulnerable.
  383. [INFO] Tests run: 1, Failures: 0, Errors: 0, Skipped: 0, Time elapsed: 0.001 s - in org.openmrs.customdatatype.CustomDatatypeUtilTest
  384. [INFO] Running org.openmrs.api.FormServiceTest
  385. [INFO] Tests run: 48, Failures: 0, Errors: 0, Skipped: 0, Time elapsed: 0.604 s - in org.openmrs.api.FormServiceTest
  386. [INFO] Running org.openmrs.api.VisitServiceTest
  387. [INFO] Tests run: 68, Failures: 0, Errors: 0, Skipped: 0, Time elapsed: 1.455 s - in org.openmrs.api.VisitServiceTest
  388. [INFO] Running org.openmrs.api.PersonServiceTest
  389. [INFO] Tests run: 148, Failures: 0, Errors: 0, Skipped: 0, Time elapsed: 3.375 s - in org.openmrs.api.PersonServiceTest
  390. [INFO] Running org.openmrs.api.AdministrationServiceTest
  391. [WARNING] Tests run: 57, Failures: 0, Errors: 0, Skipped: 4, Time elapsed: 0.552 s - in org.openmrs.api.AdministrationServiceTest
  392. [INFO] Running org.openmrs.api.LocationServiceTest
  393. [INFO] Tests run: 70, Failures: 0, Errors: 0, Skipped: 0, Time elapsed: 2.221 s - in org.openmrs.api.LocationServiceTest
  394. [INFO] Running org.openmrs.api.DatatypeServiceTest
  395. [INFO] Tests run: 2, Failures: 0, Errors: 0, Skipped: 0, Time elapsed: 0.002 s - in org.openmrs.api.DatatypeServiceTest
  396. [INFO] Running org.openmrs.api.context.DaemonTest
  397. [INFO] Tests run: 10, Failures: 0, Errors: 0, Skipped: 0, Time elapsed: 0.094 s - in org.openmrs.api.context.DaemonTest
  398. [INFO] Running org.openmrs.api.context.ContextTest
  399. [INFO] Tests run: 17, Failures: 0, Errors: 0, Skipped: 0, Time elapsed: 0.078 s - in org.openmrs.api.context.ContextTest
  400. [INFO] Running org.openmrs.api.context.ContextWithModuleTest
  401. [INFO] Tests run: 1, Failures: 0, Errors: 0, Skipped: 0, Time elapsed: 0.073 s - in org.openmrs.api.context.ContextWithModuleTest
  402. [INFO] Running org.openmrs.api.ObsServiceTest
  403. [INFO] Tests run: 80, Failures: 0, Errors: 0, Skipped: 0, Time elapsed: 2.022 s - in org.openmrs.api.ObsServiceTest
  404. [INFO] Running org.openmrs.api.CohortServiceTest
  405. [INFO] Tests run: 39, Failures: 0, Errors: 0, Skipped: 0, Time elapsed: 1.868 s - in org.openmrs.api.CohortServiceTest
  406. [INFO] Running org.openmrs.api.UserServiceTest
  407. [ERROR] Tests run: 109, Failures: 1, Errors: 0, Skipped: 1, Time elapsed: 7.575 s <<< FAILURE! - in org.openmrs.api.UserServiceTest
  408. [ERROR] getAllUsers_shouldNotContainsAnyDuplicateUsers  Time elapsed: 0.097 s  <<< FAILURE!
  409. org.opentest4j.AssertionFailedError: expected: <11> but was: <12>
  410.         at org.openmrs.api.UserServiceTest.getAllUsers_shouldNotContainsAnyDuplicateUsers(UserServiceTest.java:680)
  411.  
  412. [INFO] Running org.openmrs.api.PatientServiceTest
  413. [WARNING] Tests run: 169, Failures: 0, Errors: 0, Skipped: 1, Time elapsed: 25.108 s - in org.openmrs.api.PatientServiceTest
  414. [INFO] Running org.openmrs.api.OrderServiceTest
  415. [WARNING] Tests run: 191, Failures: 0, Errors: 0, Skipped: 3, Time elapsed: 3.063 s - in org.openmrs.api.OrderServiceTest
  416. [INFO] Running org.openmrs.api.OrderSetServiceTest
  417. [INFO] Tests run: 12, Failures: 0, Errors: 0, Skipped: 0, Time elapsed: 0.488 s - in org.openmrs.api.OrderSetServiceTest
  418. [INFO] Running org.openmrs.api.handler.OpenmrsObjectSaveHandlerTest
  419. [INFO] Tests run: 5, Failures: 0, Errors: 0, Skipped: 0, Time elapsed: 0.001 s - in org.openmrs.api.handler.OpenmrsObjectSaveHandlerTest
  420. [INFO] Running org.openmrs.api.handler.RequiredReasonVoidSaveHandlerTest
  421. [INFO] Tests run: 5, Failures: 0, Errors: 0, Skipped: 0, Time elapsed: 0.029 s - in org.openmrs.api.handler.RequiredReasonVoidSaveHandlerTest
  422. [INFO] Running org.openmrs.api.handler.PersonVoidHandlerTest
  423. [INFO] Tests run: 8, Failures: 0, Errors: 0, Skipped: 0, Time elapsed: 0.025 s - in org.openmrs.api.handler.PersonVoidHandlerTest
  424. [INFO] Running org.openmrs.api.handler.RequireVoidReasonVoidHandlerTest
  425. [INFO] Tests run: 5, Failures: 0, Errors: 0, Skipped: 0, Time elapsed: 0.016 s - in org.openmrs.api.handler.RequireVoidReasonVoidHandlerTest
  426. [INFO] Running org.openmrs.api.handler.BaseUnretireHandlerTest
  427. [INFO] Tests run: 6, Failures: 0, Errors: 0, Skipped: 0, Time elapsed: 0.001 s - in org.openmrs.api.handler.BaseUnretireHandlerTest
  428. [INFO] Running org.openmrs.api.handler.BaseUnvoidHandlerTest
  429. [INFO] Tests run: 6, Failures: 0, Errors: 0, Skipped: 0, Time elapsed: 0 s - in org.openmrs.api.handler.BaseUnvoidHandlerTest
  430. [INFO] Running org.openmrs.api.handler.PersonSaveHandlerTest
  431. [INFO] Tests run: 1, Failures: 0, Errors: 0, Skipped: 0, Time elapsed: 0 s - in org.openmrs.api.handler.PersonSaveHandlerTest
  432. [INFO] Running org.openmrs.api.handler.ConceptNameSaveHandlerTest
  433. [INFO] Tests run: 4, Failures: 0, Errors: 0, Skipped: 0, Time elapsed: 0.002 s - in org.openmrs.api.handler.ConceptNameSaveHandlerTest
  434. [INFO] Running org.openmrs.api.handler.PatientDataUnvoidHandlerTest
  435. [INFO] Tests run: 3, Failures: 0, Errors: 0, Skipped: 0, Time elapsed: 1.4 s - in org.openmrs.api.handler.PatientDataUnvoidHandlerTest
  436. [INFO] Running org.openmrs.api.handler.BaseVoidHandlerTest
  437. [INFO] Tests run: 8, Failures: 0, Errors: 0, Skipped: 0, Time elapsed: 0 s - in org.openmrs.api.handler.BaseVoidHandlerTest
  438. [INFO] Running org.openmrs.api.handler.PatientDataVoidHandlerTest
  439. [INFO] Tests run: 2, Failures: 0, Errors: 0, Skipped: 0, Time elapsed: 0.047 s - in org.openmrs.api.handler.PatientDataVoidHandlerTest
  440. [INFO] Running org.openmrs.api.handler.ExistingVisitAssignmentHandlerTest
  441. [INFO] Tests run: 3, Failures: 0, Errors: 0, Skipped: 0, Time elapsed: 0.391 s - in org.openmrs.api.handler.ExistingVisitAssignmentHandlerTest
  442. [INFO] Running org.openmrs.api.handler.PersonUnvoidHandlerTest
  443. [INFO] Tests run: 6, Failures: 0, Errors: 0, Skipped: 0, Time elapsed: 0.001 s - in org.openmrs.api.handler.PersonUnvoidHandlerTest
  444. [INFO] Running org.openmrs.api.handler.OpenmrsMetadataSaveHandlerTest
  445. [INFO] Tests run: 2, Failures: 0, Errors: 0, Skipped: 0, Time elapsed: 0 s - in org.openmrs.api.handler.OpenmrsMetadataSaveHandlerTest
  446. [INFO] Running org.openmrs.api.handler.ExistingOrNewVisitAssignmentHandlerTest
  447. [INFO] Tests run: 5, Failures: 0, Errors: 0, Skipped: 0, Time elapsed: 0.643 s - in org.openmrs.api.handler.ExistingOrNewVisitAssignmentHandlerTest
  448. [INFO] Running org.openmrs.api.handler.BaseRetireHandlerTest
  449. [INFO] Tests run: 8, Failures: 0, Errors: 0, Skipped: 0, Time elapsed: 0 s - in org.openmrs.api.handler.BaseRetireHandlerTest
  450. [INFO] Running org.openmrs.api.db.hibernate.ProviderDAOTest
  451. [INFO] Tests run: 3, Failures: 0, Errors: 0, Skipped: 0, Time elapsed: 0.078 s - in org.openmrs.api.db.hibernate.ProviderDAOTest
  452. [INFO] Running org.openmrs.api.db.hibernate.HibernateDiagnosisDAOTest
  453. [INFO] Tests run: 9, Failures: 0, Errors: 0, Skipped: 0, Time elapsed: 0.116 s - in org.openmrs.api.db.hibernate.HibernateDiagnosisDAOTest
  454. [INFO] Running org.openmrs.api.db.hibernate.HibernateFormDAOTest
  455. [INFO] Tests run: 1, Failures: 0, Errors: 0, Skipped: 0, Time elapsed: 0.02 s - in org.openmrs.api.db.hibernate.HibernateFormDAOTest
  456. [INFO] Running org.openmrs.api.db.hibernate.DropMillisecondsHibernateInterceptorTest
  457. [INFO] Tests run: 3, Failures: 0, Errors: 0, Skipped: 0, Time elapsed: 0.011 s - in org.openmrs.api.db.hibernate.DropMillisecondsHibernateInterceptorTest
  458. [INFO] Running org.openmrs.api.db.hibernate.HibernateProviderDAOTest
  459. [INFO] Tests run: 3, Failures: 0, Errors: 0, Skipped: 0, Time elapsed: 0.081 s - in org.openmrs.api.db.hibernate.HibernateProviderDAOTest
  460. [INFO] Running org.openmrs.api.db.hibernate.HibernateConceptDAOTest
  461. [INFO] Tests run: 11, Failures: 0, Errors: 0, Skipped: 0, Time elapsed: 1.347 s - in org.openmrs.api.db.hibernate.HibernateConceptDAOTest
  462. [INFO] Running org.openmrs.api.db.hibernate.HibernateObsDAOTest
  463. [INFO] Tests run: 1, Failures: 0, Errors: 0, Skipped: 0, Time elapsed: 0.003 s - in org.openmrs.api.db.hibernate.HibernateObsDAOTest
  464. [INFO] Running org.openmrs.api.db.hibernate.HibernateLocationDAOTest
  465. [INFO] Tests run: 3, Failures: 0, Errors: 0, Skipped: 0, Time elapsed: 0.085 s - in org.openmrs.api.db.hibernate.HibernateLocationDAOTest
  466. [INFO] Running org.openmrs.api.db.hibernate.AuditableInterceptorTest
  467. [INFO] Tests run: 15, Failures: 0, Errors: 0, Skipped: 0, Time elapsed: 0.081 s - in org.openmrs.api.db.hibernate.AuditableInterceptorTest
  468. [INFO] Running org.openmrs.api.db.hibernate.HibernatePersonDAOTest
  469. [INFO] Tests run: 41, Failures: 0, Errors: 0, Skipped: 0, Time elapsed: 5.482 s - in org.openmrs.api.db.hibernate.HibernatePersonDAOTest
  470. [INFO] Running org.openmrs.api.db.hibernate.HibernatePatientDAOTest
  471. [INFO] Tests run: 2, Failures: 0, Errors: 0, Skipped: 0, Time elapsed: 0.206 s - in org.openmrs.api.db.hibernate.HibernatePatientDAOTest
  472. [INFO] Running org.openmrs.api.db.hibernate.PersonAttributeHelperTest
  473. [INFO] Tests run: 5, Failures: 0, Errors: 0, Skipped: 0, Time elapsed: 0.145 s - in org.openmrs.api.db.hibernate.PersonAttributeHelperTest
  474. [INFO] Running org.openmrs.api.db.hibernate.HibernateConditionDAOTest
  475. [INFO] Tests run: 6, Failures: 0, Errors: 0, Skipped: 0, Time elapsed: 0.647 s - in org.openmrs.api.db.hibernate.HibernateConditionDAOTest
  476. [INFO] Running org.openmrs.api.db.hibernate.HibernateOrderDAOTest
  477. [INFO] Tests run: 5, Failures: 0, Errors: 0, Skipped: 0, Time elapsed: 0.227 s - in org.openmrs.api.db.hibernate.HibernateOrderDAOTest
  478. [INFO] Running org.openmrs.api.db.hibernate.HibernateAdministrationDAOTest
  479. [INFO] Tests run: 4, Failures: 0, Errors: 0, Skipped: 0, Time elapsed: 0.009 s - in org.openmrs.api.db.hibernate.HibernateAdministrationDAOTest
  480. [INFO] Running org.openmrs.api.db.hibernate.ImmutableEntityInterceptorTest
  481. [INFO] Tests run: 4, Failures: 0, Errors: 0, Skipped: 0, Time elapsed: 0.008 s - in org.openmrs.api.db.hibernate.ImmutableEntityInterceptorTest
  482. [INFO] Running org.openmrs.api.db.hibernate.PatientSearchCriteriaTest
  483. [INFO] Tests run: 18, Failures: 0, Errors: 0, Skipped: 0, Time elapsed: 0.048 s - in org.openmrs.api.db.hibernate.PatientSearchCriteriaTest
  484. [INFO] Running org.openmrs.api.db.PersonDAOTest
  485. [INFO] Tests run: 3, Failures: 0, Errors: 0, Skipped: 0, Time elapsed: 0.004 s - in org.openmrs.api.db.PersonDAOTest
  486. [INFO] Running org.openmrs.api.db.VisitDAOTest
  487. [INFO] Tests run: 3, Failures: 0, Errors: 0, Skipped: 0, Time elapsed: 0.169 s - in org.openmrs.api.db.VisitDAOTest
  488. [INFO] Running org.openmrs.api.db.ProgramWorkflowDAOTest
  489. [INFO] Tests run: 5, Failures: 0, Errors: 0, Skipped: 0, Time elapsed: 0.013 s - in org.openmrs.api.db.ProgramWorkflowDAOTest
  490. [INFO] Running org.openmrs.api.db.SerializedObjectDAOTest
  491. [WARNING] Tests run: 1, Failures: 0, Errors: 0, Skipped: 1, Time elapsed: 0 s - in org.openmrs.api.db.SerializedObjectDAOTest
  492. [INFO] Running org.openmrs.api.db.UserDAOTest
  493. [INFO] Tests run: 8, Failures: 0, Errors: 0, Skipped: 0, Time elapsed: 0.025 s - in org.openmrs.api.db.UserDAOTest
  494. [INFO] Running org.openmrs.api.db.ContextDAOTest
  495. [INFO] Tests run: 24, Failures: 0, Errors: 0, Skipped: 0, Time elapsed: 0.408 s - in org.openmrs.api.db.ContextDAOTest
  496. [INFO] Running org.openmrs.api.db.EncounterDAOTest
  497. [INFO] Tests run: 4, Failures: 0, Errors: 0, Skipped: 0, Time elapsed: 0.262 s - in org.openmrs.api.db.EncounterDAOTest
  498. [INFO] Running org.openmrs.api.db.PatientDAOTest
  499. [WARNING] Tests run: 157, Failures: 0, Errors: 0, Skipped: 1, Time elapsed: 29.923 s - in org.openmrs.api.db.PatientDAOTest
  500. [INFO] Running org.openmrs.api.db.ConceptDAOTest
  501. [WARNING] Tests run: 13, Failures: 0, Errors: 0, Skipped: 2, Time elapsed: 0.14 s - in org.openmrs.api.db.ConceptDAOTest
  502. [INFO] Running org.openmrs.api.ProgramWorkflowServiceUnitTest
  503. [INFO] Tests run: 12, Failures: 0, Errors: 0, Skipped: 0, Time elapsed: 0.02 s - in org.openmrs.api.ProgramWorkflowServiceUnitTest
  504. [INFO] Running org.openmrs.api.cache.CachePropertiesUtilTest
  505. [INFO] Tests run: 1, Failures: 0, Errors: 0, Skipped: 0, Time elapsed: 0 s - in org.openmrs.api.cache.CachePropertiesUtilTest
  506. [INFO] Running org.openmrs.api.cache.OpenmrsCacheManagerFactoryBeanTest
  507. [INFO] Tests run: 1, Failures: 0, Errors: 0, Skipped: 0, Time elapsed: 0.004 s - in org.openmrs.api.cache.OpenmrsCacheManagerFactoryBeanTest
  508. [INFO] Running org.openmrs.api.EncounterServiceTest
  509. [WARNING] Tests run: 144, Failures: 0, Errors: 0, Skipped: 2, Time elapsed: 18.991 s - in org.openmrs.api.EncounterServiceTest
  510. [INFO] Running org.openmrs.api.PatientServiceAllergyTest
  511. [INFO] Tests run: 16, Failures: 0, Errors: 0, Skipped: 0, Time elapsed: 0.618 s - in org.openmrs.api.PatientServiceAllergyTest
  512. [INFO] Running org.openmrs.api.OpenmrsServiceTest
  513. [WARNING] Tests run: 1, Failures: 0, Errors: 0, Skipped: 1, Time elapsed: 0 s - in org.openmrs.api.OpenmrsServiceTest
  514. [INFO] Running org.openmrs.api.ProgramWorkflowServiceTest
  515. [INFO] Tests run: 63, Failures: 0, Errors: 0, Skipped: 0, Time elapsed: 4.361 s - in org.openmrs.api.ProgramWorkflowServiceTest
  516. [INFO] Running org.openmrs.api.ConceptServiceTest
  517. [WARNING] Tests run: 245, Failures: 0, Errors: 0, Skipped: 1, Time elapsed: 32.12 s - in org.openmrs.api.ConceptServiceTest
  518. [INFO] Running org.openmrs.api.AdministrationServiceUnitTest
  519. [INFO] Tests run: 5, Failures: 0, Errors: 0, Skipped: 0, Time elapsed: 0.031 s - in org.openmrs.api.AdministrationServiceUnitTest
  520. [INFO] Running org.openmrs.api.ProviderServiceTest
  521. [INFO] Tests run: 40, Failures: 0, Errors: 0, Skipped: 0, Time elapsed: 1.627 s - in org.openmrs.api.ProviderServiceTest
  522. [INFO] Running org.openmrs.api.impl.SerializationServiceImplTest
  523. [INFO] Tests run: 1, Failures: 0, Errors: 0, Skipped: 0, Time elapsed: 0.001 s - in org.openmrs.api.impl.SerializationServiceImplTest
  524. [INFO] Running org.openmrs.api.impl.ConditionServiceImplTest
  525. [INFO] Tests run: 12, Failures: 0, Errors: 0, Skipped: 0, Time elapsed: 0.198 s - in org.openmrs.api.impl.ConditionServiceImplTest
  526. [INFO] Running org.openmrs.api.impl.GlobalLocaleListTest
  527. [INFO] Tests run: 2, Failures: 0, Errors: 0, Skipped: 0, Time elapsed: 0 s - in org.openmrs.api.impl.GlobalLocaleListTest
  528. [INFO] Running org.openmrs.api.impl.DiagnosisServiceImplTest
  529. [INFO] Tests run: 11, Failures: 0, Errors: 0, Skipped: 0, Time elapsed: 0.306 s - in org.openmrs.api.impl.DiagnosisServiceImplTest
  530. [INFO] Running org.openmrs.api.impl.PatientServiceImplTest
  531. [INFO] Tests run: 14, Failures: 0, Errors: 0, Skipped: 0, Time elapsed: 0.359 s - in org.openmrs.api.impl.PatientServiceImplTest
  532. [INFO] Running org.openmrs.api.impl.ConceptServiceImplTest
  533. [INFO] Tests run: 63, Failures: 0, Errors: 0, Skipped: 0, Time elapsed: 0.238 s - in org.openmrs.api.impl.ConceptServiceImplTest
  534. [INFO] Running org.openmrs.ProviderTest
  535. [INFO] Tests run: 2, Failures: 0, Errors: 0, Skipped: 0, Time elapsed: 0 s - in org.openmrs.ProviderTest
  536. [INFO] Running org.openmrs.aop.RequiredDataAdviceTest
  537. [INFO] Tests run: 26, Failures: 0, Errors: 0, Skipped: 0, Time elapsed: 0.06 s - in org.openmrs.aop.RequiredDataAdviceTest
  538. [INFO] Running org.openmrs.aop.AuthorizationAdviceTest
  539. [INFO] Tests run: 2, Failures: 0, Errors: 0, Skipped: 0, Time elapsed: 0.005 s - in org.openmrs.aop.AuthorizationAdviceTest
  540. [INFO] Running org.openmrs.ObsTest
  541. [INFO] Tests run: 48, Failures: 0, Errors: 0, Skipped: 0, Time elapsed: 0.013 s - in org.openmrs.ObsTest
  542. [INFO] Running org.openmrs.EncounterTypeTest
  543. [INFO] Tests run: 1, Failures: 0, Errors: 0, Skipped: 0, Time elapsed: 0 s - in org.openmrs.EncounterTypeTest
  544. [INFO] Running org.openmrs.TestOrderTest
  545. [INFO] Tests run: 4, Failures: 0, Errors: 0, Skipped: 0, Time elapsed: 0 s - in org.openmrs.TestOrderTest
  546. [INFO] Running org.openmrs.ConceptTest
  547. [INFO] Tests run: 72, Failures: 0, Errors: 0, Skipped: 0, Time elapsed: 0.21 s - in org.openmrs.ConceptTest
  548. [INFO] Running org.openmrs.SimpleDosingInstructionsTest
  549. [INFO] Tests run: 10, Failures: 0, Errors: 0, Skipped: 0, Time elapsed: 0.017 s - in org.openmrs.SimpleDosingInstructionsTest
  550. [INFO] Running org.openmrs.notification.AlertServiceTest
  551. [INFO] Tests run: 3, Failures: 0, Errors: 0, Skipped: 0, Time elapsed: 0.022 s - in org.openmrs.notification.AlertServiceTest
  552. [INFO] Running org.openmrs.notification.MessageTest
  553. [INFO] Tests run: 4, Failures: 0, Errors: 0, Skipped: 0, Time elapsed: 0 s - in org.openmrs.notification.MessageTest
  554. [INFO] Running org.openmrs.notification.db.hibernate.HibernateAlertDAOTest
  555. [INFO] Tests run: 5, Failures: 0, Errors: 0, Skipped: 0, Time elapsed: 0.115 s - in org.openmrs.notification.db.hibernate.HibernateAlertDAOTest
  556. [INFO] Running org.openmrs.AllergiesTest
  557. [INFO] Tests run: 26, Failures: 0, Errors: 0, Skipped: 0, Time elapsed: 0.527 s - in org.openmrs.AllergiesTest
  558. [INFO] Running org.openmrs.BaseOpenmrsObjectTest
  559. [INFO] Tests run: 20, Failures: 0, Errors: 0, Skipped: 0, Time elapsed: 0.045 s - in org.openmrs.BaseOpenmrsObjectTest
  560. [INFO] Running org.openmrs.OpenmrsTestAnnotationsTest
  561. [INFO] Tests run: 2, Failures: 0, Errors: 0, Skipped: 0, Time elapsed: 0.131 s - in org.openmrs.OpenmrsTestAnnotationsTest
  562. [INFO] Running org.openmrs.ObsBehaviorTest
  563. [WARNING] Tests run: 3, Failures: 0, Errors: 0, Skipped: 1, Time elapsed: 0.594 s - in org.openmrs.ObsBehaviorTest
  564. [INFO] Running org.openmrs.order.OrderUtilTest
  565. [INFO] Tests run: 15, Failures: 0, Errors: 0, Skipped: 0, Time elapsed: 0.001 s - in org.openmrs.order.OrderUtilTest
  566. [INFO] Running org.openmrs.annotation.OpenmrsProfileIncludeFilterTest
  567. [INFO] Tests run: 2, Failures: 0, Errors: 0, Skipped: 0, Time elapsed: 0.002 s - in org.openmrs.annotation.OpenmrsProfileIncludeFilterTest
  568. [INFO] Running org.openmrs.annotation.StartModuleAnnotationReuseTest
  569. [INFO] Tests run: 1, Failures: 0, Errors: 0, Skipped: 0, Time elapsed: 0.359 s - in org.openmrs.annotation.StartModuleAnnotationReuseTest
  570. [INFO] Running org.openmrs.annotation.OpenmrsProfileExcludeFilterTest
  571. [WARNING] Tests run: 8, Failures: 0, Errors: 0, Skipped: 2, Time elapsed: 0.759 s - in org.openmrs.annotation.OpenmrsProfileExcludeFilterTest
  572. [INFO] Running org.openmrs.annotation.StartModuleAnnotationTest
  573. [INFO] Tests run: 1, Failures: 0, Errors: 0, Skipped: 0, Time elapsed: 0.947 s - in org.openmrs.annotation.StartModuleAnnotationTest
  574. [INFO] Running org.openmrs.annotation.OpenmrsProfileExcludeFilterWithModulesTest
  575. [INFO] Tests run: 1, Failures: 0, Errors: 0, Skipped: 0, Time elapsed: 0.86 s - in org.openmrs.annotation.OpenmrsProfileExcludeFilterWithModulesTest
  576. [INFO] Running org.openmrs.DrugOrderTest
  577. [INFO] Tests run: 22, Failures: 0, Errors: 0, Skipped: 0, Time elapsed: 0.086 s - in org.openmrs.DrugOrderTest
  578. [INFO] Running org.openmrs.module.ModuleFileParserTest
  579. [INFO] Tests run: 6, Failures: 0, Errors: 0, Skipped: 0, Time elapsed: 0.766 s - in org.openmrs.module.ModuleFileParserTest
  580. [INFO] Running org.openmrs.module.ModuleUtilTest
  581. [INFO] Tests run: 56, Failures: 0, Errors: 0, Skipped: 0, Time elapsed: 0.899 s - in org.openmrs.module.ModuleUtilTest
  582. [INFO] Running org.openmrs.module.ModuleClassLoaderTest
  583. [INFO] Tests run: 10, Failures: 0, Errors: 0, Skipped: 0, Time elapsed: 0.728 s - in org.openmrs.module.ModuleClassLoaderTest
  584. [INFO] Running org.openmrs.module.ModuleActivatorTest
  585. [INFO] Tests run: 11, Failures: 0, Errors: 0, Skipped: 0, Time elapsed: 1.481 s - in org.openmrs.module.ModuleActivatorTest
  586. [INFO] Running org.openmrs.module.VersionComparatorTest
  587. [INFO] Tests run: 1, Failures: 0, Errors: 0, Skipped: 0, Time elapsed: 0 s - in org.openmrs.module.VersionComparatorTest
  588. [INFO] Running org.openmrs.module.ModuleFactoryTest
  589. [INFO] Tests run: 9, Failures: 0, Errors: 0, Skipped: 0, Time elapsed: 0.941 s - in org.openmrs.module.ModuleFactoryTest
  590. [INFO] Running org.openmrs.module.ModuleInteroperabilityTest
  591. [INFO] Tests run: 1, Failures: 0, Errors: 0, Skipped: 0, Time elapsed: 0.321 s - in org.openmrs.module.ModuleInteroperabilityTest
  592. [INFO] Running org.openmrs.module.ModuleExtensionsTest
  593. [INFO] Tests run: 10, Failures: 0, Errors: 0, Skipped: 0, Time elapsed: 0.019 s - in org.openmrs.module.ModuleExtensionsTest
  594. [INFO] Running org.openmrs.module.ModuleFileParserUnitTest
  595. [Fatal Error] :1:67: XML document structures must start and end within the same entity.
  596. [Fatal Error] :-1:-1: Premature end of file.
  597. [INFO] Tests run: 73, Failures: 0, Errors: 0, Skipped: 0, Time elapsed: 0.229 s - in org.openmrs.module.ModuleFileParserUnitTest
  598. [INFO] Running org.openmrs.module.ModuleTest
  599. [INFO] Tests run: 9, Failures: 0, Errors: 0, Skipped: 0, Time elapsed: 0 s - in org.openmrs.module.ModuleTest
  600. [INFO] Running org.openmrs.module.UpdateFileParserTest
  601. [INFO] Tests run: 3, Failures: 0, Errors: 0, Skipped: 0, Time elapsed: 0 s - in org.openmrs.module.UpdateFileParserTest
  602. [INFO] Running org.openmrs.attribute.AttributeIntegrationTest
  603. [INFO] Tests run: 1, Failures: 0, Errors: 0, Skipped: 0, Time elapsed: 0.7 s - in org.openmrs.attribute.AttributeIntegrationTest
  604. [INFO] Running org.openmrs.comparator.PatientIdentifierTypeDefaultComparatorTest
  605. [INFO] Tests run: 1, Failures: 0, Errors: 0, Skipped: 0, Time elapsed: 0.001 s - in org.openmrs.comparator.PatientIdentifierTypeDefaultComparatorTest
  606. [INFO] Running org.openmrs.OrderTypeTest
  607. [INFO] Tests run: 3, Failures: 0, Errors: 0, Skipped: 0, Time elapsed: 0 s - in org.openmrs.OrderTypeTest
  608. [INFO] Running org.openmrs.OpenmrsTestsTest
  609. [INFO] Tests run: 5, Failures: 0, Errors: 0, Skipped: 0, Time elapsed: 0.114 s - in org.openmrs.OpenmrsTestsTest
  610. [INFO] Running org.openmrs.PersonAttributeTest
  611. [INFO] Tests run: 6, Failures: 0, Errors: 0, Skipped: 0, Time elapsed: 0.712 s - in org.openmrs.PersonAttributeTest
  612. [INFO] Running org.openmrs.CohortMembershipTest
  613. [INFO] Tests run: 21, Failures: 0, Errors: 0, Skipped: 0, Time elapsed: 0.004 s - in org.openmrs.CohortMembershipTest
  614. [INFO] Running org.openmrs.PatientProgramTest
  615. [INFO] Tests run: 5, Failures: 0, Errors: 0, Skipped: 0, Time elapsed: 0 s - in org.openmrs.PatientProgramTest
  616. [INFO] Running org.openmrs.validator.VisitTypeValidatorTest
  617. [INFO] Tests run: 2, Failures: 0, Errors: 0, Skipped: 0, Time elapsed: 0.713 s - in org.openmrs.validator.VisitTypeValidatorTest
  618. [INFO] Running org.openmrs.validator.PatientIdentifierTypeValidatorTest
  619. [INFO] Tests run: 9, Failures: 0, Errors: 0, Skipped: 0, Time elapsed: 0.747 s - in org.openmrs.validator.PatientIdentifierTypeValidatorTest
  620. [INFO] Running org.openmrs.validator.FieldTypeValidatorTest
  621. [INFO] Tests run: 5, Failures: 0, Errors: 0, Skipped: 0, Time elapsed: 0.728 s - in org.openmrs.validator.FieldTypeValidatorTest
  622. [INFO] Running org.openmrs.validator.ProviderValidatorTest
  623. [INFO] Tests run: 13, Failures: 0, Errors: 0, Skipped: 0, Time elapsed: 0.78 s - in org.openmrs.validator.ProviderValidatorTest
  624. [INFO] Running org.openmrs.validator.ImplementationIdValidatorTest
  625. [INFO] Tests run: 8, Failures: 0, Errors: 0, Skipped: 0, Time elapsed: 0.712 s - in org.openmrs.validator.ImplementationIdValidatorTest
  626. [INFO] Running org.openmrs.validator.ConceptDrugValidatorTest
  627. [INFO] Tests run: 3, Failures: 0, Errors: 0, Skipped: 0, Time elapsed: 0 s - in org.openmrs.validator.ConceptDrugValidatorTest
  628. [INFO] Running org.openmrs.validator.RelationshipValidatorTest
  629. [INFO] Tests run: 7, Failures: 0, Errors: 0, Skipped: 0, Time elapsed: 0.708 s - in org.openmrs.validator.RelationshipValidatorTest
  630. [INFO] Running org.openmrs.validator.AlertValidatorTest
  631. [INFO] Tests run: 5, Failures: 0, Errors: 0, Skipped: 0, Time elapsed: 0.712 s - in org.openmrs.validator.AlertValidatorTest
  632. [INFO] Running org.openmrs.validator.CohortValidatorTest
  633. [INFO] Tests run: 7, Failures: 0, Errors: 0, Skipped: 0, Time elapsed: 1.029 s - in org.openmrs.validator.CohortValidatorTest
  634. [INFO] Running org.openmrs.validator.HL7SourceValidatorTest
  635. [INFO] Tests run: 2, Failures: 0, Errors: 0, Skipped: 0, Time elapsed: 0.705 s - in org.openmrs.validator.HL7SourceValidatorTest
  636. [INFO] Running org.openmrs.validator.RelationshipTypeValidatorTest
  637. [INFO] Tests run: 7, Failures: 0, Errors: 0, Skipped: 0, Time elapsed: 0.716 s - in org.openmrs.validator.RelationshipTypeValidatorTest
  638. [INFO] Running org.openmrs.validator.LocationTagValidatorTest
  639. [INFO] Tests run: 2, Failures: 0, Errors: 0, Skipped: 0, Time elapsed: 0.719 s - in org.openmrs.validator.LocationTagValidatorTest
  640. [INFO] Running org.openmrs.validator.OrderFrequencyValidatorTest
  641. [INFO] Tests run: 9, Failures: 0, Errors: 0, Skipped: 0, Time elapsed: 0.739 s - in org.openmrs.validator.OrderFrequencyValidatorTest
  642. [INFO] Running org.openmrs.validator.AllergyValidatorTest
  643. [INFO] Tests run: 9, Failures: 0, Errors: 0, Skipped: 0, Time elapsed: 0.111 s - in org.openmrs.validator.AllergyValidatorTest
  644. [INFO] Running org.openmrs.validator.FieldValidatorTest
  645. [INFO] Tests run: 8, Failures: 0, Errors: 0, Skipped: 0, Time elapsed: 0.697 s - in org.openmrs.validator.FieldValidatorTest
  646. [INFO] Running org.openmrs.validator.UserValidatorTest
  647. [INFO] Tests run: 23, Failures: 0, Errors: 0, Skipped: 0, Time elapsed: 0.742 s - in org.openmrs.validator.UserValidatorTest
  648. [INFO] Running org.openmrs.validator.PersonValidatorTest
  649. [INFO] Tests run: 13, Failures: 0, Errors: 0, Skipped: 0, Time elapsed: 0.743 s - in org.openmrs.validator.PersonValidatorTest
  650. [INFO] Running org.openmrs.validator.TestOrderValidatorTest
  651. [INFO] Tests run: 2, Failures: 0, Errors: 0, Skipped: 0, Time elapsed: 0.693 s - in org.openmrs.validator.TestOrderValidatorTest
  652. [INFO] Running org.openmrs.validator.ProviderAttributeTypeValidatorTest
  653. [INFO] Tests run: 2, Failures: 0, Errors: 0, Skipped: 0, Time elapsed: 0.711 s - in org.openmrs.validator.ProviderAttributeTypeValidatorTest
  654. [INFO] Running org.openmrs.validator.EncounterValidatorTest
  655. [INFO] Tests run: 12, Failures: 0, Errors: 0, Skipped: 0, Time elapsed: 0.728 s - in org.openmrs.validator.EncounterValidatorTest
  656. [INFO] Running org.openmrs.validator.ConceptClassValidatorTest
  657. [INFO] Tests run: 6, Failures: 0, Errors: 0, Skipped: 0, Time elapsed: 0.7 s - in org.openmrs.validator.ConceptClassValidatorTest
  658. [INFO] Running org.openmrs.validator.VisitAttributeTypeValidatorTest
  659. [INFO] Tests run: 2, Failures: 0, Errors: 0, Skipped: 0, Time elapsed: 0.685 s - in org.openmrs.validator.VisitAttributeTypeValidatorTest
  660. [INFO] Running org.openmrs.validator.LocationValidatorTest
  661. [INFO] Tests run: 9, Failures: 0, Errors: 0, Skipped: 0, Time elapsed: 0.719 s - in org.openmrs.validator.LocationValidatorTest
  662. [INFO] Running org.openmrs.validator.ConceptSourceValidatorTest
  663. [INFO] Tests run: 6, Failures: 0, Errors: 0, Skipped: 0, Time elapsed: 0.712 s - in org.openmrs.validator.ConceptSourceValidatorTest
  664. [INFO] Running org.openmrs.validator.OrderTypeValidatorTest
  665. [INFO] Tests run: 14, Failures: 0, Errors: 0, Skipped: 0, Time elapsed: 0.75 s - in org.openmrs.validator.OrderTypeValidatorTest
  666. [INFO] Running org.openmrs.validator.PatientIdentifierValidatorTest
  667. [INFO] Tests run: 20, Failures: 0, Errors: 0, Skipped: 0, Time elapsed: 0.766 s - in org.openmrs.validator.PatientIdentifierValidatorTest
  668. [INFO] Running org.openmrs.validator.ConceptNameTagValidatorTest
  669. [INFO] Tests run: 7, Failures: 0, Errors: 0, Skipped: 0, Time elapsed: 0.702 s - in org.openmrs.validator.ConceptNameTagValidatorTest
  670. [INFO] Running org.openmrs.validator.SchedulerFormValidatorTest
  671. [INFO] Tests run: 10, Failures: 0, Errors: 0, Skipped: 0, Time elapsed: 0.747 s - in org.openmrs.validator.SchedulerFormValidatorTest
  672. [INFO] Running org.openmrs.validator.VisitValidatorTest
  673. [WARNING] Tests run: 27, Failures: 0, Errors: 0, Skipped: 1, Time elapsed: 1.584 s - in org.openmrs.validator.VisitValidatorTest
  674. [INFO] Running org.openmrs.validator.DrugValidatorTest
  675. [INFO] Tests run: 9, Failures: 0, Errors: 0, Skipped: 0, Time elapsed: 0.848 s - in org.openmrs.validator.DrugValidatorTest
  676. [INFO] Running org.openmrs.validator.ConceptReferenceTermValidatorTest
  677. [Field error in object 'term' on field 'conceptReferenceTermMaps[1].termB': rejected value [weight term(WGT234)]; codes [ConceptReferenceTerm.termToTerm.alreadyMapped.term.conceptReferenceTermMaps[1].termB,ConceptReferenceTerm.termToTerm.alreadyMapped.term.conceptReferenceTermMaps.termB,ConceptReferenceTerm.termToTerm.alreadyMapped.conceptReferenceTermMaps[1].termB,ConceptReferenceTerm.termToTerm.alreadyMapped.conceptReferenceTermMaps.termB,ConceptReferenceTerm.termToTerm.alreadyMapped.termB,ConceptReferenceTerm.termToTerm.alreadyMapped.org.openmrs.ConceptReferenceTerm,ConceptReferenceTerm.termToTerm.alreadyMapped]; arguments []; default message [Cannot map a reference term multiple times to the same concept reference term]]
  678. [WARNING] Tests run: 18, Failures: 0, Errors: 0, Skipped: 3, Time elapsed: 0.737 s - in org.openmrs.validator.ConceptReferenceTermValidatorTest
  679. [INFO] Running org.openmrs.validator.PersonNameValidatorTest
  680. [WARNING] Tests run: 59, Failures: 0, Errors: 0, Skipped: 8, Time elapsed: 0.829 s - in org.openmrs.validator.PersonNameValidatorTest
  681. [INFO] Running org.openmrs.validator.StateConversionValidatorTest
  682. [INFO] Tests run: 4, Failures: 0, Errors: 0, Skipped: 0, Time elapsed: 0.678 s - in org.openmrs.validator.StateConversionValidatorTest
  683. [INFO] Running org.openmrs.validator.LocationAttributeTypeValidatorTest
  684. [INFO] Tests run: 6, Failures: 0, Errors: 0, Skipped: 0, Time elapsed: 0.793 s - in org.openmrs.validator.LocationAttributeTypeValidatorTest
  685. [INFO] Running org.openmrs.validator.DiagnosisValidatorTest
  686. [INFO] Tests run: 6, Failures: 0, Errors: 0, Skipped: 0, Time elapsed: 0.741 s - in org.openmrs.validator.DiagnosisValidatorTest
  687. [INFO] Running org.openmrs.validator.PersonAttributeTypeValidatorTest
  688. [INFO] Tests run: 7, Failures: 0, Errors: 0, Skipped: 0, Time elapsed: 0.712 s - in org.openmrs.validator.PersonAttributeTypeValidatorTest
  689. [INFO] Running org.openmrs.validator.PatientValidatorTest
  690. [INFO] Tests run: 17, Failures: 0, Errors: 0, Skipped: 0, Time elapsed: 0.757 s - in org.openmrs.validator.PatientValidatorTest
  691. [INFO] Running org.openmrs.validator.ConceptMapTypeValidatorTest
  692. [INFO] Tests run: 8, Failures: 0, Errors: 0, Skipped: 0, Time elapsed: 0.729 s - in org.openmrs.validator.ConceptMapTypeValidatorTest
  693. [INFO] Running org.openmrs.validator.ProgramValidatorTest
  694. [INFO] Tests run: 8, Failures: 0, Errors: 0, Skipped: 0, Time elapsed: 0.709 s - in org.openmrs.validator.ProgramValidatorTest
  695. [INFO] Running org.openmrs.validator.PrivilegeValidatorTest
  696. [INFO] Tests run: 5, Failures: 0, Errors: 0, Skipped: 0, Time elapsed: 0.701 s - in org.openmrs.validator.PrivilegeValidatorTest
  697. [INFO] Running org.openmrs.validator.RequireNameValidatorTest
  698. [INFO] Tests run: 2, Failures: 0, Errors: 0, Skipped: 0, Time elapsed: 0 s - in org.openmrs.validator.RequireNameValidatorTest
  699. [INFO] Running org.openmrs.validator.RoleValidatorTest
  700. [INFO] Tests run: 6, Failures: 0, Errors: 0, Skipped: 0, Time elapsed: 0.726 s - in org.openmrs.validator.RoleValidatorTest
  701. [INFO] Running org.openmrs.validator.ConceptValidatorTest
  702. [INFO] Tests run: 31, Failures: 0, Errors: 0, Skipped: 0, Time elapsed: 0.834 s - in org.openmrs.validator.ConceptValidatorTest
  703. [INFO] Running org.openmrs.validator.EncounterRoleValidatorTest
  704. [INFO] Tests run: 5, Failures: 0, Errors: 0, Skipped: 0, Time elapsed: 0.71 s - in org.openmrs.validator.EncounterRoleValidatorTest
  705. [INFO] Running org.openmrs.validator.ObsValidatorTest
  706. [INFO] Tests run: 22, Failures: 0, Errors: 0, Skipped: 0, Time elapsed: 0.772 s - in org.openmrs.validator.ObsValidatorTest
  707. [INFO] Running org.openmrs.validator.ConceptDatatypeValidatorTest
  708. [INFO] Tests run: 5, Failures: 0, Errors: 0, Skipped: 0, Time elapsed: 0.704 s - in org.openmrs.validator.ConceptDatatypeValidatorTest
  709. [INFO] Running org.openmrs.validator.ValidateUtilTest
  710. [INFO] Tests run: 9, Failures: 0, Errors: 0, Skipped: 0, Time elapsed: 0.73 s - in org.openmrs.validator.ValidateUtilTest
  711. [INFO] Running org.openmrs.validator.PatientProgramValidatorTest
  712. [INFO] Tests run: 22, Failures: 0, Errors: 0, Skipped: 0, Time elapsed: 0.818 s - in org.openmrs.validator.PatientProgramValidatorTest
  713. [INFO] Running org.openmrs.validator.FormValidatorTest
  714. [INFO] Tests run: 8, Failures: 0, Errors: 0, Skipped: 0, Time elapsed: 0.723 s - in org.openmrs.validator.FormValidatorTest
  715. [INFO] Running org.openmrs.validator.ConditionValidatorTest
  716. [INFO] Tests run: 4, Failures: 0, Errors: 0, Skipped: 0, Time elapsed: 0 s - in org.openmrs.validator.ConditionValidatorTest
  717. [INFO] Running org.openmrs.validator.BaseAttributeTypeValidatorTest
  718. [INFO] Tests run: 16, Failures: 0, Errors: 0, Skipped: 0, Time elapsed: 3.306 s - in org.openmrs.validator.BaseAttributeTypeValidatorTest
  719. [INFO] Running org.openmrs.validator.DrugOrderValidatorTest
  720. [INFO] Tests run: 36, Failures: 0, Errors: 0, Skipped: 0, Time elapsed: 1.702 s - in org.openmrs.validator.DrugOrderValidatorTest
  721. [INFO] Running org.openmrs.validator.ConceptAttributeTypeValidatorTest
  722. [INFO] Tests run: 8, Failures: 0, Errors: 0, Skipped: 0, Time elapsed: 0.843 s - in org.openmrs.validator.ConceptAttributeTypeValidatorTest
  723. [INFO] Running org.openmrs.validator.OrderValidatorTest
  724. [INFO] Tests run: 22, Failures: 0, Errors: 0, Skipped: 0, Time elapsed: 0.89 s - in org.openmrs.validator.OrderValidatorTest
  725. [INFO] Running org.openmrs.validator.EncounterTypeValidatorTest
  726. [INFO] Tests run: 7, Failures: 0, Errors: 0, Skipped: 0, Time elapsed: 0.742 s - in org.openmrs.validator.EncounterTypeValidatorTest
  727. [INFO] Running org.openmrs.validator.PersonMergeLogValidatorTest
  728. [INFO] Tests run: 6, Failures: 0, Errors: 0, Skipped: 0, Time elapsed: 0.717 s - in org.openmrs.validator.PersonMergeLogValidatorTest
  729. [INFO] Running org.openmrs.validator.PersonAddressValidatorTest
  730. [INFO] Tests run: 10, Failures: 0, Errors: 0, Skipped: 0, Time elapsed: 0.75 s - in org.openmrs.validator.PersonAddressValidatorTest
  731. [INFO] Running org.openmrs.OrderTest
  732. [INFO] Tests run: 64, Failures: 0, Errors: 0, Skipped: 0, Time elapsed: 0.841 s - in org.openmrs.OrderTest
  733. [INFO] Running org.openmrs.DurationTest
  734. [INFO] Tests run: 11, Failures: 0, Errors: 0, Skipped: 0, Time elapsed: 0.708 s - in org.openmrs.DurationTest
  735. [INFO] Running org.openmrs.messagesource.PresentationMessageMapTest
  736. [INFO] Tests run: 2, Failures: 0, Errors: 0, Skipped: 0, Time elapsed: 0 s - in org.openmrs.messagesource.PresentationMessageMapTest
  737. [INFO] Running org.openmrs.messagesource.MessageSourceServiceTest
  738. [INFO] Tests run: 1, Failures: 0, Errors: 0, Skipped: 0, Time elapsed: 0.709 s - in org.openmrs.messagesource.MessageSourceServiceTest
  739. [INFO] Running org.openmrs.messagesource.impl.DefaultMessageSourceServiceImplTest
  740. [INFO] Tests run: 1, Failures: 0, Errors: 0, Skipped: 0, Time elapsed: 0 s - in org.openmrs.messagesource.impl.DefaultMessageSourceServiceImplTest
  741. [INFO] Running org.openmrs.messagesource.impl.CachedMessageSourceTest
  742. [INFO] Tests run: 2, Failures: 0, Errors: 0, Skipped: 0, Time elapsed: 0 s - in org.openmrs.messagesource.impl.CachedMessageSourceTest
  743. [INFO] Running org.openmrs.util.ThreadSafeCircularFifoQueueTest
  744. [INFO] Tests run: 36, Failures: 0, Errors: 0, Skipped: 0, Time elapsed: 0.024 s - in org.openmrs.util.ThreadSafeCircularFifoQueueTest
  745. [INFO] Running org.openmrs.annotation.OpenmrsProfileExcludeFilterWithModulesJUnit4Test
  746. [INFO] Tests run: 1, Failures: 0, Errors: 0, Skipped: 0, Time elapsed: 0.91 s - in org.openmrs.annotation.OpenmrsProfileExcludeFilterWithModulesJUnit4Test
  747. [INFO] Running org.openmrs.annotation.StartModuleAnnotationReuseJUnit4Test
  748. [INFO] Tests run: 1, Failures: 0, Errors: 0, Skipped: 0, Time elapsed: 0.862 s - in org.openmrs.annotation.StartModuleAnnotationReuseJUnit4Test
  749. [INFO] Running org.openmrs.annotation.StartModuleAnnotationJUnit4Test
  750. [INFO] Tests run: 1, Failures: 0, Errors: 0, Skipped: 0, Time elapsed: 1.011 s - in org.openmrs.annotation.StartModuleAnnotationJUnit4Test
  751. [INFO]
  752. [INFO] Results:
  753. [INFO]
  754. [ERROR] Failures:
  755. [ERROR]   UserServiceTest.getAllUsers_shouldNotContainsAnyDuplicateUsers:680 expected: <11> but was: <12>
  756. [INFO]
  757. [ERROR] Tests run: 4314, Failures: 1, Errors: 0, Skipped: 36
  758. [INFO]
  759. [INFO] ------------------------------------------------------------------------
  760. [INFO] Reactor Summary for OpenMRS 2.4.0-SNAPSHOT:
  761. [INFO]
  762. [INFO] OpenMRS ............................................ SUCCESS [  0.640 s]
  763. [INFO] openmrs-tools ...................................... SUCCESS [  0.359 s]
  764. [INFO] openmrs-test ....................................... SUCCESS [  0.083 s]
  765. [INFO] openmrs-api ........................................ FAILURE [04:14 min]
  766. [INFO] openmrs-web ........................................ SKIPPED
  767. [INFO] openmrs-webapp ..................................... SKIPPED
  768. [INFO] openmrs-liquibase .................................. SKIPPED
  769. [INFO] ------------------------------------------------------------------------
  770. [INFO] BUILD FAILURE
  771. [INFO] ------------------------------------------------------------------------
  772. [INFO] Total time:  04:15 min
  773. [INFO] Finished at: 2020-07-24T10:30:02Z
  774. [INFO] ------------------------------------------------------------------------
  775. [ERROR] Failed to execute goal org.apache.maven.plugins:maven-surefire-plugin:2.22.2:test (default-test) on project openmrs-api: There are test failures.
  776. [ERROR]
  777. [ERROR] Please refer to /home/patrick/openmrs-core/api/target/surefire-reports for the individual test results.
  778. [ERROR] Please refer to dump files (if any exist) [date].dump, [date]-jvmRun[N].dump and [date].dumpstream.
  779. [ERROR] -> [Help 1]
  780. [ERROR]
  781. [ERROR] To see the full stack trace of the errors, re-run Maven with the -e switch.
  782. [ERROR] Re-run Maven using the -X switch to enable full debug logging.
  783. [ERROR]
  784. [ERROR] For more information about the errors and possible solutions, please read the following articles:
  785. [ERROR] [Help 1] http://cwiki.apache.org/confluence/display/MAVEN/MojoFailureException
  786. [ERROR]
  787. [ERROR] After correcting the problems, you can resume the build with the command
  788. [ERROR]   mvn <goals> -rf :openmrs-api
  789.  
Advertisement
Add Comment
Please, Sign In to add comment
Advertisement