daily pastebin goal
10%
SHARE
TWEET

Untitled

a guest Jul 11th, 2018 52 Never
Not a member of Pastebin yet? Sign Up, it unlocks many cool features!
  1. S -pthread -g -march=native -O3 -pipe -Wall -MT testglib.o -MD -MP -MF .deps/testglib.Tpo -c -o testglib.o testglib.c
  2. mv -f .deps/scannerapi.Tpo .deps/scannerapi.Po
  3. mv -f .deps/libmoduletestplugin_a.Tpo .deps/libmoduletestplugin_a.Plo
  4. x86_64-pc-linux-gnu-gcc -DHAVE_CONFIG_H -I. -I..  -I.. -I../glib -I../gmodule -DG_DISABLE_CAST_CHECKS -DENABLE_REGEX -DG_DISABLE_SINGLE_INCLUDES -pthread -g -march=native -O3 -pipe -Wall -MT testingbase64.o -MD -MP -MF .deps/testingbase64.Tpo -c -o testingbase64.o testingbase64.c
  5. x86_64-pc-linux-gnu-gcc -DHAVE_CONFIG_H -I. -I..  -I.. -I../glib -I../gmodule -DG_DISABLE_CAST_CHECKS -DENABLE_REGEX -DG_DISABLE_SINGLE_INCLUDES -pthread -g -march=native -O3 -pipe -Wall -MT testgdate.o -MD -MP -MF .deps/testgdate.Tpo -c -o testgdate.o testgdate.c
  6. mv -f .deps/testingbase64.Tpo .deps/testingbase64.Po
  7. x86_64-pc-linux-gnu-gcc -DHAVE_CONFIG_H -I. -I..  -I.. -I../glib -I../gmodule -DG_DISABLE_CAST_CHECKS -DENABLE_REGEX -DG_DISABLE_SINGLE_INCLUDES -pthread -g -march=native -O3 -pipe -Wall -MT testgdateparser.o -MD -MP -MF .deps/testgdateparser.Tpo -c -o testgdateparser.o testgdateparser.c
  8. mv -f .deps/testgdateparser.Tpo .deps/testgdateparser.Po
  9. x86_64-pc-linux-gnu-gcc -DHAVE_CONFIG_H -I. -I..  -I.. -I../glib -I../gmodule -DG_DISABLE_CAST_CHECKS -DENABLE_REGEX -DG_DISABLE_SINGLE_INCLUDES -pthread -g -march=native -O3 -pipe -Wall -MT unicode-normalize.o -MD -MP -MF .deps/unicode-normalize.Tpo -c -o unicode-normalize.o unicode-normalize.c
  10. mv -f .deps/unicode-normalize.Tpo .deps/unicode-normalize.Po
  11. x86_64-pc-linux-gnu-gcc -DHAVE_CONFIG_H -I. -I..  -I.. -I../glib -I../gmodule -DG_DISABLE_CAST_CHECKS -DENABLE_REGEX -DG_DISABLE_SINGLE_INCLUDES -pthread -g -march=native -O3 -pipe -Wall -MT unicode-collate.o -MD -MP -MF .deps/unicode-collate.Tpo -c -o unicode-collate.o unicode-collate.c
  12. mv -f .deps/unicode-collate.Tpo .deps/unicode-collate.Po
  13. x86_64-pc-linux-gnu-gcc -DHAVE_CONFIG_H -I. -I..  -I.. -I../glib -I../gmodule -DG_DISABLE_CAST_CHECKS -DENABLE_REGEX -DG_DISABLE_SINGLE_INCLUDES -pthread -g -march=native -O3 -pipe -Wall -MT timeloop.o -MD -MP -MF .deps/timeloop.Tpo -c -o timeloop.o timeloop.c
  14. mv -f .deps/testglib.Tpo .deps/testglib.Po
  15. x86_64-pc-linux-gnu-gcc -DHAVE_CONFIG_H -I. -I..  -I.. -I../glib -I../gmodule -DG_DISABLE_CAST_CHECKS -DENABLE_REGEX -DG_DISABLE_SINGLE_INCLUDES -pthread -g -march=native -O3 -pipe -Wall -MT timeloop-closure.o -MD -MP -MF .deps/timeloop-closure.Tpo -c -o timeloop-closure.o timeloop-closure.c
  16. mv -f .deps/testgdate.Tpo .deps/testgdate.Po
  17. mv -f .deps/timeloop.Tpo .deps/timeloop.Po
  18. x86_64-pc-linux-gnu-gcc -DHAVE_CONFIG_H -I. -I..  -I.. -I../glib -I../gmodule -DG_DISABLE_CAST_CHECKS -DENABLE_REGEX -DG_DISABLE_SINGLE_INCLUDES -pthread -g -march=native -O3 -pipe -Wall -MT errorcheck-mutex-test.o -MD -MP -MF .deps/errorcheck-mutex-test.Tpo -c -o errorcheck-mutex-test.o errorcheck-mutex-test.c
  19. /bin/sh ../libtool --tag=CC   --mode=link x86_64-pc-linux-gnu-gcc -g -march=native -O3 -pipe -Wall -Wl,--export-dynamic -avoid-version -module  -rpath /usr/lib64 -Wl,-O1 -o libmoduletestplugin_a.la -rpath /usr/lib64 libmoduletestplugin_a.lo -ldl ../gmodule/libgmodule-2.0.la ../glib/libglib-2.0.la
  20. mv -f .deps/timeloop-closure.Tpo .deps/timeloop-closure.Po
  21. /bin/sh ../libtool --tag=CC   --mode=link x86_64-pc-linux-gnu-gcc -g -march=native -O3 -pipe -Wall -Wl,--export-dynamic -avoid-version -module  -rpath /usr/lib64 -Wl,-O1 -o libmoduletestplugin_b.la -rpath /usr/lib64 libmoduletestplugin_b.lo -ldl ../gmodule/libgmodule-2.0.la ../glib/libglib-2.0.la
  22. libtool: link: x86_64-pc-linux-gnu-gcc -shared  .libs/libmoduletestplugin_a.o   -Wl,-rpath -Wl,/var/tmp/portage/dev-libs/glib-2.18.4-r1/work/glib-2.18.4/gmodule/.libs -Wl,-rpath -Wl,/var/tmp/portage/dev-libs/glib-2.18.4-r1/work/glib-2.18.4/glib/.libs -L/var/tmp/portage/dev-libs/glib-2.18.4-r1/work/glib-2.18.4/glib/.libs ../gmodule/.libs/libgmodule-2.0.so /usr/bin /usr/sbin /bin /sbin -ldl /var/tmp/portage/dev-libs/glib-2.18.4-r1/work/glib-2.18.4/glib/.libs/libglib-2.0.so ../glib/.libs/libglib-2.0.so  -march=native -Wl,--export-dynamic -Wl,-O1   -Wl,-soname -Wl,libmoduletestplugin_a.so -o .libs/libmoduletestplugin_a.so
  23. mv -f .deps/errorcheck-mutex-test.Tpo .deps/errorcheck-mutex-test.Po
  24. /bin/sh ../libtool --tag=CC   --mode=link x86_64-pc-linux-gnu-gcc -g -march=native -O3 -pipe -Wall  -Wl,-O1 -o scannerapi scannerapi.o  ../glib/libglib-2.0.la  
  25. /usr/bin: file not recognized: Is a directory
  26. collect2: ld returned 1 exit status
  27. make[3]: *** [libmoduletestplugin_a.la] Error 1
  28. make[3]: *** Waiting for unfinished jobs....
  29. libtool: link: x86_64-pc-linux-gnu-gcc -g -march=native -O3 -pipe -Wall -Wl,-O1 -o .libs/scannerapi scannerapi.o  ../glib/.libs/libglib-2.0.so
  30. libtool: link: x86_64-pc-linux-gnu-gcc -shared  .libs/libmoduletestplugin_b.o   -Wl,-rpath -Wl,/var/tmp/portage/dev-libs/glib-2.18.4-r1/work/glib-2.18.4/gmodule/.libs -Wl,-rpath -Wl,/var/tmp/portage/dev-libs/glib-2.18.4-r1/work/glib-2.18.4/glib/.libs -L/var/tmp/portage/dev-libs/glib-2.18.4-r1/work/glib-2.18.4/glib/.libs ../gmodule/.libs/libgmodule-2.0.so /usr/bin /usr/sbin /bin /sbin -ldl /var/tmp/portage/dev-libs/glib-2.18.4-r1/work/glib-2.18.4/glib/.libs/libglib-2.0.so ../glib/.libs/libglib-2.0.so  -march=native -Wl,--export-dynamic -Wl,-O1   -Wl,-soname -Wl,libmoduletestplugin_b.so -o .libs/libmoduletestplugin_b.so
  31. /usr/bin: file not recognized: Is a directory
  32. collect2: ld returned 1 exit status
  33. make[3]: *** [libmoduletestplugin_b.la] Error 1
  34. make[3]: Leaving directory `/var/tmp/portage/dev-libs/glib-2.18.4-r1/work/glib-2.18.4/tests'
  35. make[2]: *** [all-recursive] Error 1
  36. make[2]: Leaving directory `/var/tmp/portage/dev-libs/glib-2.18.4-r1/work/glib-2.18.4/tests'
  37. make[1]: *** [all-recursive] Error 1
  38. make[1]: Leaving directory `/var/tmp/portage/dev-libs/glib-2.18.4-r1/work/glib-2.18.4'
  39. make: *** [all] Error 2
  40.  *
  41.  * ERROR: dev-libs/glib-2.18.4-r1 failed.
  42.  * Call stack:
  43.  *               ebuild.sh, line   49:  Called src_compile
  44.  *             environment, line 2897:  Called die
  45.  * The specific snippet of code:
  46.  *       emake || die "make failed"
  47.  *  The die message:
  48.  *   make failed
  49.  *
  50.  * If you need support, post the topmost build error, and the call stack if relevant.
  51.  * A complete build log is located at '/var/tmp/portage/dev-libs/glib-2.18.4-r1/temp/build.log'.
  52.  * The ebuild environment file is located at '/var/tmp/portage/dev-libs/glib-2.18.4-r1/temp/environment'.
  53.  *
  54.  
  55. >>> Failed to emerge dev-libs/glib-2.18.4-r1, Log file:
  56.  
  57. >>>  '/var/tmp/portage/dev-libs/glib-2.18.4-r1/temp/build.log'
  58.  
  59.  * Messages for package sys-devel/gcc-4.3.2-r3:
  60.  
  61.  * If you have issues with packages unable to locate libstdc++.la,
  62.  * then try running 'fix_libtool_files.sh' on the old gcc versions.
  63.  
  64.  * Messages for package dev-libs/glib-2.18.4-r1:
  65.  
  66.  *
  67.  * ERROR: dev-libs/glib-2.18.4-r1 failed.
  68.  * Call stack:
  69.  *               ebuild.sh, line   49:  Called src_compile
  70.  *             environment, line 2897:  Called die
  71.  * The specific snippet of code:
  72.  *       emake || die "make failed"
  73.  *  The die message:
  74.  *   make failed
  75.  *
  76.  * If you need support, post the topmost build error, and the call stack if relevant.
  77.  * A complete build log is located at '/var/tmp/portage/dev-libs/glib-2.18.4-r1/temp/build.log'.
  78.  * The ebuild environment file is located at '/var/tmp/portage/dev-libs/glib-2.18.4-r1/temp/environment'.
  79.  *
  80.  
  81.  * Regenerating GNU info directory index...
  82.  * Processed 8 info files.
  83.  
  84.  * IMPORTANT: 2 config files in '/etc' need updating.
  85.  * See the CONFIGURATION FILES section of the emerge
  86.  * man page to learn how to update config files.
  87.  
  88.  * IMPORTANT: 1 news items need reading for repository 'gentoo'.
  89.  * Use eselect news to read news items.
RAW Paste Data
We use cookies for various purposes including analytics. By continuing to use Pastebin, you agree to our use of cookies as described in the Cookies Policy. OK, I Understand
 
Top