MACourtney7

PCL - make output

Jan 13th, 2017
279
0
Never
Not a member of Pastebin yet? Sign Up, it unlocks many cool features!
text 0.53 KB | None | 0 0
  1. [ 50%] Building CXX object CMakeFiles/pcd_write_test.dir/pcd_write.cpp.o
  2. [100%] Linking CXX executable pcd_write_test
  3. /usr/bin/ld: cannot find -lvtkproj4
  4. collect2: error: ld returned 1 exit status
  5. CMakeFiles/pcd_write_test.dir/build.make:330: recipe for target 'pcd_write_test' failed
  6. make[2]: *** [pcd_write_test] Error 1
  7. CMakeFiles/Makefile2:67: recipe for target 'CMakeFiles/pcd_write_test.dir/all' failed
  8. make[1]: *** [CMakeFiles/pcd_write_test.dir/all] Error 2
  9. Makefile:83: recipe for target 'all' failed
  10. make: *** [all] Error 2
Advertisement
Add Comment
Please, Sign In to add comment