Guest User

Untitled

a guest
Dec 21st, 2012
296
Never
Not a member of Pastebin yet? Sign Up, it unlocks many cool features!
  1. | cc1plus: warning: include location "/usr/include" is unsafe for cross-compilation [-Wpoison-system-directories]
  2. | cc1plus: warning: include location "/usr/include" is unsafe for cross-compilation [-Wpoison-system-directories]
  3. | cc1plus: warning: include location "/usr/include" is unsafe for cross-compilation [-Wpoison-system-directories]
  4. | cc1plus: warning: include location "/usr/include" is unsafe for cross-compilation [-Wpoison-system-directories]
  5. | In file included from /usr/include/features.h:324:0,
  6. | from /media/OE/webos-ports-env/webos-ports/tmp-eglibc/sysroots/tuna/usr/include/sys/prctl.h:21,
  7. | from Src/base/BackupManager.cpp:21:
  8. | /media/OE/webos-ports-env/webos-ports/tmp-eglibc/sysroots/tuna/usr/include/bits/predefs.h:20:3: error: #error "Never use <bits/predefs.h> directly; include <stdc-predef.h> instead."In file included from /usr/include/features.h:324:0,
  9. | from /usr/include/stdio.h:28,
  10. | from Src/base/application/ApplicationDescription.cpp:21:
  11. | /media/OE/webos-ports-env/webos-ports/tmp-eglibc/sysroots/tuna/usr/include/bits/predefs.h:20:3: error: #error "Never use <bits/predefs.h> directly; include <stdc-predef.h> instead."In file included from /usr/include/features.h:324:0,
  12. | from /media/OE/webos-ports-env/webos-ports/tmp-eglibc/sysroots/tuna/usr/include/c++/arm-webos-linux-gnueabi/bits/os_defines.h:40,
  13. | from /media/OE/webos-ports-env/webos-ports/tmp-eglibc/sysroots/tuna/usr/include/c++/arm-webos-linux-gnueabi/bits/c++config.h:414,
  14. | from /media/OE/webos-ports-env/webos-ports/tmp-eglibc/sysroots/tuna/usr/include/c++/string:40,
  15. | from /media/OE/webos-ports-env/webos-ports/tmp-eglibc/sysroots/tuna/usr/include/sysmgr-ipc/BannerMessageEvent.h:21,
  16. | from Src/lunaui/notifications/BannerMessageEventFactory.h:27,
  17. | from Src/lunaui/notifications/BannerMessageEventFactory.cpp:24:
  18. | /media/OE/webos-ports-env/webos-ports/tmp-eglibc/sysroots/tuna/usr/include/bits/predefs.h:20:3: error: #error "Never use <bits/predefs.h> directly; include <stdc-predef.h> instead."In file included from /usr/include/features.h:324:0,
  19. | from /media/OE/webos-ports-env/webos-ports/tmp-eglibc/sysroots/tuna/usr/include/c++/arm-webos-linux-gnueabi/bits/os_defines.h:40,
  20. | from /media/OE/webos-ports-env/webos-ports/tmp-eglibc/sysroots/tuna/usr/include/c++/arm-webos-linux-gnueabi/bits/c++config.h:414,
  21. | from /media/OE/webos-ports-env/webos-ports/tmp-eglibc/sysroots/tuna/usr/include/c++/bits/stl_algobase.h:60,
  22. | from /media/OE/webos-ports-env/webos-ports/tmp-eglibc/sysroots/tuna/usr/include/c++/list:61,
  23. | from Src/webbase/WindowedWebApp.h:27,
  24. | from Src/lunaui/notifications/AlertWebApp.h:27,
  25. | from Src/lunaui/notifications/AlertWebApp.cpp:24:
  26. | /media/OE/webos-ports-env/webos-ports/tmp-eglibc/sysroots/tuna/usr/include/bits/predefs.h:20:3: error: #error "Never use <bits/predefs.h> directly; include <stdc-predef.h> instead."
  27. |
  28. |
  29. |
  30. | make: *** [release-tuna/.obj/ApplicationDescription.o] Error 1
  31. | make: *** Waiting for unfinished jobs....
  32. | make: *** [release-tuna/.obj/BannerMessageEventFactory.o] Error 1
  33. | make: *** [release-tuna/.obj/BackupManager.o] Error 1
  34. | make: *** [release-tuna/.obj/AlertWebApp.o] Error 1
  35. | ERROR: oe_runmake failed
  36. | ERROR: Function failed: do_compile (see /media/OE/webos-ports-env/webos-ports/tmp-eglibc/work/tuna-webos-linux-gnueabi/webappmanager-gitr1+32bdd6045e57f81c5130419d193d22f504b667ab+1.0-r3+wop+gitr1+32bdd6045e57f81c5130419d193d22f504b667ab/temp/log.do_compile.9163 for further information)
  37. ERROR: Task 3533 (/media/OE/webos-ports-env/webos-ports/meta-webos/recipes-webos/webappmanager/webappmanager.bb, do_compile) failed with exit code '1'
  38. NOTE: Tasks Summary: Attempted 4964 tasks of which 4950 didn't need to be rerun and 1 failed.
  39. Waiting for 0 running tasks to finish:
  40.  
  41. Summary: 1 task failed:
  42. /media/OE/webos-ports-env/webos-ports/meta-webos/recipes-webos/webappmanager/webappmanager.bb, do_compile
  43. Summary: There was 1 ERROR message shown, returning a non-zero exit code.
RAW Paste Data