shayaknyc

Untitled

Aug 7th, 2025
249
0
Never
Not a member of Pastebin yet? Sign Up, it unlocks many cool features!
text 12.70 KB | Source Code | 0 0
  1. [ 17%] Performing configure step for 'whispercppcublas'
  2. CMake Deprecation Warning at CMakeLists.txt:1 (cmake_minimum_required):
  3. Compatibility with CMake < 3.10 will be removed from a future version of
  4. CMake.
  5.  
  6. Update the VERSION argument <min> value. Or, use the <min>...<max> syntax
  7. to tell CMake that the project requires at least <min> but has been updated
  8. to work with policies introduced by <max> or earlier.
  9.  
  10.  
  11. -- OpenMP found
  12. -- CUDA found
  13. -- Using CUDA architectures: native
  14. CMake Error at /usr/share/cmake/Modules/CMakeDetermineCompilerId.cmake:909 (message):
  15. Compiling the CUDA compiler identification source file
  16. "CMakeCUDACompilerId.cu" failed.
  17.  
  18. Compiler: /opt/cuda/bin/nvcc
  19.  
  20. Build flags:
  21.  
  22. Id flags: --keep;--keep-dir;tmp -v
  23.  
  24.  
  25.  
  26. The output was:
  27.  
  28. 2
  29.  
  30. #$ NVCC_APPEND_FLAGS="-std=c++17 --compress-mode=size --split-compile=0
  31. -Wno-deprecated-gpu-targets"
  32.  
  33. #$ _NVVM_BRANCH_=nvvm
  34.  
  35. #$ _SPACE_=
  36.  
  37. #$ _CUDART_=cudart
  38.  
  39. #$ _HERE_=/opt/cuda/bin
  40.  
  41. #$ _THERE_=/opt/cuda/bin
  42.  
  43. #$ _TARGET_SIZE_=
  44.  
  45. #$ _TARGET_DIR_=
  46.  
  47. #$ _TARGET_DIR_=targets/x86_64-linux
  48.  
  49. #$ TOP=/opt/cuda/bin/..
  50.  
  51. #$ CICC_PATH=/opt/cuda/bin/../nvvm/bin
  52.  
  53. #$ NVVMIR_LIBRARY_DIR=/opt/cuda/bin/../nvvm/libdevice
  54.  
  55. #$ LD_LIBRARY_PATH=/opt/cuda/bin/../lib:
  56.  
  57. #$
  58. PATH=/opt/cuda/bin/../nvvm/bin:/opt/cuda/bin:/home/shaya/.local/bin:/opt/cuda/bin:/usr/local/sbin:/usr/local/bin:/usr/bin:/usr/bin/site_perl:/usr/bin/vendor_perl:/usr/bin/core_perl
  59.  
  60. #$ INCLUDES="-I/opt/cuda/bin/../targets/x86_64-linux/include"
  61.  
  62. #$ LIBRARIES= "-L/opt/cuda/bin/../targets/x86_64-linux/lib/stubs"
  63. "-L/opt/cuda/bin/../targets/x86_64-linux/lib"
  64.  
  65. #$ CUDAFE_FLAGS=
  66.  
  67. #$ PTXAS_FLAGS=
  68.  
  69. #$ rm tmp/a_dlink.reg.c
  70.  
  71. #$ gcc -std=c++17 -D__CUDA_ARCH_LIST__=520 -D__NV_LEGACY_LAUNCH -E -x c++
  72. -D__CUDACC__ -D__NVCC__ "-I/opt/cuda/bin/../targets/x86_64-linux/include"
  73. -D__CUDACC_VER_MAJOR__=12 -D__CUDACC_VER_MINOR__=9
  74. -D__CUDACC_VER_BUILD__=86 -D__CUDA_API_VER_MAJOR__=12
  75. -D__CUDA_API_VER_MINOR__=9 -D__NVCC_DIAG_PRAGMA_SUPPORT__=1
  76. -D__CUDACC_DEVICE_ATOMIC_BUILTINS__=1 -include "cuda_runtime.h" -m64
  77. "CMakeCUDACompilerId.cu" -o "tmp/CMakeCUDACompilerId.cpp4.ii"
  78.  
  79. #$ cudafe++ --c++17 --gnu_version=150101 --display_error_number
  80. --orig_src_file_name "CMakeCUDACompilerId.cu" --orig_src_path_name
  81. "/home/shaya/.cache/paru/clone/dsnote/src/dsnote-4.8.2/build/external/whispercppcublas/CMakeFiles/4.0.3-dirty/CompilerIdCUDA/CMakeCUDACompilerId.cu"
  82. --allow_managed --m64 --parse_templates --gen_c_file_name
  83. "tmp/CMakeCUDACompilerId.cudafe1.cpp" --stub_file_name
  84. "CMakeCUDACompilerId.cudafe1.stub.c" --gen_module_id_file
  85. --module_id_file_name "tmp/CMakeCUDACompilerId.module_id"
  86. "tmp/CMakeCUDACompilerId.cpp4.ii"
  87.  
  88. /usr/include/c++/15.1.1/type_traits(554): error: type name is not allowed
  89.  
  90. : public __bool_constant<__is_pointer(_Tp)>
  91. ^
  92.  
  93.  
  94.  
  95. /usr/include/c++/15.1.1/type_traits(554): error: identifier "__is_pointer"
  96. is undefined
  97.  
  98. : public __bool_constant<__is_pointer(_Tp)>
  99. ^
  100.  
  101.  
  102.  
  103. /usr/include/c++/15.1.1/type_traits(876): error: type name is not allowed
  104.  
  105. : public __bool_constant<__is_volatile(_Tp)>
  106. ^
  107.  
  108.  
  109.  
  110. /usr/include/c++/15.1.1/type_traits(876): error: identifier "__is_volatile"
  111. is undefined
  112.  
  113. : public __bool_constant<__is_volatile(_Tp)>
  114. ^
  115.  
  116.  
  117.  
  118. /usr/include/c++/15.1.1/type_traits(1491): error: type name is not allowed
  119.  
  120. : public integral_constant<std::size_t, __array_rank(_Tp)> { };
  121. ^
  122.  
  123.  
  124.  
  125. /usr/include/c++/15.1.1/type_traits(1491): error: identifier "__array_rank"
  126. is undefined
  127.  
  128. : public integral_constant<std::size_t, __array_rank(_Tp)> { };
  129. ^
  130.  
  131.  
  132.  
  133. /usr/include/c++/15.1.1/type_traits(1843): error: incomplete type
  134. "std::__cv_selector<std::__make_unsigned_selector<wchar_t, false,
  135. true>::__unsigned_type, false, <error-constant>>" (aka
  136. "std::__cv_selector<unsigned int, false, <error-constant>>") is not allowed
  137.  
  138. using __type = typename __match::__type;
  139. ^
  140. detected during:
  141. instantiation of class "std::__match_cv_qualifiers<_Qualified, _Unqualified, _IsConst, _IsVol> [with _Qualified=wchar_t, _Unqualified=unsigned int, _IsConst=false, _IsVol=<error-constant>]" at line 1952
  142. instantiation of class "std::__make_unsigned_selector<_Tp, false, true> [with _Tp=wchar_t]" at line 1963
  143.  
  144.  
  145.  
  146. /usr/include/c++/15.1.1/type_traits(1843): error: incomplete type
  147. "std::__cv_selector<std::__make_unsigned_selector<char16_t, false,
  148. true>::__unsigned_type, false, <error-constant>>" (aka
  149. "std::__cv_selector<unsigned short, false, <error-constant>>") is not
  150. allowed
  151.  
  152. using __type = typename __match::__type;
  153. ^
  154. detected during:
  155. instantiation of class "std::__match_cv_qualifiers<_Qualified, _Unqualified, _IsConst, _IsVol> [with _Qualified=char16_t, _Unqualified=unsigned short, _IsConst=false, _IsVol=<error-constant>]" at line 1952
  156. instantiation of class "std::__make_unsigned_selector<_Tp, false, true> [with _Tp=char16_t]" at line 1979
  157.  
  158.  
  159.  
  160. /usr/include/c++/15.1.1/type_traits(1843): error: incomplete type
  161. "std::__cv_selector<std::__make_unsigned_selector<wchar_t, false,
  162. true>::__unsigned_type, false, <error-constant>>" (aka
  163. "std::__cv_selector<unsigned int, false, <error-constant>>") is not allowed
  164.  
  165. using __type = typename __match::__type;
  166. ^
  167. detected during:
  168. instantiation of class "std::__match_cv_qualifiers<_Qualified, _Unqualified, _IsConst, _IsVol> [with _Qualified=char32_t, _Unqualified=unsigned int, _IsConst=false, _IsVol=<error-constant>]" at line 1952
  169. instantiation of class "std::__make_unsigned_selector<_Tp, false, true> [with _Tp=char32_t]" at line 1986
  170.  
  171.  
  172.  
  173. /usr/include/c++/15.1.1/type_traits(1843): error: incomplete type
  174. "std::__cv_selector<std::__make_unsigned_selector<wchar_t, true,
  175. false>::__unsigned_type, false, <error-constant>>" is not allowed
  176.  
  177. using __type = typename __match::__type;
  178. ^
  179. detected during:
  180. instantiation of class "std::__match_cv_qualifiers<_Qualified, _Unqualified, _IsConst, _IsVol> [with _Qualified=wchar_t, _Unqualified=<error-type>, _IsConst=false, _IsVol=<error-constant>]" at line 1914
  181. instantiation of class "std::__make_unsigned_selector<_Tp, true, false> [with _Tp=wchar_t]" at line 2081
  182. instantiation of class "std::__make_signed_selector<_Tp, false, true> [with _Tp=wchar_t]" at line 2095
  183.  
  184.  
  185.  
  186. /usr/include/c++/15.1.1/type_traits(2084): error: incomplete type
  187. "std::__make_signed_selector<std::__make_signed_selector<wchar_t, false,
  188. true>::__unsigned_type, false, <error-constant>>" is not allowed
  189.  
  190. using __type = typename __make_signed_selector<__unsigned_type>::__type;
  191. ^
  192. detected during instantiation of class "std::__make_signed_selector<_Tp, false, true> [with _Tp=wchar_t]" at line 2095
  193.  
  194.  
  195.  
  196. /usr/include/c++/15.1.1/type_traits(1843): error: incomplete type
  197. "std::__cv_selector<std::__make_unsigned_selector<wchar_t, true,
  198. false>::__unsigned_type, false, <error-constant>>" is not allowed
  199.  
  200. using __type = typename __match::__type;
  201. ^
  202. detected during:
  203. instantiation of class "std::__match_cv_qualifiers<_Qualified, _Unqualified, _IsConst, _IsVol> [with _Qualified=char16_t, _Unqualified=<error-type>, _IsConst=false, _IsVol=<error-constant>]" at line 1914
  204. instantiation of class "std::__make_unsigned_selector<_Tp, true, false> [with _Tp=char16_t]" at line 2081
  205. instantiation of class "std::__make_signed_selector<_Tp, false, true> [with _Tp=char16_t]" at line 2111
  206.  
  207.  
  208.  
  209. /usr/include/c++/15.1.1/type_traits(2084): error: incomplete type
  210. "std::__make_signed_selector<std::__make_signed_selector<wchar_t, false,
  211. true>::__unsigned_type, false, <error-constant>>" is not allowed
  212.  
  213. using __type = typename __make_signed_selector<__unsigned_type>::__type;
  214. ^
  215. detected during instantiation of class "std::__make_signed_selector<_Tp, false, true> [with _Tp=char16_t]" at line 2111
  216.  
  217.  
  218.  
  219. /usr/include/c++/15.1.1/type_traits(1843): error: incomplete type
  220. "std::__cv_selector<std::__make_unsigned_selector<wchar_t, true,
  221. false>::__unsigned_type, false, <error-constant>>" is not allowed
  222.  
  223. using __type = typename __match::__type;
  224. ^
  225. detected during:
  226. instantiation of class "std::__match_cv_qualifiers<_Qualified, _Unqualified, _IsConst, _IsVol> [with _Qualified=char32_t, _Unqualified=<error-type>, _IsConst=false, _IsVol=<error-constant>]" at line 1914
  227. instantiation of class "std::__make_unsigned_selector<_Tp, true, false> [with _Tp=char32_t]" at line 2081
  228. instantiation of class "std::__make_signed_selector<_Tp, false, true> [with _Tp=char32_t]" at line 2118
  229.  
  230.  
  231.  
  232. /usr/include/c++/15.1.1/type_traits(2084): error: incomplete type
  233. "std::__make_signed_selector<std::__make_signed_selector<wchar_t, false,
  234. true>::__unsigned_type, false, <error-constant>>" is not allowed
  235.  
  236. using __type = typename __make_signed_selector<__unsigned_type>::__type;
  237. ^
  238. detected during instantiation of class "std::__make_signed_selector<_Tp, false, true> [with _Tp=char32_t]" at line 2118
  239.  
  240.  
  241.  
  242. /usr/include/c++/15.1.1/type_traits(3302): error: type name is not allowed
  243.  
  244. : public __bool_constant<__is_invocable(_Fn, _ArgTypes...)>
  245. ^
  246.  
  247.  
  248.  
  249. /usr/include/c++/15.1.1/type_traits(3302): error: type name is not allowed
  250.  
  251. : public __bool_constant<__is_invocable(_Fn, _ArgTypes...)>
  252. ^
  253.  
  254.  
  255.  
  256. /usr/include/c++/15.1.1/type_traits(3332): error: type name is not allowed
  257.  
  258. : public __bool_constant<__is_nothrow_invocable(_Fn, _ArgTypes...)>
  259. ^
  260.  
  261.  
  262.  
  263. /usr/include/c++/15.1.1/type_traits(3332): error: type name is not allowed
  264.  
  265. : public __bool_constant<__is_nothrow_invocable(_Fn, _ArgTypes...)>
  266. ^
  267.  
  268.  
  269.  
  270. /usr/include/c++/15.1.1/type_traits(3408): error: type name is not allowed
  271.  
  272. inline constexpr bool is_pointer_v = __is_pointer(_Tp);
  273. ^
  274.  
  275.  
  276.  
  277. /usr/include/c++/15.1.1/type_traits(3521): error: type name is not allowed
  278.  
  279. inline constexpr bool is_volatile_v = __is_volatile(_Tp);
  280. ^
  281.  
  282.  
  283.  
  284. /usr/include/c++/15.1.1/type_traits(3663): error: type name is not allowed
  285.  
  286. inline constexpr size_t rank_v = __array_rank(_Tp);
  287. ^
  288.  
  289.  
  290.  
  291. /usr/include/c++/15.1.1/bits/stl_algobase.h(1239): error: type name is not
  292. allowed
  293.  
  294. || __is_pointer(_ValueType1)
  295. ^
  296.  
  297.  
  298.  
  299. /usr/include/c++/15.1.1/bits/stl_algobase.h(1412): error: type name is not
  300. allowed
  301.  
  302. && __is_pointer(_II1) && __is_pointer(_II2)
  303. ^
  304.  
  305.  
  306.  
  307. /usr/include/c++/15.1.1/bits/stl_algobase.h(1412): error: type name is not
  308. allowed
  309.  
  310. && __is_pointer(_II1) && __is_pointer(_II2)
  311. ^
  312.  
  313.  
  314.  
  315. 25 errors detected in the compilation of "CMakeCUDACompilerId.cu".
  316.  
  317. # --error 0x2 --
  318.  
  319.  
  320.  
  321.  
  322.  
  323. Call Stack (most recent call first):
  324. /usr/share/cmake/Modules/CMakeDetermineCompilerId.cmake:8 (CMAKE_DETERMINE_COMPILER_ID_BUILD)
  325. /usr/share/cmake/Modules/CMakeDetermineCompilerId.cmake:53 (__determine_compiler_id_test)
  326. /usr/share/cmake/Modules/CMakeDetermineCUDACompiler.cmake:139 (CMAKE_DETERMINE_COMPILER_ID)
  327. ggml/src/CMakeLists.txt:302 (enable_language)
  328.  
  329.  
  330. -- Configuring incomplete, errors occurred!
  331. make[2]: *** [CMakeFiles/whispercppcublas.dir/build.make:92: whispercppcublas-prefix/src/whispercppcublas-stamp/whispercppcublas-configure] Error 1
  332. make[1]: *** [CMakeFiles/Makefile2:507: CMakeFiles/whispercppcublas.dir/all] Error 2
  333. make: *** [Makefile:136: all] Error 2
  334. ==> ERROR: A failure occurred in build().
  335. Aborting...
  336. error: failed to build 'dsnote-4.8.2-1':
  337. error: packages failed to build: dsnote-4.8.2-1
Advertisement
Add Comment
Please, Sign In to add comment