Guest User

Untitled

a guest
Apr 12th, 2019
149
Never
Not a member of Pastebin yet? Sign Up, it unlocks many cool features!
  1.  * Package: x11-libs/vte-0.54.4
  2.  * Repository: dantrell-gnome-3-30
  3.  * Maintainer: gnome@gentoo.org
  4.  * USE: abi_x86_64 amd64 crypt elibc_glibc glade introspection kernel_linux userland_GNU vala
  5.  * FEATURES: network-sandbox preserve-libs sandbox userpriv usersandbox
  6.  * Package: x11-libs/vte-0.54.4
  7.  * Repository: dantrell-gnome-3-30
  8.  * Maintainer: gnome@gentoo.org
  9.  * USE: abi_x86_64 amd64 crypt elibc_glibc glade introspection kernel_linux userland_GNU vala
  10.  * FEATURES: network-sandbox preserve-libs sandbox userpriv usersandbox
  11. >>> Unpacking source...
  12. >>> Unpacking vte-0.54.4.tar.xz to /var/tmp/portage/x11-libs/vte-0.54.4/work
  13. >>> Source unpacked in /var/tmp/portage/x11-libs/vte-0.54.4/work
  14. >>> Preparing source in /var/tmp/portage/x11-libs/vte-0.54.4/work/vte-0.54.4 ...
  15. * Running eautoreconf in '/var/tmp/portage/x11-libs/vte-0.54.4/work/vte-0.54.4' ...
  16. * Running glib-gettextize --copy --force ...
  17.  [ ok ]
  18. * Running intltoolize --automake --copy --force ...
  19.  [ ok ]
  20. * Running gtkdocize --copy ...
  21.  [ ok ]
  22. * Running libtoolize --install --copy --force --automake ...
  23.  [ ok ]
  24. * Running aclocal -I m4 ...
  25.  [ ok ]
  26. * Running autoconf --force ...
  27.  [ ok ]
  28. * Running autoheader ...
  29.  [ ok ]
  30. * Running automake --add-missing --copy --foreign --force-missing ...
  31.  [ ok ]
  32. * Running elibtoolize in: vte-0.54.4/
  33. * Applying portage/1.2.0 patch ...
  34. * Applying sed/1.5.6 patch ...
  35. * Applying as-needed/2.4.3 patch ...
  36. * Disabling deprecation warnings ...
  37.  [ ok ]
  38. >>> Source prepared.
  39. >>> Configuring source in /var/tmp/portage/x11-libs/vte-0.54.4/work/vte-0.54.4 ...
  40. * econf: updating vte-0.54.4/config.sub with /usr/share/gnuconfig/config.sub
  41. * econf: updating vte-0.54.4/config.guess with /usr/share/gnuconfig/config.guess
  42. ./configure --prefix=/usr --build=x86_64-pc-linux-gnu --host=x86_64-pc-linux-gnu --mandir=/usr/share/man --infodir=/usr/share/info --datadir=/usr/share --sysconfdir=/etc --localstatedir=/var/lib --disable-dependency-tracking --disable-silent-rules --docdir=/usr/share/doc/vte-0.54.4 --htmldir=/usr/share/doc/vte-0.54.4/html --libdir=/usr/lib64 --disable-gtk-doc --disable-maintainer-mode --disable-static --with-gtk=3.0 --with-iconv --disable-debug --enable-glade-catalogue --with-gnutls --enable-introspection --enable-vala
  43. checking for a BSD-compatible install... /usr/lib/portage/python3.6/ebuild-helpers/xattr/install -c
  44. checking whether build environment is sane... yes
  45. checking for a thread-safe mkdir -p... /bin/mkdir -p
  46. checking for gawk... gawk
  47. checking whether make sets $(MAKE)... yes
  48. checking whether make supports nested variables... yes
  49. checking whether make supports nested variables... (cached) yes
  50. checking whether to enable maintainer-specific portions of Makefiles... no
  51. checking which gtk+ version to compile against... 3.0
  52. checking for x86_64-pc-linux-gnu-pkg-config... /usr/bin/x86_64-pc-linux-gnu-pkg-config
  53. checking pkg-config is at least version 0.9.0... yes
  54. checking for x86_64-pc-linux-gnu-gcc... x86_64-pc-linux-gnu-gcc
  55. checking whether the C compiler works... yes
  56. checking for C compiler default output file name... a.out
  57. checking for suffix of executables...
  58. checking whether we are cross compiling... no
  59. checking for suffix of object files... o
  60. checking whether we are using the GNU C compiler... yes
  61. checking whether x86_64-pc-linux-gnu-gcc accepts -g... yes
  62. checking for x86_64-pc-linux-gnu-gcc option to accept ISO C89... none needed
  63. checking whether x86_64-pc-linux-gnu-gcc understands -c and -o together... yes
  64. checking whether make supports the include directive... yes (GNU style)
  65. checking dependency style of x86_64-pc-linux-gnu-gcc... none
  66. checking for x86_64-pc-linux-gnu-g++... x86_64-pc-linux-gnu-g++
  67. checking whether we are using the GNU C++ compiler... yes
  68. checking whether x86_64-pc-linux-gnu-g++ accepts -g... yes
  69. checking dependency style of x86_64-pc-linux-gnu-g++... none
  70. checking how to run the C preprocessor... x86_64-pc-linux-gnu-gcc -E
  71. checking for grep that handles long lines and -e... /bin/grep
  72. checking for egrep... /bin/grep -E
  73. checking for ANSI C header files... yes
  74. checking for sys/types.h... yes
  75. checking for sys/stat.h... yes
  76. checking for stdlib.h... yes
  77. checking for string.h... yes
  78. checking for memory.h... yes
  79. checking for strings.h... yes
  80. checking for inttypes.h... yes
  81. checking for stdint.h... yes
  82. checking for unistd.h... yes
  83. checking minix/config.h usability... no
  84. checking minix/config.h presence... no
  85. checking for minix/config.h... no
  86. checking whether it is safe to define __EXTENSIONS__... yes
  87. checking for ANSI C header files... (cached) yes
  88. checking for a sed that does not truncate output... /bin/sed
  89. checking whether x86_64-pc-linux-gnu-g++ supports C++14 features by default... yes
  90. checking for special C compiler options needed for large files... no
  91. checking for _FILE_OFFSET_BITS value needed for large files... no
  92. checking build system type... x86_64-pc-linux-gnu
  93. checking host system type... x86_64-pc-linux-gnu
  94. checking how to print strings... printf
  95. checking for a sed that does not truncate output... (cached) /bin/sed
  96. checking for fgrep... /bin/grep -F
  97. checking for ld used by x86_64-pc-linux-gnu-gcc... /usr/x86_64-pc-linux-gnu/bin/ld
  98. checking if the linker (/usr/x86_64-pc-linux-gnu/bin/ld) is GNU ld... yes
  99. checking for BSD- or MS-compatible name lister (nm)... /usr/bin/x86_64-pc-linux-gnu-nm -B
  100. checking the name lister (/usr/bin/x86_64-pc-linux-gnu-nm -B) interface... BSD nm
  101. checking whether ln -s works... yes
  102. checking the maximum length of command line arguments... 1572864
  103. checking how to convert x86_64-pc-linux-gnu file names to x86_64-pc-linux-gnu format... func_convert_file_noop
  104. checking how to convert x86_64-pc-linux-gnu file names to toolchain format... func_convert_file_noop
  105. checking for /usr/x86_64-pc-linux-gnu/bin/ld option to reload object files... -r
  106. checking for x86_64-pc-linux-gnu-objdump... x86_64-pc-linux-gnu-objdump
  107. checking how to recognize dependent libraries... pass_all
  108. checking for x86_64-pc-linux-gnu-dlltool... no
  109. checking for dlltool... no
  110. checking how to associate runtime and link libraries... printf %s\n
  111. checking for x86_64-pc-linux-gnu-ar... x86_64-pc-linux-gnu-ar
  112. checking for archiver @FILE support... @
  113. checking for x86_64-pc-linux-gnu-strip... x86_64-pc-linux-gnu-strip
  114. checking for x86_64-pc-linux-gnu-ranlib... x86_64-pc-linux-gnu-ranlib
  115. checking command to parse /usr/bin/x86_64-pc-linux-gnu-nm -B output from x86_64-pc-linux-gnu-gcc object... ok
  116. checking for sysroot... no
  117. checking for a working dd... /bin/dd
  118. checking how to truncate binary pipes... /bin/dd bs=4096 count=1
  119. checking for x86_64-pc-linux-gnu-mt... no
  120. checking for mt... no
  121. checking if : is a manifest tool... no
  122. checking for dlfcn.h... yes
  123. checking for objdir... .libs
  124. checking if x86_64-pc-linux-gnu-gcc supports -fno-rtti -fno-exceptions... no
  125. checking for x86_64-pc-linux-gnu-gcc option to produce PIC... -fPIC -DPIC
  126. checking if x86_64-pc-linux-gnu-gcc PIC flag -fPIC -DPIC works... yes
  127. checking if x86_64-pc-linux-gnu-gcc static flag -static works... yes
  128. checking if x86_64-pc-linux-gnu-gcc supports -c -o file.o... yes
  129. checking if x86_64-pc-linux-gnu-gcc supports -c -o file.o... (cached) yes
  130. checking whether the x86_64-pc-linux-gnu-gcc linker (/usr/x86_64-pc-linux-gnu/bin/ld -m elf_x86_64) supports shared libraries... yes
  131. checking whether -lc should be explicitly linked in... no
  132. checking dynamic linker characteristics... GNU/Linux ld.so
  133. checking how to hardcode library paths into programs... immediate
  134. checking whether stripping libraries is possible... yes
  135. checking if libtool supports shared libraries... yes
  136. checking whether to build shared libraries... yes
  137. checking whether to build static libraries... no
  138. checking how to run the C++ preprocessor... x86_64-pc-linux-gnu-g++ -E
  139. checking for ld used by x86_64-pc-linux-gnu-g++... /usr/x86_64-pc-linux-gnu/bin/ld -m elf_x86_64
  140. checking if the linker (/usr/x86_64-pc-linux-gnu/bin/ld -m elf_x86_64) is GNU ld... yes
  141. checking whether the x86_64-pc-linux-gnu-g++ linker (/usr/x86_64-pc-linux-gnu/bin/ld -m elf_x86_64) supports shared libraries... yes
  142. checking for x86_64-pc-linux-gnu-g++ option to produce PIC... -fPIC -DPIC
  143. checking if x86_64-pc-linux-gnu-g++ PIC flag -fPIC -DPIC works... yes
  144. checking if x86_64-pc-linux-gnu-g++ static flag -static works... yes
  145. checking if x86_64-pc-linux-gnu-g++ supports -c -o file.o... yes
  146. checking if x86_64-pc-linux-gnu-g++ supports -c -o file.o... (cached) yes
  147. checking whether the x86_64-pc-linux-gnu-g++ linker (/usr/x86_64-pc-linux-gnu/bin/ld -m elf_x86_64) supports shared libraries... yes
  148. checking dynamic linker characteristics... (cached) GNU/Linux ld.so
  149. checking how to hardcode library paths into programs... immediate
  150. checking whether NLS is requested... yes
  151. checking for intltool >= 0.35.0... 0.51.0 found
  152. checking for intltool-update... /usr/bin/intltool-update
  153. checking for intltool-merge... /usr/bin/intltool-merge
  154. checking for intltool-extract... /usr/bin/intltool-extract
  155. checking for xgettext... /usr/bin/xgettext
  156. checking for msgmerge... /usr/bin/msgmerge
  157. checking for msgfmt... /usr/bin/msgfmt
  158. checking for gmsgfmt... /usr/bin/gmsgfmt
  159. checking for perl... /usr/bin/perl
  160. checking for perl >= 5.8.1... 5.26.2
  161. checking for XML::Parser... ok
  162. checking locale.h usability... yes
  163. checking locale.h presence... yes
  164. checking for locale.h... yes
  165. checking for LC_MESSAGES... yes
  166. checking for CFPreferencesCopyAppValue... no
  167. checking for CFLocaleCopyCurrent... no
  168. checking libintl.h usability... yes
  169. checking libintl.h presence... yes
  170. checking for libintl.h... yes
  171. checking for ngettext in libc... yes
  172. checking for dgettext in libc... yes
  173. checking for bind_textdomain_codeset... yes
  174. checking for msgfmt... (cached) /usr/bin/msgfmt
  175. checking for dcgettext... yes
  176. checking if msgfmt accepts -c... yes
  177. checking for gmsgfmt... (cached) /usr/bin/gmsgfmt
  178. checking for xgettext... (cached) /usr/bin/xgettext
  179. checking whether bind_textdomain_codeset is declared... yes
  180. checking if x86_64-pc-linux-gnu-gcc supports flag -pipe in envvar CFLAGS... yes
  181. checking if x86_64-pc-linux-gnu-gcc supports flag -Wall in envvar CFLAGS... yes
  182. checking if x86_64-pc-linux-gnu-gcc supports flag -Wcast-align in envvar CFLAGS... yes
  183. checking if x86_64-pc-linux-gnu-gcc supports flag -Wendif-labels in envvar CFLAGS... yes
  184. checking if x86_64-pc-linux-gnu-gcc supports flag -Werror=declaration-after-statement in envvar CFLAGS... yes
  185. checking if x86_64-pc-linux-gnu-gcc supports flag -Wformat=2 -Werror=format-nonliteral -Werror=format-security in envvar CFLAGS... yes
  186. checking if x86_64-pc-linux-gnu-gcc supports flag -Werror=implicit-function-declaration in envvar CFLAGS... yes
  187. checking if x86_64-pc-linux-gnu-gcc supports flag -Werror=init-self in envvar CFLAGS... yes
  188. checking if x86_64-pc-linux-gnu-gcc supports flag -Werror=missing-include-dirs in envvar CFLAGS... yes
  189. checking if x86_64-pc-linux-gnu-gcc supports flag -Werror=missing-prototypes in envvar CFLAGS... yes
  190. checking if x86_64-pc-linux-gnu-gcc supports flag -Werror=pointer-arith in envvar CFLAGS... yes
  191. checking if x86_64-pc-linux-gnu-gcc supports flag -Wextra in envvar CFLAGS... yes
  192. checking if x86_64-pc-linux-gnu-gcc supports flag -Wfloat-equal in envvar CFLAGS... yes
  193. checking if x86_64-pc-linux-gnu-gcc supports flag -Wlogical-op in envvar CFLAGS... yes
  194. checking if x86_64-pc-linux-gnu-gcc supports flag -Wmisleading-indentation in envvar CFLAGS... yes
  195. checking if x86_64-pc-linux-gnu-gcc supports flag -Wmissing-declarations in envvar CFLAGS... yes
  196. checking if x86_64-pc-linux-gnu-gcc supports flag -Wmissing-include-dirs in envvar CFLAGS... yes
  197. checking if x86_64-pc-linux-gnu-gcc supports flag -Wmissing-format-attribute in envvar CFLAGS... yes
  198. checking if x86_64-pc-linux-gnu-gcc supports flag -Wmissing-noreturn in envvar CFLAGS... yes
  199. checking if x86_64-pc-linux-gnu-gcc supports flag -Wno-missing-field-initializers in envvar CFLAGS... yes
  200. checking if x86_64-pc-linux-gnu-gcc supports flag -Wno-switch-enum in envvar CFLAGS... yes
  201. checking if x86_64-pc-linux-gnu-gcc supports flag -Wno-unused-parameter in envvar CFLAGS... yes
  202. checking if x86_64-pc-linux-gnu-gcc supports flag -Wno-packed in envvar CFLAGS... yes
  203. checking if x86_64-pc-linux-gnu-gcc supports flag -Wshadow in envvar CFLAGS... yes
  204. checking if x86_64-pc-linux-gnu-gcc supports flag -Wsign-compare in envvar CFLAGS... yes
  205. checking if x86_64-pc-linux-gnu-gcc supports flag -Wstrict-aliasing=2 in envvar CFLAGS... yes
  206. checking if x86_64-pc-linux-gnu-gcc supports flag -Wundef in envvar CFLAGS... yes
  207. checking if x86_64-pc-linux-gnu-gcc supports flag -Wuninitialized in envvar CFLAGS... yes
  208. checking if x86_64-pc-linux-gnu-gcc supports flag -Wunsafe-loop-optimizations in envvar CFLAGS... yes
  209. checking if x86_64-pc-linux-gnu-gcc supports flag -Wwrite-strings in envvar CFLAGS... yes
  210. checking if x86_64-pc-linux-gnu-gcc supports flag -fno-common in envvar CFLAGS... yes
  211. checking if x86_64-pc-linux-gnu-gcc supports flag -fdiagnostics-show-option in envvar CFLAGS... yes
  212. checking if x86_64-pc-linux-gnu-gcc supports flag -fno-strict-aliasing in envvar CFLAGS... yes
  213. checking if x86_64-pc-linux-gnu-gcc supports flag -fstack-protector in envvar CFLAGS... yes
  214. checking if x86_64-pc-linux-gnu-gcc supports flag -fstack-protector-strong in envvar CFLAGS... yes
  215. checking if x86_64-pc-linux-gnu-gcc supports flag -fno-semantic-interposition in envvar CFLAGS... yes
  216. checking if x86_64-pc-linux-gnu-gcc supports flag -Wno-deprecated-declarations in envvar CFLAGS... yes
  217. checking if x86_64-pc-linux-gnu-gcc supports flag -Waggregate-return in envvar CFLAGS... yes
  218. checking if x86_64-pc-linux-gnu-gcc supports flag -Wimplicit in envvar CFLAGS... yes
  219. checking if x86_64-pc-linux-gnu-gcc supports flag -Wnested-externs in envvar CFLAGS... yes
  220. checking if x86_64-pc-linux-gnu-gcc supports flag -Wold-style-definition in envvar CFLAGS... yes
  221. checking if x86_64-pc-linux-gnu-gcc supports flag -Wstrict-prototypes in envvar CFLAGS... yes
  222. checking if x86_64-pc-linux-gnu-g++ supports flag -pipe in envvar CXXFLAGS... yes
  223. checking if x86_64-pc-linux-gnu-g++ supports flag -Wall in envvar CXXFLAGS... yes
  224. checking if x86_64-pc-linux-gnu-g++ supports flag -Wcast-align in envvar CXXFLAGS... yes
  225. checking if x86_64-pc-linux-gnu-g++ supports flag -Wendif-labels in envvar CXXFLAGS... yes
  226. checking if x86_64-pc-linux-gnu-g++ supports flag -Werror=declaration-after-statement in envvar CXXFLAGS... yes
  227. checking if x86_64-pc-linux-gnu-g++ supports flag -Wformat=2 -Werror=format-nonliteral -Werror=format-security in envvar CXXFLAGS... yes
  228. checking if x86_64-pc-linux-gnu-g++ supports flag -Werror=implicit-function-declaration in envvar CXXFLAGS... yes
  229. checking if x86_64-pc-linux-gnu-g++ supports flag -Werror=init-self in envvar CXXFLAGS... yes
  230. checking if x86_64-pc-linux-gnu-g++ supports flag -Werror=missing-include-dirs in envvar CXXFLAGS... yes
  231. checking if x86_64-pc-linux-gnu-g++ supports flag -Werror=missing-prototypes in envvar CXXFLAGS... yes
  232. checking if x86_64-pc-linux-gnu-g++ supports flag -Werror=pointer-arith in envvar CXXFLAGS... yes
  233. checking if x86_64-pc-linux-gnu-g++ supports flag -Wextra in envvar CXXFLAGS... yes
  234. checking if x86_64-pc-linux-gnu-g++ supports flag -Wfloat-equal in envvar CXXFLAGS... yes
  235. checking if x86_64-pc-linux-gnu-g++ supports flag -Wlogical-op in envvar CXXFLAGS... yes
  236. checking if x86_64-pc-linux-gnu-g++ supports flag -Wmisleading-indentation in envvar CXXFLAGS... yes
  237. checking if x86_64-pc-linux-gnu-g++ supports flag -Wmissing-declarations in envvar CXXFLAGS... yes
  238. checking if x86_64-pc-linux-gnu-g++ supports flag -Wmissing-include-dirs in envvar CXXFLAGS... yes
  239. checking if x86_64-pc-linux-gnu-g++ supports flag -Wmissing-format-attribute in envvar CXXFLAGS... yes
  240. checking if x86_64-pc-linux-gnu-g++ supports flag -Wmissing-noreturn in envvar CXXFLAGS... yes
  241. checking if x86_64-pc-linux-gnu-g++ supports flag -Wno-missing-field-initializers in envvar CXXFLAGS... yes
  242. checking if x86_64-pc-linux-gnu-g++ supports flag -Wno-switch-enum in envvar CXXFLAGS... yes
  243. checking if x86_64-pc-linux-gnu-g++ supports flag -Wno-unused-parameter in envvar CXXFLAGS... yes
  244. checking if x86_64-pc-linux-gnu-g++ supports flag -Wno-packed in envvar CXXFLAGS... yes
  245. checking if x86_64-pc-linux-gnu-g++ supports flag -Wshadow in envvar CXXFLAGS... yes
  246. checking if x86_64-pc-linux-gnu-g++ supports flag -Wsign-compare in envvar CXXFLAGS... yes
  247. checking if x86_64-pc-linux-gnu-g++ supports flag -Wstrict-aliasing=2 in envvar CXXFLAGS... yes
  248. checking if x86_64-pc-linux-gnu-g++ supports flag -Wundef in envvar CXXFLAGS... yes
  249. checking if x86_64-pc-linux-gnu-g++ supports flag -Wuninitialized in envvar CXXFLAGS... yes
  250. checking if x86_64-pc-linux-gnu-g++ supports flag -Wunsafe-loop-optimizations in envvar CXXFLAGS... yes
  251. checking if x86_64-pc-linux-gnu-g++ supports flag -Wwrite-strings in envvar CXXFLAGS... yes
  252. checking if x86_64-pc-linux-gnu-g++ supports flag -fno-common in envvar CXXFLAGS... yes
  253. checking if x86_64-pc-linux-gnu-g++ supports flag -fdiagnostics-show-option in envvar CXXFLAGS... yes
  254. checking if x86_64-pc-linux-gnu-g++ supports flag -fno-strict-aliasing in envvar CXXFLAGS... yes
  255. checking if x86_64-pc-linux-gnu-g++ supports flag -fstack-protector in envvar CXXFLAGS... yes
  256. checking if x86_64-pc-linux-gnu-g++ supports flag -fstack-protector-strong in envvar CXXFLAGS... yes
  257. checking if x86_64-pc-linux-gnu-g++ supports flag -fno-semantic-interposition in envvar CXXFLAGS... yes
  258. checking if x86_64-pc-linux-gnu-g++ supports flag -Wno-deprecated-declarations in envvar CXXFLAGS... yes
  259. checking if x86_64-pc-linux-gnu-g++ supports flag -Wstrict-null-sentinel in envvar CXXFLAGS... yes
  260. checking if x86_64-pc-linux-gnu-g++ supports flag -fno-rtti in envvar CXXFLAGS... yes
  261. checking if x86_64-pc-linux-gnu-g++ supports flag -fno-exceptions in envvar CXXFLAGS... yes
  262. checking if x86_64-pc-linux-gnu-g++ supports flag -fvisibility=hidden in envvar CXXFLAGS... yes
  263. checking if x86_64-pc-linux-gnu-g++ supports flag -fvisibility-inlines-hidden in envvar CXXFLAGS... yes
  264. checking if x86_64-pc-linux-gnu-gcc supports "-Wl,-Bsymbolic-functions" flag... yes
  265. checking if x86_64-pc-linux-gnu-g++ supports "-Wl,-Bsymbolic-functions" flag... yes
  266. checking whether GnuTLS support is requested... yes
  267. checking for glib-genmarshal... /usr/bin/glib-genmarshal
  268. checking for glib-mkenums... /usr/bin/glib-mkenums
  269. checking sys/select.h usability... yes
  270. checking sys/select.h presence... yes
  271. checking for sys/select.h... yes
  272. checking sys/syslimits.h usability... no
  273. checking sys/syslimits.h presence... no
  274. checking for sys/syslimits.h... no
  275. checking sys/termios.h usability... yes
  276. checking sys/termios.h presence... yes
  277. checking for sys/termios.h... yes
  278. checking sys/wait.h usability... yes
  279. checking sys/wait.h presence... yes
  280. checking for sys/wait.h... yes
  281. checking stropts.h usability... yes
  282. checking stropts.h presence... yes
  283. checking for stropts.h... yes
  284. checking termios.h usability... yes
  285. checking termios.h presence... yes
  286. checking for termios.h... yes
  287. checking util.h usability... no
  288. checking util.h presence... no
  289. checking for util.h... no
  290. checking wchar.h usability... yes
  291. checking wchar.h presence... yes
  292. checking for wchar.h... yes
  293. checking pty.h usability... yes
  294. checking pty.h presence... yes
  295. checking for pty.h... yes
  296. checking whether termios.h defines TIOCGWINSZ... no
  297. checking whether sys/ioctl.h defines TIOCGWINSZ... yes
  298. checking for posix_openpt... yes
  299. checking for grantpt... yes
  300. checking for unlockpt... yes
  301. checking for ptsname... yes
  302. checking for cfmakeraw... yes
  303. checking for fork... yes
  304. checking for setsid... yes
  305. checking for setpgid... yes
  306. checking for getpgid... yes
  307. checking for tcgetattr... yes
  308. checking for tcsetattr... yes
  309. checking for pread... yes
  310. checking for pwrite... yes
  311. checking for explicit_bzero... yes
  312. checking for strchrnul... yes
  313. checking sys/resource.h usability... yes
  314. checking sys/resource.h presence... yes
  315. checking for sys/resource.h... yes
  316. checking for fdwalk... no
  317. checking for floor... no
  318. checking for floor in -lm... yes
  319. checking for ceil... yes
  320. checking for floor... (cached) no
  321. checking for round... yes
  322. checking for glib-2.0 >= 2.40.0 gobject-2.0 pango >= 1.22.0 gtk+-3.0 >= 3.8.0 gobject-2.0 gio-2.0 gio-unix-2.0 zlib libpcre2-8 >= 10.21 gnutls >= 3.2.7... yes
  323. checking for glib-2.0 >= 2.40.0... yes
  324. checking for gobject-2.0... yes
  325. checking for gtk+-3.0 >= 3.8.0... yes
  326. checking for
  327. glib-2.0 >= 2.40.0
  328. gobject-2.0
  329. cairo-gobject
  330. pango >= 1.22.0
  331. gdk-pixbuf-2.0
  332. gtk+-3.0 >= 3.8.0... yes
  333. checking whether to enable legacy charset support using iconv... yes
  334. checking whether to install the glade catalogue... yes
  335. checking for gobject-introspection... yes
  336. checking for x86_64-pc-linux-gnu-pkg-config... (cached) /usr/bin/x86_64-pc-linux-gnu-pkg-config
  337. checking pkg-config is at least version 0.9.0... yes
  338. checking for vapigen... yes
  339. checking for valac... /usr/bin/valac-0.44
  340. checking whether /usr/bin/valac-0.44 is at least version 0.24.0... yes
  341. checking for gtk+-3.0 >= 3.16... yes
  342. checking for valac... (cached) /usr/bin/valac-0.44
  343. checking whether /usr/bin/valac-0.44 is at least version 0.31.1... yes
  344. checking for glib-compile-resources... /usr/bin/glib-compile-resources
  345. checking for xmllint... /usr/bin/xmllint
  346. checking for gtk-doc... yes
  347. checking for gtkdoc-check... gtkdoc-check.test
  348. checking for gtkdoc-check... /usr/bin/gtkdoc-check
  349. checking for gtkdoc-rebase... /usr/bin/gtkdoc-rebase
  350. checking for gtkdoc-mkpdf... /usr/bin/gtkdoc-mkpdf
  351. checking whether to build gtk-doc documentation... no
  352. checking for glib-2.0 >= 2.10.0 gobject-2.0 >= 2.10.0... yes
  353. checking that generated files are newer than configure... done
  354. configure: creating ./config.status
  355. config.status: creating Makefile
  356. config.status: creating src/Makefile
  357. config.status: creating src/vte.gresource.xml
  358. config.status: creating src/vte/vteversion.h
  359. config.status: creating src/app/Makefile
  360. config.status: creating bindings/Makefile
  361. config.status: creating bindings/gir/Makefile
  362. config.status: creating bindings/vala/Makefile
  363. config.status: creating perf/Makefile
  364. config.status: creating po/Makefile.in
  365. config.status: creating doc/Makefile
  366. config.status: creating doc/reference/Makefile
  367. config.status: creating doc/reference/version.xml
  368. config.status: creating glade/Makefile
  369. config.status: creating vte-2.91.pc
  370. config.status: creating glade/vte-2.91.xml.in
  371. config.status: creating config.h
  372. config.status: executing depfiles commands
  373. config.status: executing libtool commands
  374. config.status: executing default-1 commands
  375. config.status: executing po/stamp-it commands
  376.  
  377. ## -------------- ##
  378. ## Configuration. ##
  379. ## -------------- ##
  380.  
  381. Configuration for libvte 0.54.4 for gtk+-3.0
  382. GnuTLS: yes
  383. IConv: yes
  384. Installing Glade catalogue: yes
  385. Debugging: no
  386. Introspection: yes
  387. Vala bindings: yes
  388. >>> Source configured.
  389. >>> Compiling source in /var/tmp/portage/x11-libs/vte-0.54.4/work/vte-0.54.4 ...
  390. make -j4
  391. make all-recursive
  392. make[1]: Entering directory '/var/tmp/portage/x11-libs/vte-0.54.4/work/vte-0.54.4'
  393. Making all in src
  394. make[2]: Entering directory '/var/tmp/portage/x11-libs/vte-0.54.4/work/vte-0.54.4/src'
  395. ./box_drawing_generate.sh < box_drawing.txt > box_drawing.h
  396. echo '#include "marshal.h"' > marshal.cc \
  397. && /usr/bin/glib-genmarshal --prefix=_vte_marshal --body --internal marshal.list >> marshal.cc
  398. /usr/bin/glib-genmarshal --prefix=_vte_marshal --header --internal marshal.list > marshal.h
  399. /usr/bin/glib-mkenums --template vtetypebuiltins.cc.template vte/vteenums.h vte/vtedeprecated.h > xgen-vtbc \
  400. && (cmp -s xgen-vtbc vtetypebuiltins.cc || cp xgen-vtbc vtetypebuiltins.cc ) \
  401. && rm -f xgen-vtbc
  402. INFO: Reading marshal.list...
  403. INFO: Reading marshal.list...
  404. /usr/bin/glib-mkenums --template vtetypebuiltins.h.template vte/vteenums.h vte/vtedeprecated.h > xgen-vtbh \
  405. && (cmp -s xgen-vtbh vte/vtetypebuiltins.h || cp xgen-vtbh vte/vtetypebuiltins.h ) \
  406. && rm -f xgen-vtbh \
  407. && echo timestamp > stamp-vtetypebuiltins.h
  408. /usr/bin/glib-compile-resources --target vteresources.cc --sourcedir . --generate-source --c-name _vte vte.gresource.xml
  409. make all-recursive
  410. make[3]: Entering directory '/var/tmp/portage/x11-libs/vte-0.54.4/work/vte-0.54.4/src'
  411. Making all in .
  412. make[4]: Entering directory '/var/tmp/portage/x11-libs/vte-0.54.4/work/vte-0.54.4/src'
  413. x86_64-pc-linux-gnu-g++ -DHAVE_CONFIG_H -I. -I.. -I. -I. -DPARSER_INCLUDE_NOP -I/usr/include/glib-2.0 -I/usr/lib64/glib-2.0/include -pipe -Wall -Wcast-align -Wendif-labels -Werror=declaration-after-statement -Wformat=2 -Werror=format-nonliteral -Werror=format-security -Werror=implicit-function-declaration -Werror=init-self -Werror=missing-include-dirs -Werror=missing-prototypes -Werror=pointer-arith -Wextra -Wfloat-equal -Wlogical-op -Wmisleading-indentation -Wmissing-declarations -Wmissing-include-dirs -Wmissing-format-attribute -Wmissing-noreturn -Wno-missing-field-initializers -Wno-switch-enum -Wno-unused-parameter -Wno-packed -Wshadow -Wsign-compare -Wstrict-aliasing=2 -Wundef -Wuninitialized -Wunsafe-loop-optimizations -Wwrite-strings -fno-common -fdiagnostics-show-option -fno-strict-aliasing -fstack-protector -fstack-protector-strong -fno-semantic-interposition -Wno-deprecated-declarations -Wstrict-null-sentinel -fno-rtti -fno-exceptions -fvisibility=hidden -fvisibility-inlines-hidden -march=native -O2 -pipe -c -o parser_cat-debug.o `test -f 'debug.cc' || echo './'`debug.cc
  414. x86_64-pc-linux-gnu-g++ -DHAVE_CONFIG_H -I. -I.. -I. -I. -DPARSER_INCLUDE_NOP -I/usr/include/glib-2.0 -I/usr/lib64/glib-2.0/include -pipe -Wall -Wcast-align -Wendif-labels -Werror=declaration-after-statement -Wformat=2 -Werror=format-nonliteral -Werror=format-security -Werror=implicit-function-declaration -Werror=init-self -Werror=missing-include-dirs -Werror=missing-prototypes -Werror=pointer-arith -Wextra -Wfloat-equal -Wlogical-op -Wmisleading-indentation -Wmissing-declarations -Wmissing-include-dirs -Wmissing-format-attribute -Wmissing-noreturn -Wno-missing-field-initializers -Wno-switch-enum -Wno-unused-parameter -Wno-packed -Wshadow -Wsign-compare -Wstrict-aliasing=2 -Wundef -Wuninitialized -Wunsafe-loop-optimizations -Wwrite-strings -fno-common -fdiagnostics-show-option -fno-strict-aliasing -fstack-protector -fstack-protector-strong -fno-semantic-interposition -Wno-deprecated-declarations -Wstrict-null-sentinel -fno-rtti -fno-exceptions -fvisibility=hidden -fvisibility-inlines-hidden -march=native -O2 -pipe -c -o parser_cat-parser.o `test -f 'parser.cc' || echo './'`parser.cc
  415. x86_64-pc-linux-gnu-g++ -DHAVE_CONFIG_H -I. -I.. -I. -I. -DPARSER_INCLUDE_NOP -I/usr/include/glib-2.0 -I/usr/lib64/glib-2.0/include -pipe -Wall -Wcast-align -Wendif-labels -Werror=declaration-after-statement -Wformat=2 -Werror=format-nonliteral -Werror=format-security -Werror=implicit-function-declaration -Werror=init-self -Werror=missing-include-dirs -Werror=missing-prototypes -Werror=pointer-arith -Wextra -Wfloat-equal -Wlogical-op -Wmisleading-indentation -Wmissing-declarations -Wmissing-include-dirs -Wmissing-format-attribute -Wmissing-noreturn -Wno-missing-field-initializers -Wno-switch-enum -Wno-unused-parameter -Wno-packed -Wshadow -Wsign-compare -Wstrict-aliasing=2 -Wundef -Wuninitialized -Wunsafe-loop-optimizations -Wwrite-strings -fno-common -fdiagnostics-show-option -fno-strict-aliasing -fstack-protector -fstack-protector-strong -fno-semantic-interposition -Wno-deprecated-declarations -Wstrict-null-sentinel -fno-rtti -fno-exceptions -fvisibility=hidden -fvisibility-inlines-hidden -march=native -O2 -pipe -c -o parser_cat-parser-cat.o `test -f 'parser-cat.cc' || echo './'`parser-cat.cc
  416. x86_64-pc-linux-gnu-g++ -DHAVE_CONFIG_H -I. -I.. -I. -I. -DPARSER_INCLUDE_NOP -I/usr/include/glib-2.0 -I/usr/lib64/glib-2.0/include -pipe -Wall -Wcast-align -Wendif-labels -Werror=declaration-after-statement -Wformat=2 -Werror=format-nonliteral -Werror=format-security -Werror=implicit-function-declaration -Werror=init-self -Werror=missing-include-dirs -Werror=missing-prototypes -Werror=pointer-arith -Wextra -Wfloat-equal -Wlogical-op -Wmisleading-indentation -Wmissing-declarations -Wmissing-include-dirs -Wmissing-format-attribute -Wmissing-noreturn -Wno-missing-field-initializers -Wno-switch-enum -Wno-unused-parameter -Wno-packed -Wshadow -Wsign-compare -Wstrict-aliasing=2 -Wundef -Wuninitialized -Wunsafe-loop-optimizations -Wwrite-strings -fno-common -fdiagnostics-show-option -fno-strict-aliasing -fstack-protector -fstack-protector-strong -fno-semantic-interposition -Wno-deprecated-declarations -Wstrict-null-sentinel -fno-rtti -fno-exceptions -fvisibility=hidden -fvisibility-inlines-hidden -march=native -O2 -pipe -c -o parser_cat-utf8.o `test -f 'utf8.cc' || echo './'`utf8.cc
  417. x86_64-pc-linux-gnu-gcc -DHAVE_CONFIG_H -I. -I.. -I. -I. -I/usr/include/glib-2.0 -I/usr/lib64/glib-2.0/include -pipe -Wall -Wcast-align -Wendif-labels -Werror=declaration-after-statement -Wformat=2 -Werror=format-nonliteral -Werror=format-security -Werror=implicit-function-declaration -Werror=init-self -Werror=missing-include-dirs -Werror=missing-prototypes -Werror=pointer-arith -Wextra -Wfloat-equal -Wlogical-op -Wmisleading-indentation -Wmissing-declarations -Wmissing-include-dirs -Wmissing-format-attribute -Wmissing-noreturn -Wno-missing-field-initializers -Wno-switch-enum -Wno-unused-parameter -Wno-packed -Wshadow -Wsign-compare -Wstrict-aliasing=2 -Wundef -Wuninitialized -Wunsafe-loop-optimizations -Wwrite-strings -fno-common -fdiagnostics-show-option -fno-strict-aliasing -fstack-protector -fstack-protector-strong -fno-semantic-interposition -Wno-deprecated-declarations -Waggregate-return -Wimplicit -Wnested-externs -Wold-style-definition -Wstrict-prototypes -march=native -O2 -pipe -c -o slowcat-slowcat.o `test -f 'slowcat.c' || echo './'`slowcat.c
  418. x86_64-pc-linux-gnu-g++ -DHAVE_CONFIG_H -I. -I.. -I. -I. -I/usr/include/glib-2.0 -I/usr/lib64/glib-2.0/include -pipe -Wall -Wcast-align -Wendif-labels -Werror=declaration-after-statement -Wformat=2 -Werror=format-nonliteral -Werror=format-security -Werror=implicit-function-declaration -Werror=init-self -Werror=missing-include-dirs -Werror=missing-prototypes -Werror=pointer-arith -Wextra -Wfloat-equal -Wlogical-op -Wmisleading-indentation -Wmissing-declarations -Wmissing-include-dirs -Wmissing-format-attribute -Wmissing-noreturn -Wno-missing-field-initializers -Wno-switch-enum -Wno-unused-parameter -Wno-packed -Wshadow -Wsign-compare -Wstrict-aliasing=2 -Wundef -Wuninitialized -Wunsafe-loop-optimizations -Wwrite-strings -fno-common -fdiagnostics-show-option -fno-strict-aliasing -fstack-protector -fstack-protector-strong -fno-semantic-interposition -Wno-deprecated-declarations -Wstrict-null-sentinel -fno-rtti -fno-exceptions -fvisibility=hidden -fvisibility-inlines-hidden -march=native -O2 -pipe -c -o test_modes-modes-test.o `test -f 'modes-test.cc' || echo './'`modes-test.cc
  419. x86_64-pc-linux-gnu-g++ -DHAVE_CONFIG_H -I. -I.. -I. -I. -I/usr/include/glib-2.0 -I/usr/lib64/glib-2.0/include -pipe -Wall -Wcast-align -Wendif-labels -Werror=declaration-after-statement -Wformat=2 -Werror=format-nonliteral -Werror=format-security -Werror=implicit-function-declaration -Werror=init-self -Werror=missing-include-dirs -Werror=missing-prototypes -Werror=pointer-arith -Wextra -Wfloat-equal -Wlogical-op -Wmisleading-indentation -Wmissing-declarations -Wmissing-include-dirs -Wmissing-format-attribute -Wmissing-noreturn -Wno-missing-field-initializers -Wno-switch-enum -Wno-unused-parameter -Wno-packed -Wshadow -Wsign-compare -Wstrict-aliasing=2 -Wundef -Wuninitialized -Wunsafe-loop-optimizations -Wwrite-strings -fno-common -fdiagnostics-show-option -fno-strict-aliasing -fstack-protector -fstack-protector-strong -fno-semantic-interposition -Wno-deprecated-declarations -Wstrict-null-sentinel -fno-rtti -fno-exceptions -fvisibility=hidden -fvisibility-inlines-hidden -march=native -O2 -pipe -c -o test_tabstops-tabstops-test.o `test -f 'tabstops-test.cc' || echo './'`tabstops-test.cc
  420. parser-cat.cc: In function ‘void process_file_utf8(int, bool, bool, bool)’:
  421. parser-cat.cc:355:33: warning: this statement may fall through [-Wimplicit-fallthrough=]
  422. --sptr;
  423. ^~~~~~
  424. parser-cat.cc:357:25: note: here
  425. case vte::base::UTF8Decoder::REJECT:
  426. ^~~~
  427. parser-cat.cc:358:46: warning: this statement may fall through [-Wimplicit-fallthrough=]
  428. decoder.reset();
  429. ~~~~~~~~~~~~~^~
  430. parser-cat.cc:361:25: note: here
  431. case vte::base::UTF8Decoder::ACCEPT: {
  432. ^~~~
  433. x86_64-pc-linux-gnu-g++ -DHAVE_CONFIG_H -I. -I.. -I. -I. -DPARSER_INCLUDE_NOP -pthread -I/usr/include/gtk-3.0 -I/usr/include/at-spi2-atk/2.0 -I/usr/include/at-spi-2.0 -I/usr/include/dbus-1.0 -I/usr/lib64/dbus-1.0/include -I/usr/include/gtk-3.0 -I/usr/include/cairo -I/usr/include/pango-1.0 -I/usr/include/harfbuzz -I/usr/include/pango-1.0 -I/usr/include/fribidi -I/usr/include/atk-1.0 -I/usr/include/cairo -I/usr/include/pixman-1 -I/usr/include/freetype2 -I/usr/include/libdrm -I/usr/include/libpng16 -I/usr/include/gdk-pixbuf-2.0 -I/usr/include/gio-unix-2.0/ -I/usr/include/libmount -I/usr/include/blkid -I/usr/include/uuid -I/usr/include/glib-2.0 -I/usr/lib64/glib-2.0/include -I/usr/include/p11-kit-1 -pipe -Wall -Wcast-align -Wendif-labels -Werror=declaration-after-statement -Wformat=2 -Werror=format-nonliteral -Werror=format-security -Werror=implicit-function-declaration -Werror=init-self -Werror=missing-include-dirs -Werror=missing-prototypes -Werror=pointer-arith -Wextra -Wfloat-equal -Wlogical-op -Wmisleading-indentation -Wmissing-declarations -Wmissing-include-dirs -Wmissing-format-attribute -Wmissing-noreturn -Wno-missing-field-initializers -Wno-switch-enum -Wno-unused-parameter -Wno-packed -Wshadow -Wsign-compare -Wstrict-aliasing=2 -Wundef -Wuninitialized -Wunsafe-loop-optimizations -Wwrite-strings -fno-common -fdiagnostics-show-option -fno-strict-aliasing -fstack-protector -fstack-protector-strong -fno-semantic-interposition -Wno-deprecated-declarations -Wstrict-null-sentinel -fno-rtti -fno-exceptions -fvisibility=hidden -fvisibility-inlines-hidden -march=native -O2 -pipe -c -o test_parser-parser-test.o `test -f 'parser-test.cc' || echo './'`parser-test.cc
  434. x86_64-pc-linux-gnu-g++ -DHAVE_CONFIG_H -I. -I.. -I. -I. -DPARSER_INCLUDE_NOP -pthread -I/usr/include/gtk-3.0 -I/usr/include/at-spi2-atk/2.0 -I/usr/include/at-spi-2.0 -I/usr/include/dbus-1.0 -I/usr/lib64/dbus-1.0/include -I/usr/include/gtk-3.0 -I/usr/include/cairo -I/usr/include/pango-1.0 -I/usr/include/harfbuzz -I/usr/include/pango-1.0 -I/usr/include/fribidi -I/usr/include/atk-1.0 -I/usr/include/cairo -I/usr/include/pixman-1 -I/usr/include/freetype2 -I/usr/include/libdrm -I/usr/include/libpng16 -I/usr/include/gdk-pixbuf-2.0 -I/usr/include/gio-unix-2.0/ -I/usr/include/libmount -I/usr/include/blkid -I/usr/include/uuid -I/usr/include/glib-2.0 -I/usr/lib64/glib-2.0/include -I/usr/include/p11-kit-1 -pipe -Wall -Wcast-align -Wendif-labels -Werror=declaration-after-statement -Wformat=2 -Werror=format-nonliteral -Werror=format-security -Werror=implicit-function-declaration -Werror=init-self -Werror=missing-include-dirs -Werror=missing-prototypes -Werror=pointer-arith -Wextra -Wfloat-equal -Wlogical-op -Wmisleading-indentation -Wmissing-declarations -Wmissing-include-dirs -Wmissing-format-attribute -Wmissing-noreturn -Wno-missing-field-initializers -Wno-switch-enum -Wno-unused-parameter -Wno-packed -Wshadow -Wsign-compare -Wstrict-aliasing=2 -Wundef -Wuninitialized -Wunsafe-loop-optimizations -Wwrite-strings -fno-common -fdiagnostics-show-option -fno-strict-aliasing -fstack-protector -fstack-protector-strong -fno-semantic-interposition -Wno-deprecated-declarations -Wstrict-null-sentinel -fno-rtti -fno-exceptions -fvisibility=hidden -fvisibility-inlines-hidden -march=native -O2 -pipe -c -o test_parser-parser.o `test -f 'parser.cc' || echo './'`parser.cc
  435. x86_64-pc-linux-gnu-g++ -DHAVE_CONFIG_H -I. -I.. -I. -I. -I/usr/include/glib-2.0 -I/usr/lib64/glib-2.0/include -pipe -Wall -Wcast-align -Wendif-labels -Werror=declaration-after-statement -Wformat=2 -Werror=format-nonliteral -Werror=format-security -Werror=implicit-function-declaration -Werror=init-self -Werror=missing-include-dirs -Werror=missing-prototypes -Werror=pointer-arith -Wextra -Wfloat-equal -Wlogical-op -Wmisleading-indentation -Wmissing-declarations -Wmissing-include-dirs -Wmissing-format-attribute -Wmissing-noreturn -Wno-missing-field-initializers -Wno-switch-enum -Wno-unused-parameter -Wno-packed -Wshadow -Wsign-compare -Wstrict-aliasing=2 -Wundef -Wuninitialized -Wunsafe-loop-optimizations -Wwrite-strings -fno-common -fdiagnostics-show-option -fno-strict-aliasing -fstack-protector -fstack-protector-strong -fno-semantic-interposition -Wno-deprecated-declarations -Wstrict-null-sentinel -fno-rtti -fno-exceptions -fvisibility=hidden -fvisibility-inlines-hidden -march=native -O2 -pipe -c -o test_refptr-refptr-test.o `test -f 'refptr-test.cc' || echo './'`refptr-test.cc
  436. x86_64-pc-linux-gnu-g++ -DHAVE_CONFIG_H -I. -I.. -I. -I. -I/usr/include/glib-2.0 -I/usr/lib64/glib-2.0/include -pipe -Wall -Wcast-align -Wendif-labels -Werror=declaration-after-statement -Wformat=2 -Werror=format-nonliteral -Werror=format-security -Werror=implicit-function-declaration -Werror=init-self -Werror=missing-include-dirs -Werror=missing-prototypes -Werror=pointer-arith -Wextra -Wfloat-equal -Wlogical-op -Wmisleading-indentation -Wmissing-declarations -Wmissing-include-dirs -Wmissing-format-attribute -Wmissing-noreturn -Wno-missing-field-initializers -Wno-switch-enum -Wno-unused-parameter -Wno-packed -Wshadow -Wsign-compare -Wstrict-aliasing=2 -Wundef -Wuninitialized -Wunsafe-loop-optimizations -Wwrite-strings -fno-common -fdiagnostics-show-option -fno-strict-aliasing -fstack-protector -fstack-protector-strong -fno-semantic-interposition -Wno-deprecated-declarations -Wstrict-null-sentinel -fno-rtti -fno-exceptions -fvisibility=hidden -fvisibility-inlines-hidden -march=native -O2 -pipe -c -o test_utf8-utf8-test.o `test -f 'utf8-test.cc' || echo './'`utf8-test.cc
  437. x86_64-pc-linux-gnu-g++ -DHAVE_CONFIG_H -I. -I.. -I. -I. -I/usr/include/glib-2.0 -I/usr/lib64/glib-2.0/include -pipe -Wall -Wcast-align -Wendif-labels -Werror=declaration-after-statement -Wformat=2 -Werror=format-nonliteral -Werror=format-security -Werror=implicit-function-declaration -Werror=init-self -Werror=missing-include-dirs -Werror=missing-prototypes -Werror=pointer-arith -Wextra -Wfloat-equal -Wlogical-op -Wmisleading-indentation -Wmissing-declarations -Wmissing-include-dirs -Wmissing-format-attribute -Wmissing-noreturn -Wno-missing-field-initializers -Wno-switch-enum -Wno-unused-parameter -Wno-packed -Wshadow -Wsign-compare -Wstrict-aliasing=2 -Wundef -Wuninitialized -Wunsafe-loop-optimizations -Wwrite-strings -fno-common -fdiagnostics-show-option -fno-strict-aliasing -fstack-protector -fstack-protector-strong -fno-semantic-interposition -Wno-deprecated-declarations -Wstrict-null-sentinel -fno-rtti -fno-exceptions -fvisibility=hidden -fvisibility-inlines-hidden -march=native -O2 -pipe -c -o test_utf8-utf8.o `test -f 'utf8.cc' || echo './'`utf8.cc
  438. /bin/sh ../libtool --tag=CXX --mode=compile x86_64-pc-linux-gnu-g++ -DHAVE_CONFIG_H -I. -I.. -DG_LOG_DOMAIN=\"Vte\" -DVTE_API_VERSION=\"2.91\" -DDATADIR='"/usr/share"' -DLIBEXECDIR='"/usr/libexec"' -DLOCALEDIR='"/usr/share/locale"' -DGLIB_DISABLE_DEPRECATION_WARNINGS -DVTE_COMPILATION -UPARSER_INCLUDE_NOP -I./vte -I./vte -pthread -I/usr/include/gtk-3.0 -I/usr/include/at-spi2-atk/2.0 -I/usr/include/at-spi-2.0 -I/usr/include/dbus-1.0 -I/usr/lib64/dbus-1.0/include -I/usr/include/gtk-3.0 -I/usr/include/cairo -I/usr/include/pango-1.0 -I/usr/include/harfbuzz -I/usr/include/pango-1.0 -I/usr/include/fribidi -I/usr/include/atk-1.0 -I/usr/include/cairo -I/usr/include/pixman-1 -I/usr/include/freetype2 -I/usr/include/libdrm -I/usr/include/libpng16 -I/usr/include/gdk-pixbuf-2.0 -I/usr/include/gio-unix-2.0/ -I/usr/include/libmount -I/usr/include/blkid -I/usr/include/uuid -I/usr/include/glib-2.0 -I/usr/lib64/glib-2.0/include -I/usr/include/p11-kit-1 -pipe -Wall -Wcast-align -Wendif-labels -Werror=declaration-after-statement -Wformat=2 -Werror=format-nonliteral -Werror=format-security -Werror=implicit-function-declaration -Werror=init-self -Werror=missing-include-dirs -Werror=missing-prototypes -Werror=pointer-arith -Wextra -Wfloat-equal -Wlogical-op -Wmisleading-indentation -Wmissing-declarations -Wmissing-include-dirs -Wmissing-format-attribute -Wmissing-noreturn -Wno-missing-field-initializers -Wno-switch-enum -Wno-unused-parameter -Wno-packed -Wshadow -Wsign-compare -Wstrict-aliasing=2 -Wundef -Wuninitialized -Wunsafe-loop-optimizations -Wwrite-strings -fno-common -fdiagnostics-show-option -fno-strict-aliasing -fstack-protector -fstack-protector-strong -fno-semantic-interposition -Wno-deprecated-declarations -Wstrict-null-sentinel -fno-rtti -fno-exceptions -fvisibility=hidden -fvisibility-inlines-hidden -march=native -O2 -pipe -c -o libvte_2_91_la-chunk.lo `test -f 'chunk.cc' || echo './'`chunk.cc
  439. utf8-test.cc: In function ‘void decode(const uint8_t*, size_t, std::__cxx11::u32string&)’:
  440. utf8-test.cc:66:25: warning: this statement may fall through [-Wimplicit-fallthrough=]
  441. --iptr;
  442. ^~~~~~
  443. utf8-test.cc:68:17: note: here
  444. case vte::base::UTF8Decoder::REJECT:
  445. ^~~~
  446. utf8-test.cc:70:31: warning: this statement may fall through [-Wimplicit-fallthrough=]
  447. state = UTF8Decoder::ACCEPT;
  448. ~~~~~~^~~~~~~~~~~~~
  449. utf8-test.cc:73:17: note: here
  450. case vte::base::UTF8Decoder::ACCEPT:
  451. ^~~~
  452. /bin/sh ../libtool --tag=CXX --mode=compile x86_64-pc-linux-gnu-g++ -DHAVE_CONFIG_H -I. -I.. -DG_LOG_DOMAIN=\"Vte\" -DVTE_API_VERSION=\"2.91\" -DDATADIR='"/usr/share"' -DLIBEXECDIR='"/usr/libexec"' -DLOCALEDIR='"/usr/share/locale"' -DGLIB_DISABLE_DEPRECATION_WARNINGS -DVTE_COMPILATION -UPARSER_INCLUDE_NOP -I./vte -I./vte -pthread -I/usr/include/gtk-3.0 -I/usr/include/at-spi2-atk/2.0 -I/usr/include/at-spi-2.0 -I/usr/include/dbus-1.0 -I/usr/lib64/dbus-1.0/include -I/usr/include/gtk-3.0 -I/usr/include/cairo -I/usr/include/pango-1.0 -I/usr/include/harfbuzz -I/usr/include/pango-1.0 -I/usr/include/fribidi -I/usr/include/atk-1.0 -I/usr/include/cairo -I/usr/include/pixman-1 -I/usr/include/freetype2 -I/usr/include/libdrm -I/usr/include/libpng16 -I/usr/include/gdk-pixbuf-2.0 -I/usr/include/gio-unix-2.0/ -I/usr/include/libmount -I/usr/include/blkid -I/usr/include/uuid -I/usr/include/glib-2.0 -I/usr/lib64/glib-2.0/include -I/usr/include/p11-kit-1 -pipe -Wall -Wcast-align -Wendif-labels -Werror=declaration-after-statement -Wformat=2 -Werror=format-nonliteral -Werror=format-security -Werror=implicit-function-declaration -Werror=init-self -Werror=missing-include-dirs -Werror=missing-prototypes -Werror=pointer-arith -Wextra -Wfloat-equal -Wlogical-op -Wmisleading-indentation -Wmissing-declarations -Wmissing-include-dirs -Wmissing-format-attribute -Wmissing-noreturn -Wno-missing-field-initializers -Wno-switch-enum -Wno-unused-parameter -Wno-packed -Wshadow -Wsign-compare -Wstrict-aliasing=2 -Wundef -Wuninitialized -Wunsafe-loop-optimizations -Wwrite-strings -fno-common -fdiagnostics-show-option -fno-strict-aliasing -fstack-protector -fstack-protector-strong -fno-semantic-interposition -Wno-deprecated-declarations -Wstrict-null-sentinel -fno-rtti -fno-exceptions -fvisibility=hidden -fvisibility-inlines-hidden -march=native -O2 -pipe -c -o libvte_2_91_la-debug.lo `test -f 'debug.cc' || echo './'`debug.cc
  453. libtool: compile: x86_64-pc-linux-gnu-g++ -DHAVE_CONFIG_H -I. -I.. -DG_LOG_DOMAIN=\"Vte\" -DVTE_API_VERSION=\"2.91\" -DDATADIR=\"/usr/share\" -DLIBEXECDIR=\"/usr/libexec\" -DLOCALEDIR=\"/usr/share/locale\" -DGLIB_DISABLE_DEPRECATION_WARNINGS -DVTE_COMPILATION -UPARSER_INCLUDE_NOP -I./vte -I./vte -pthread -I/usr/include/gtk-3.0 -I/usr/include/at-spi2-atk/2.0 -I/usr/include/at-spi-2.0 -I/usr/include/dbus-1.0 -I/usr/lib64/dbus-1.0/include -I/usr/include/gtk-3.0 -I/usr/include/cairo -I/usr/include/pango-1.0 -I/usr/include/harfbuzz -I/usr/include/pango-1.0 -I/usr/include/fribidi -I/usr/include/atk-1.0 -I/usr/include/cairo -I/usr/include/pixman-1 -I/usr/include/freetype2 -I/usr/include/libdrm -I/usr/include/libpng16 -I/usr/include/gdk-pixbuf-2.0 -I/usr/include/gio-unix-2.0/ -I/usr/include/libmount -I/usr/include/blkid -I/usr/include/uuid -I/usr/include/glib-2.0 -I/usr/lib64/glib-2.0/include -I/usr/include/p11-kit-1 -pipe -Wall -Wcast-align -Wendif-labels -Werror=declaration-after-statement -Wformat=2 -Werror=format-nonliteral -Werror=format-security -Werror=implicit-function-declaration -Werror=init-self -Werror=missing-include-dirs -Werror=missing-prototypes -Werror=pointer-arith -Wextra -Wfloat-equal -Wlogical-op -Wmisleading-indentation -Wmissing-declarations -Wmissing-include-dirs -Wmissing-format-attribute -Wmissing-noreturn -Wno-missing-field-initializers -Wno-switch-enum -Wno-unused-parameter -Wno-packed -Wshadow -Wsign-compare -Wstrict-aliasing=2 -Wundef -Wuninitialized -Wunsafe-loop-optimizations -Wwrite-strings -fno-common -fdiagnostics-show-option -fno-strict-aliasing -fstack-protector -fstack-protector-strong -fno-semantic-interposition -Wno-deprecated-declarations -Wstrict-null-sentinel -fno-rtti -fno-exceptions -fvisibility=hidden -fvisibility-inlines-hidden -march=native -O2 -pipe -c chunk.cc -fPIC -DPIC -o .libs/libvte_2_91_la-chunk.o
  454. /bin/sh ../libtool --tag=CXX --mode=compile x86_64-pc-linux-gnu-g++ -DHAVE_CONFIG_H -I. -I.. -DG_LOG_DOMAIN=\"Vte\" -DVTE_API_VERSION=\"2.91\" -DDATADIR='"/usr/share"' -DLIBEXECDIR='"/usr/libexec"' -DLOCALEDIR='"/usr/share/locale"' -DGLIB_DISABLE_DEPRECATION_WARNINGS -DVTE_COMPILATION -UPARSER_INCLUDE_NOP -I./vte -I./vte -pthread -I/usr/include/gtk-3.0 -I/usr/include/at-spi2-atk/2.0 -I/usr/include/at-spi-2.0 -I/usr/include/dbus-1.0 -I/usr/lib64/dbus-1.0/include -I/usr/include/gtk-3.0 -I/usr/include/cairo -I/usr/include/pango-1.0 -I/usr/include/harfbuzz -I/usr/include/pango-1.0 -I/usr/include/fribidi -I/usr/include/atk-1.0 -I/usr/include/cairo -I/usr/include/pixman-1 -I/usr/include/freetype2 -I/usr/include/libdrm -I/usr/include/libpng16 -I/usr/include/gdk-pixbuf-2.0 -I/usr/include/gio-unix-2.0/ -I/usr/include/libmount -I/usr/include/blkid -I/usr/include/uuid -I/usr/include/glib-2.0 -I/usr/lib64/glib-2.0/include -I/usr/include/p11-kit-1 -pipe -Wall -Wcast-align -Wendif-labels -Werror=declaration-after-statement -Wformat=2 -Werror=format-nonliteral -Werror=format-security -Werror=implicit-function-declaration -Werror=init-self -Werror=missing-include-dirs -Werror=missing-prototypes -Werror=pointer-arith -Wextra -Wfloat-equal -Wlogical-op -Wmisleading-indentation -Wmissing-declarations -Wmissing-include-dirs -Wmissing-format-attribute -Wmissing-noreturn -Wno-missing-field-initializers -Wno-switch-enum -Wno-unused-parameter -Wno-packed -Wshadow -Wsign-compare -Wstrict-aliasing=2 -Wundef -Wuninitialized -Wunsafe-loop-optimizations -Wwrite-strings -fno-common -fdiagnostics-show-option -fno-strict-aliasing -fstack-protector -fstack-protector-strong -fno-semantic-interposition -Wno-deprecated-declarations -Wstrict-null-sentinel -fno-rtti -fno-exceptions -fvisibility=hidden -fvisibility-inlines-hidden -march=native -O2 -pipe -c -o libvte_2_91_la-keymap.lo `test -f 'keymap.cc' || echo './'`keymap.cc
  455. libtool: compile: x86_64-pc-linux-gnu-g++ -DHAVE_CONFIG_H -I. -I.. -DG_LOG_DOMAIN=\"Vte\" -DVTE_API_VERSION=\"2.91\" -DDATADIR=\"/usr/share\" -DLIBEXECDIR=\"/usr/libexec\" -DLOCALEDIR=\"/usr/share/locale\" -DGLIB_DISABLE_DEPRECATION_WARNINGS -DVTE_COMPILATION -UPARSER_INCLUDE_NOP -I./vte -I./vte -pthread -I/usr/include/gtk-3.0 -I/usr/include/at-spi2-atk/2.0 -I/usr/include/at-spi-2.0 -I/usr/include/dbus-1.0 -I/usr/lib64/dbus-1.0/include -I/usr/include/gtk-3.0 -I/usr/include/cairo -I/usr/include/pango-1.0 -I/usr/include/harfbuzz -I/usr/include/pango-1.0 -I/usr/include/fribidi -I/usr/include/atk-1.0 -I/usr/include/cairo -I/usr/include/pixman-1 -I/usr/include/freetype2 -I/usr/include/libdrm -I/usr/include/libpng16 -I/usr/include/gdk-pixbuf-2.0 -I/usr/include/gio-unix-2.0/ -I/usr/include/libmount -I/usr/include/blkid -I/usr/include/uuid -I/usr/include/glib-2.0 -I/usr/lib64/glib-2.0/include -I/usr/include/p11-kit-1 -pipe -Wall -Wcast-align -Wendif-labels -Werror=declaration-after-statement -Wformat=2 -Werror=format-nonliteral -Werror=format-security -Werror=implicit-function-declaration -Werror=init-self -Werror=missing-include-dirs -Werror=missing-prototypes -Werror=pointer-arith -Wextra -Wfloat-equal -Wlogical-op -Wmisleading-indentation -Wmissing-declarations -Wmissing-include-dirs -Wmissing-format-attribute -Wmissing-noreturn -Wno-missing-field-initializers -Wno-switch-enum -Wno-unused-parameter -Wno-packed -Wshadow -Wsign-compare -Wstrict-aliasing=2 -Wundef -Wuninitialized -Wunsafe-loop-optimizations -Wwrite-strings -fno-common -fdiagnostics-show-option -fno-strict-aliasing -fstack-protector -fstack-protector-strong -fno-semantic-interposition -Wno-deprecated-declarations -Wstrict-null-sentinel -fno-rtti -fno-exceptions -fvisibility=hidden -fvisibility-inlines-hidden -march=native -O2 -pipe -c debug.cc -fPIC -DPIC -o .libs/libvte_2_91_la-debug.o
  456. /bin/sh ../libtool --tag=CXX --mode=compile x86_64-pc-linux-gnu-g++ -DHAVE_CONFIG_H -I. -I.. -DG_LOG_DOMAIN=\"Vte\" -DVTE_API_VERSION=\"2.91\" -DDATADIR='"/usr/share"' -DLIBEXECDIR='"/usr/libexec"' -DLOCALEDIR='"/usr/share/locale"' -DGLIB_DISABLE_DEPRECATION_WARNINGS -DVTE_COMPILATION -UPARSER_INCLUDE_NOP -I./vte -I./vte -pthread -I/usr/include/gtk-3.0 -I/usr/include/at-spi2-atk/2.0 -I/usr/include/at-spi-2.0 -I/usr/include/dbus-1.0 -I/usr/lib64/dbus-1.0/include -I/usr/include/gtk-3.0 -I/usr/include/cairo -I/usr/include/pango-1.0 -I/usr/include/harfbuzz -I/usr/include/pango-1.0 -I/usr/include/fribidi -I/usr/include/atk-1.0 -I/usr/include/cairo -I/usr/include/pixman-1 -I/usr/include/freetype2 -I/usr/include/libdrm -I/usr/include/libpng16 -I/usr/include/gdk-pixbuf-2.0 -I/usr/include/gio-unix-2.0/ -I/usr/include/libmount -I/usr/include/blkid -I/usr/include/uuid -I/usr/include/glib-2.0 -I/usr/lib64/glib-2.0/include -I/usr/include/p11-kit-1 -pipe -Wall -Wcast-align -Wendif-labels -Werror=declaration-after-statement -Wformat=2 -Werror=format-nonliteral -Werror=format-security -Werror=implicit-function-declaration -Werror=init-self -Werror=missing-include-dirs -Werror=missing-prototypes -Werror=pointer-arith -Wextra -Wfloat-equal -Wlogical-op -Wmisleading-indentation -Wmissing-declarations -Wmissing-include-dirs -Wmissing-format-attribute -Wmissing-noreturn -Wno-missing-field-initializers -Wno-switch-enum -Wno-unused-parameter -Wno-packed -Wshadow -Wsign-compare -Wstrict-aliasing=2 -Wundef -Wuninitialized -Wunsafe-loop-optimizations -Wwrite-strings -fno-common -fdiagnostics-show-option -fno-strict-aliasing -fstack-protector -fstack-protector-strong -fno-semantic-interposition -Wno-deprecated-declarations -Wstrict-null-sentinel -fno-rtti -fno-exceptions -fvisibility=hidden -fvisibility-inlines-hidden -march=native -O2 -pipe -c -o libvte_2_91_la-parser.lo `test -f 'parser.cc' || echo './'`parser.cc
  457. libtool: compile: x86_64-pc-linux-gnu-g++ -DHAVE_CONFIG_H -I. -I.. -DG_LOG_DOMAIN=\"Vte\" -DVTE_API_VERSION=\"2.91\" -DDATADIR=\"/usr/share\" -DLIBEXECDIR=\"/usr/libexec\" -DLOCALEDIR=\"/usr/share/locale\" -DGLIB_DISABLE_DEPRECATION_WARNINGS -DVTE_COMPILATION -UPARSER_INCLUDE_NOP -I./vte -I./vte -pthread -I/usr/include/gtk-3.0 -I/usr/include/at-spi2-atk/2.0 -I/usr/include/at-spi-2.0 -I/usr/include/dbus-1.0 -I/usr/lib64/dbus-1.0/include -I/usr/include/gtk-3.0 -I/usr/include/cairo -I/usr/include/pango-1.0 -I/usr/include/harfbuzz -I/usr/include/pango-1.0 -I/usr/include/fribidi -I/usr/include/atk-1.0 -I/usr/include/cairo -I/usr/include/pixman-1 -I/usr/include/freetype2 -I/usr/include/libdrm -I/usr/include/libpng16 -I/usr/include/gdk-pixbuf-2.0 -I/usr/include/gio-unix-2.0/ -I/usr/include/libmount -I/usr/include/blkid -I/usr/include/uuid -I/usr/include/glib-2.0 -I/usr/lib64/glib-2.0/include -I/usr/include/p11-kit-1 -pipe -Wall -Wcast-align -Wendif-labels -Werror=declaration-after-statement -Wformat=2 -Werror=format-nonliteral -Werror=format-security -Werror=implicit-function-declaration -Werror=init-self -Werror=missing-include-dirs -Werror=missing-prototypes -Werror=pointer-arith -Wextra -Wfloat-equal -Wlogical-op -Wmisleading-indentation -Wmissing-declarations -Wmissing-include-dirs -Wmissing-format-attribute -Wmissing-noreturn -Wno-missing-field-initializers -Wno-switch-enum -Wno-unused-parameter -Wno-packed -Wshadow -Wsign-compare -Wstrict-aliasing=2 -Wundef -Wuninitialized -Wunsafe-loop-optimizations -Wwrite-strings -fno-common -fdiagnostics-show-option -fno-strict-aliasing -fstack-protector -fstack-protector-strong -fno-semantic-interposition -Wno-deprecated-declarations -Wstrict-null-sentinel -fno-rtti -fno-exceptions -fvisibility=hidden -fvisibility-inlines-hidden -march=native -O2 -pipe -c keymap.cc -fPIC -DPIC -o .libs/libvte_2_91_la-keymap.o
  458. /bin/sh ../libtool --tag=CXX --mode=compile x86_64-pc-linux-gnu-g++ -DHAVE_CONFIG_H -I. -I.. -DG_LOG_DOMAIN=\"Vte\" -DVTE_API_VERSION=\"2.91\" -DDATADIR='"/usr/share"' -DLIBEXECDIR='"/usr/libexec"' -DLOCALEDIR='"/usr/share/locale"' -DGLIB_DISABLE_DEPRECATION_WARNINGS -DVTE_COMPILATION -UPARSER_INCLUDE_NOP -I./vte -I./vte -pthread -I/usr/include/gtk-3.0 -I/usr/include/at-spi2-atk/2.0 -I/usr/include/at-spi-2.0 -I/usr/include/dbus-1.0 -I/usr/lib64/dbus-1.0/include -I/usr/include/gtk-3.0 -I/usr/include/cairo -I/usr/include/pango-1.0 -I/usr/include/harfbuzz -I/usr/include/pango-1.0 -I/usr/include/fribidi -I/usr/include/atk-1.0 -I/usr/include/cairo -I/usr/include/pixman-1 -I/usr/include/freetype2 -I/usr/include/libdrm -I/usr/include/libpng16 -I/usr/include/gdk-pixbuf-2.0 -I/usr/include/gio-unix-2.0/ -I/usr/include/libmount -I/usr/include/blkid -I/usr/include/uuid -I/usr/include/glib-2.0 -I/usr/lib64/glib-2.0/include -I/usr/include/p11-kit-1 -pipe -Wall -Wcast-align -Wendif-labels -Werror=declaration-after-statement -Wformat=2 -Werror=format-nonliteral -Werror=format-security -Werror=implicit-function-declaration -Werror=init-self -Werror=missing-include-dirs -Werror=missing-prototypes -Werror=pointer-arith -Wextra -Wfloat-equal -Wlogical-op -Wmisleading-indentation -Wmissing-declarations -Wmissing-include-dirs -Wmissing-format-attribute -Wmissing-noreturn -Wno-missing-field-initializers -Wno-switch-enum -Wno-unused-parameter -Wno-packed -Wshadow -Wsign-compare -Wstrict-aliasing=2 -Wundef -Wuninitialized -Wunsafe-loop-optimizations -Wwrite-strings -fno-common -fdiagnostics-show-option -fno-strict-aliasing -fstack-protector -fstack-protector-strong -fno-semantic-interposition -Wno-deprecated-declarations -Wstrict-null-sentinel -fno-rtti -fno-exceptions -fvisibility=hidden -fvisibility-inlines-hidden -march=native -O2 -pipe -c -o libvte_2_91_la-pty.lo `test -f 'pty.cc' || echo './'`pty.cc
  459. libtool: compile: x86_64-pc-linux-gnu-g++ -DHAVE_CONFIG_H -I. -I.. -DG_LOG_DOMAIN=\"Vte\" -DVTE_API_VERSION=\"2.91\" -DDATADIR=\"/usr/share\" -DLIBEXECDIR=\"/usr/libexec\" -DLOCALEDIR=\"/usr/share/locale\" -DGLIB_DISABLE_DEPRECATION_WARNINGS -DVTE_COMPILATION -UPARSER_INCLUDE_NOP -I./vte -I./vte -pthread -I/usr/include/gtk-3.0 -I/usr/include/at-spi2-atk/2.0 -I/usr/include/at-spi-2.0 -I/usr/include/dbus-1.0 -I/usr/lib64/dbus-1.0/include -I/usr/include/gtk-3.0 -I/usr/include/cairo -I/usr/include/pango-1.0 -I/usr/include/harfbuzz -I/usr/include/pango-1.0 -I/usr/include/fribidi -I/usr/include/atk-1.0 -I/usr/include/cairo -I/usr/include/pixman-1 -I/usr/include/freetype2 -I/usr/include/libdrm -I/usr/include/libpng16 -I/usr/include/gdk-pixbuf-2.0 -I/usr/include/gio-unix-2.0/ -I/usr/include/libmount -I/usr/include/blkid -I/usr/include/uuid -I/usr/include/glib-2.0 -I/usr/lib64/glib-2.0/include -I/usr/include/p11-kit-1 -pipe -Wall -Wcast-align -Wendif-labels -Werror=declaration-after-statement -Wformat=2 -Werror=format-nonliteral -Werror=format-security -Werror=implicit-function-declaration -Werror=init-self -Werror=missing-include-dirs -Werror=missing-prototypes -Werror=pointer-arith -Wextra -Wfloat-equal -Wlogical-op -Wmisleading-indentation -Wmissing-declarations -Wmissing-include-dirs -Wmissing-format-attribute -Wmissing-noreturn -Wno-missing-field-initializers -Wno-switch-enum -Wno-unused-parameter -Wno-packed -Wshadow -Wsign-compare -Wstrict-aliasing=2 -Wundef -Wuninitialized -Wunsafe-loop-optimizations -Wwrite-strings -fno-common -fdiagnostics-show-option -fno-strict-aliasing -fstack-protector -fstack-protector-strong -fno-semantic-interposition -Wno-deprecated-declarations -Wstrict-null-sentinel -fno-rtti -fno-exceptions -fvisibility=hidden -fvisibility-inlines-hidden -march=native -O2 -pipe -c parser.cc -fPIC -DPIC -o .libs/libvte_2_91_la-parser.o
  460. libtool: compile: x86_64-pc-linux-gnu-g++ -DHAVE_CONFIG_H -I. -I.. -DG_LOG_DOMAIN=\"Vte\" -DVTE_API_VERSION=\"2.91\" -DDATADIR=\"/usr/share\" -DLIBEXECDIR=\"/usr/libexec\" -DLOCALEDIR=\"/usr/share/locale\" -DGLIB_DISABLE_DEPRECATION_WARNINGS -DVTE_COMPILATION -UPARSER_INCLUDE_NOP -I./vte -I./vte -pthread -I/usr/include/gtk-3.0 -I/usr/include/at-spi2-atk/2.0 -I/usr/include/at-spi-2.0 -I/usr/include/dbus-1.0 -I/usr/lib64/dbus-1.0/include -I/usr/include/gtk-3.0 -I/usr/include/cairo -I/usr/include/pango-1.0 -I/usr/include/harfbuzz -I/usr/include/pango-1.0 -I/usr/include/fribidi -I/usr/include/atk-1.0 -I/usr/include/cairo -I/usr/include/pixman-1 -I/usr/include/freetype2 -I/usr/include/libdrm -I/usr/include/libpng16 -I/usr/include/gdk-pixbuf-2.0 -I/usr/include/gio-unix-2.0/ -I/usr/include/libmount -I/usr/include/blkid -I/usr/include/uuid -I/usr/include/glib-2.0 -I/usr/lib64/glib-2.0/include -I/usr/include/p11-kit-1 -pipe -Wall -Wcast-align -Wendif-labels -Werror=declaration-after-statement -Wformat=2 -Werror=format-nonliteral -Werror=format-security -Werror=implicit-function-declaration -Werror=init-self -Werror=missing-include-dirs -Werror=missing-prototypes -Werror=pointer-arith -Wextra -Wfloat-equal -Wlogical-op -Wmisleading-indentation -Wmissing-declarations -Wmissing-include-dirs -Wmissing-format-attribute -Wmissing-noreturn -Wno-missing-field-initializers -Wno-switch-enum -Wno-unused-parameter -Wno-packed -Wshadow -Wsign-compare -Wstrict-aliasing=2 -Wundef -Wuninitialized -Wunsafe-loop-optimizations -Wwrite-strings -fno-common -fdiagnostics-show-option -fno-strict-aliasing -fstack-protector -fstack-protector-strong -fno-semantic-interposition -Wno-deprecated-declarations -Wstrict-null-sentinel -fno-rtti -fno-exceptions -fvisibility=hidden -fvisibility-inlines-hidden -march=native -O2 -pipe -c pty.cc -fPIC -DPIC -o .libs/libvte_2_91_la-pty.o
  461. /bin/sh ../libtool --tag=CXX --mode=compile x86_64-pc-linux-gnu-g++ -DHAVE_CONFIG_H -I. -I.. -DG_LOG_DOMAIN=\"Vte\" -DVTE_API_VERSION=\"2.91\" -DDATADIR='"/usr/share"' -DLIBEXECDIR='"/usr/libexec"' -DLOCALEDIR='"/usr/share/locale"' -DGLIB_DISABLE_DEPRECATION_WARNINGS -DVTE_COMPILATION -UPARSER_INCLUDE_NOP -I./vte -I./vte -pthread -I/usr/include/gtk-3.0 -I/usr/include/at-spi2-atk/2.0 -I/usr/include/at-spi-2.0 -I/usr/include/dbus-1.0 -I/usr/lib64/dbus-1.0/include -I/usr/include/gtk-3.0 -I/usr/include/cairo -I/usr/include/pango-1.0 -I/usr/include/harfbuzz -I/usr/include/pango-1.0 -I/usr/include/fribidi -I/usr/include/atk-1.0 -I/usr/include/cairo -I/usr/include/pixman-1 -I/usr/include/freetype2 -I/usr/include/libdrm -I/usr/include/libpng16 -I/usr/include/gdk-pixbuf-2.0 -I/usr/include/gio-unix-2.0/ -I/usr/include/libmount -I/usr/include/blkid -I/usr/include/uuid -I/usr/include/glib-2.0 -I/usr/lib64/glib-2.0/include -I/usr/include/p11-kit-1 -pipe -Wall -Wcast-align -Wendif-labels -Werror=declaration-after-statement -Wformat=2 -Werror=format-nonliteral -Werror=format-security -Werror=implicit-function-declaration -Werror=init-self -Werror=missing-include-dirs -Werror=missing-prototypes -Werror=pointer-arith -Wextra -Wfloat-equal -Wlogical-op -Wmisleading-indentation -Wmissing-declarations -Wmissing-include-dirs -Wmissing-format-attribute -Wmissing-noreturn -Wno-missing-field-initializers -Wno-switch-enum -Wno-unused-parameter -Wno-packed -Wshadow -Wsign-compare -Wstrict-aliasing=2 -Wundef -Wuninitialized -Wunsafe-loop-optimizations -Wwrite-strings -fno-common -fdiagnostics-show-option -fno-strict-aliasing -fstack-protector -fstack-protector-strong -fno-semantic-interposition -Wno-deprecated-declarations -Wstrict-null-sentinel -fno-rtti -fno-exceptions -fvisibility=hidden -fvisibility-inlines-hidden -march=native -O2 -pipe -c -o libvte_2_91_la-reaper.lo `test -f 'reaper.cc' || echo './'`reaper.cc
  462. /bin/sh ../libtool --tag=CXX --mode=compile x86_64-pc-linux-gnu-g++ -DHAVE_CONFIG_H -I. -I.. -DG_LOG_DOMAIN=\"Vte\" -DVTE_API_VERSION=\"2.91\" -DDATADIR='"/usr/share"' -DLIBEXECDIR='"/usr/libexec"' -DLOCALEDIR='"/usr/share/locale"' -DGLIB_DISABLE_DEPRECATION_WARNINGS -DVTE_COMPILATION -UPARSER_INCLUDE_NOP -I./vte -I./vte -pthread -I/usr/include/gtk-3.0 -I/usr/include/at-spi2-atk/2.0 -I/usr/include/at-spi-2.0 -I/usr/include/dbus-1.0 -I/usr/lib64/dbus-1.0/include -I/usr/include/gtk-3.0 -I/usr/include/cairo -I/usr/include/pango-1.0 -I/usr/include/harfbuzz -I/usr/include/pango-1.0 -I/usr/include/fribidi -I/usr/include/atk-1.0 -I/usr/include/cairo -I/usr/include/pixman-1 -I/usr/include/freetype2 -I/usr/include/libdrm -I/usr/include/libpng16 -I/usr/include/gdk-pixbuf-2.0 -I/usr/include/gio-unix-2.0/ -I/usr/include/libmount -I/usr/include/blkid -I/usr/include/uuid -I/usr/include/glib-2.0 -I/usr/lib64/glib-2.0/include -I/usr/include/p11-kit-1 -pipe -Wall -Wcast-align -Wendif-labels -Werror=declaration-after-statement -Wformat=2 -Werror=format-nonliteral -Werror=format-security -Werror=implicit-function-declaration -Werror=init-self -Werror=missing-include-dirs -Werror=missing-prototypes -Werror=pointer-arith -Wextra -Wfloat-equal -Wlogical-op -Wmisleading-indentation -Wmissing-declarations -Wmissing-include-dirs -Wmissing-format-attribute -Wmissing-noreturn -Wno-missing-field-initializers -Wno-switch-enum -Wno-unused-parameter -Wno-packed -Wshadow -Wsign-compare -Wstrict-aliasing=2 -Wundef -Wuninitialized -Wunsafe-loop-optimizations -Wwrite-strings -fno-common -fdiagnostics-show-option -fno-strict-aliasing -fstack-protector -fstack-protector-strong -fno-semantic-interposition -Wno-deprecated-declarations -Wstrict-null-sentinel -fno-rtti -fno-exceptions -fvisibility=hidden -fvisibility-inlines-hidden -march=native -O2 -pipe -c -o libvte_2_91_la-ring.lo `test -f 'ring.cc' || echo './'`ring.cc
  463. libtool: compile: x86_64-pc-linux-gnu-g++ -DHAVE_CONFIG_H -I. -I.. -DG_LOG_DOMAIN=\"Vte\" -DVTE_API_VERSION=\"2.91\" -DDATADIR=\"/usr/share\" -DLIBEXECDIR=\"/usr/libexec\" -DLOCALEDIR=\"/usr/share/locale\" -DGLIB_DISABLE_DEPRECATION_WARNINGS -DVTE_COMPILATION -UPARSER_INCLUDE_NOP -I./vte -I./vte -pthread -I/usr/include/gtk-3.0 -I/usr/include/at-spi2-atk/2.0 -I/usr/include/at-spi-2.0 -I/usr/include/dbus-1.0 -I/usr/lib64/dbus-1.0/include -I/usr/include/gtk-3.0 -I/usr/include/cairo -I/usr/include/pango-1.0 -I/usr/include/harfbuzz -I/usr/include/pango-1.0 -I/usr/include/fribidi -I/usr/include/atk-1.0 -I/usr/include/cairo -I/usr/include/pixman-1 -I/usr/include/freetype2 -I/usr/include/libdrm -I/usr/include/libpng16 -I/usr/include/gdk-pixbuf-2.0 -I/usr/include/gio-unix-2.0/ -I/usr/include/libmount -I/usr/include/blkid -I/usr/include/uuid -I/usr/include/glib-2.0 -I/usr/lib64/glib-2.0/include -I/usr/include/p11-kit-1 -pipe -Wall -Wcast-align -Wendif-labels -Werror=declaration-after-statement -Wformat=2 -Werror=format-nonliteral -Werror=format-security -Werror=implicit-function-declaration -Werror=init-self -Werror=missing-include-dirs -Werror=missing-prototypes -Werror=pointer-arith -Wextra -Wfloat-equal -Wlogical-op -Wmisleading-indentation -Wmissing-declarations -Wmissing-include-dirs -Wmissing-format-attribute -Wmissing-noreturn -Wno-missing-field-initializers -Wno-switch-enum -Wno-unused-parameter -Wno-packed -Wshadow -Wsign-compare -Wstrict-aliasing=2 -Wundef -Wuninitialized -Wunsafe-loop-optimizations -Wwrite-strings -fno-common -fdiagnostics-show-option -fno-strict-aliasing -fstack-protector -fstack-protector-strong -fno-semantic-interposition -Wno-deprecated-declarations -Wstrict-null-sentinel -fno-rtti -fno-exceptions -fvisibility=hidden -fvisibility-inlines-hidden -march=native -O2 -pipe -c reaper.cc -fPIC -DPIC -o .libs/libvte_2_91_la-reaper.o
  464. libtool: compile: x86_64-pc-linux-gnu-g++ -DHAVE_CONFIG_H -I. -I.. -DG_LOG_DOMAIN=\"Vte\" -DVTE_API_VERSION=\"2.91\" -DDATADIR=\"/usr/share\" -DLIBEXECDIR=\"/usr/libexec\" -DLOCALEDIR=\"/usr/share/locale\" -DGLIB_DISABLE_DEPRECATION_WARNINGS -DVTE_COMPILATION -UPARSER_INCLUDE_NOP -I./vte -I./vte -pthread -I/usr/include/gtk-3.0 -I/usr/include/at-spi2-atk/2.0 -I/usr/include/at-spi-2.0 -I/usr/include/dbus-1.0 -I/usr/lib64/dbus-1.0/include -I/usr/include/gtk-3.0 -I/usr/include/cairo -I/usr/include/pango-1.0 -I/usr/include/harfbuzz -I/usr/include/pango-1.0 -I/usr/include/fribidi -I/usr/include/atk-1.0 -I/usr/include/cairo -I/usr/include/pixman-1 -I/usr/include/freetype2 -I/usr/include/libdrm -I/usr/include/libpng16 -I/usr/include/gdk-pixbuf-2.0 -I/usr/include/gio-unix-2.0/ -I/usr/include/libmount -I/usr/include/blkid -I/usr/include/uuid -I/usr/include/glib-2.0 -I/usr/lib64/glib-2.0/include -I/usr/include/p11-kit-1 -pipe -Wall -Wcast-align -Wendif-labels -Werror=declaration-after-statement -Wformat=2 -Werror=format-nonliteral -Werror=format-security -Werror=implicit-function-declaration -Werror=init-self -Werror=missing-include-dirs -Werror=missing-prototypes -Werror=pointer-arith -Wextra -Wfloat-equal -Wlogical-op -Wmisleading-indentation -Wmissing-declarations -Wmissing-include-dirs -Wmissing-format-attribute -Wmissing-noreturn -Wno-missing-field-initializers -Wno-switch-enum -Wno-unused-parameter -Wno-packed -Wshadow -Wsign-compare -Wstrict-aliasing=2 -Wundef -Wuninitialized -Wunsafe-loop-optimizations -Wwrite-strings -fno-common -fdiagnostics-show-option -fno-strict-aliasing -fstack-protector -fstack-protector-strong -fno-semantic-interposition -Wno-deprecated-declarations -Wstrict-null-sentinel -fno-rtti -fno-exceptions -fvisibility=hidden -fvisibility-inlines-hidden -march=native -O2 -pipe -c ring.cc -fPIC -DPIC -o .libs/libvte_2_91_la-ring.o
  465. /bin/sh ../libtool --tag=CXX --mode=compile x86_64-pc-linux-gnu-g++ -DHAVE_CONFIG_H -I. -I.. -DG_LOG_DOMAIN=\"Vte\" -DVTE_API_VERSION=\"2.91\" -DDATADIR='"/usr/share"' -DLIBEXECDIR='"/usr/libexec"' -DLOCALEDIR='"/usr/share/locale"' -DGLIB_DISABLE_DEPRECATION_WARNINGS -DVTE_COMPILATION -UPARSER_INCLUDE_NOP -I./vte -I./vte -pthread -I/usr/include/gtk-3.0 -I/usr/include/at-spi2-atk/2.0 -I/usr/include/at-spi-2.0 -I/usr/include/dbus-1.0 -I/usr/lib64/dbus-1.0/include -I/usr/include/gtk-3.0 -I/usr/include/cairo -I/usr/include/pango-1.0 -I/usr/include/harfbuzz -I/usr/include/pango-1.0 -I/usr/include/fribidi -I/usr/include/atk-1.0 -I/usr/include/cairo -I/usr/include/pixman-1 -I/usr/include/freetype2 -I/usr/include/libdrm -I/usr/include/libpng16 -I/usr/include/gdk-pixbuf-2.0 -I/usr/include/gio-unix-2.0/ -I/usr/include/libmount -I/usr/include/blkid -I/usr/include/uuid -I/usr/include/glib-2.0 -I/usr/lib64/glib-2.0/include -I/usr/include/p11-kit-1 -pipe -Wall -Wcast-align -Wendif-labels -Werror=declaration-after-statement -Wformat=2 -Werror=format-nonliteral -Werror=format-security -Werror=implicit-function-declaration -Werror=init-self -Werror=missing-include-dirs -Werror=missing-prototypes -Werror=pointer-arith -Wextra -Wfloat-equal -Wlogical-op -Wmisleading-indentation -Wmissing-declarations -Wmissing-include-dirs -Wmissing-format-attribute -Wmissing-noreturn -Wno-missing-field-initializers -Wno-switch-enum -Wno-unused-parameter -Wno-packed -Wshadow -Wsign-compare -Wstrict-aliasing=2 -Wundef -Wuninitialized -Wunsafe-loop-optimizations -Wwrite-strings -fno-common -fdiagnostics-show-option -fno-strict-aliasing -fstack-protector -fstack-protector-strong -fno-semantic-interposition -Wno-deprecated-declarations -Wstrict-null-sentinel -fno-rtti -fno-exceptions -fvisibility=hidden -fvisibility-inlines-hidden -march=native -O2 -pipe -c -o libvte_2_91_la-utf8.lo `test -f 'utf8.cc' || echo './'`utf8.cc
  466. /bin/sh ../libtool --tag=CXX --mode=compile x86_64-pc-linux-gnu-g++ -DHAVE_CONFIG_H -I. -I.. -DG_LOG_DOMAIN=\"Vte\" -DVTE_API_VERSION=\"2.91\" -DDATADIR='"/usr/share"' -DLIBEXECDIR='"/usr/libexec"' -DLOCALEDIR='"/usr/share/locale"' -DGLIB_DISABLE_DEPRECATION_WARNINGS -DVTE_COMPILATION -UPARSER_INCLUDE_NOP -I./vte -I./vte -pthread -I/usr/include/gtk-3.0 -I/usr/include/at-spi2-atk/2.0 -I/usr/include/at-spi-2.0 -I/usr/include/dbus-1.0 -I/usr/lib64/dbus-1.0/include -I/usr/include/gtk-3.0 -I/usr/include/cairo -I/usr/include/pango-1.0 -I/usr/include/harfbuzz -I/usr/include/pango-1.0 -I/usr/include/fribidi -I/usr/include/atk-1.0 -I/usr/include/cairo -I/usr/include/pixman-1 -I/usr/include/freetype2 -I/usr/include/libdrm -I/usr/include/libpng16 -I/usr/include/gdk-pixbuf-2.0 -I/usr/include/gio-unix-2.0/ -I/usr/include/libmount -I/usr/include/blkid -I/usr/include/uuid -I/usr/include/glib-2.0 -I/usr/lib64/glib-2.0/include -I/usr/include/p11-kit-1 -pipe -Wall -Wcast-align -Wendif-labels -Werror=declaration-after-statement -Wformat=2 -Werror=format-nonliteral -Werror=format-security -Werror=implicit-function-declaration -Werror=init-self -Werror=missing-include-dirs -Werror=missing-prototypes -Werror=pointer-arith -Wextra -Wfloat-equal -Wlogical-op -Wmisleading-indentation -Wmissing-declarations -Wmissing-include-dirs -Wmissing-format-attribute -Wmissing-noreturn -Wno-missing-field-initializers -Wno-switch-enum -Wno-unused-parameter -Wno-packed -Wshadow -Wsign-compare -Wstrict-aliasing=2 -Wundef -Wuninitialized -Wunsafe-loop-optimizations -Wwrite-strings -fno-common -fdiagnostics-show-option -fno-strict-aliasing -fstack-protector -fstack-protector-strong -fno-semantic-interposition -Wno-deprecated-declarations -Wstrict-null-sentinel -fno-rtti -fno-exceptions -fvisibility=hidden -fvisibility-inlines-hidden -march=native -O2 -pipe -c -o libvte_2_91_la-vte.lo `test -f 'vte.cc' || echo './'`vte.cc
  467. libtool: compile: x86_64-pc-linux-gnu-g++ -DHAVE_CONFIG_H -I. -I.. -DG_LOG_DOMAIN=\"Vte\" -DVTE_API_VERSION=\"2.91\" -DDATADIR=\"/usr/share\" -DLIBEXECDIR=\"/usr/libexec\" -DLOCALEDIR=\"/usr/share/locale\" -DGLIB_DISABLE_DEPRECATION_WARNINGS -DVTE_COMPILATION -UPARSER_INCLUDE_NOP -I./vte -I./vte -pthread -I/usr/include/gtk-3.0 -I/usr/include/at-spi2-atk/2.0 -I/usr/include/at-spi-2.0 -I/usr/include/dbus-1.0 -I/usr/lib64/dbus-1.0/include -I/usr/include/gtk-3.0 -I/usr/include/cairo -I/usr/include/pango-1.0 -I/usr/include/harfbuzz -I/usr/include/pango-1.0 -I/usr/include/fribidi -I/usr/include/atk-1.0 -I/usr/include/cairo -I/usr/include/pixman-1 -I/usr/include/freetype2 -I/usr/include/libdrm -I/usr/include/libpng16 -I/usr/include/gdk-pixbuf-2.0 -I/usr/include/gio-unix-2.0/ -I/usr/include/libmount -I/usr/include/blkid -I/usr/include/uuid -I/usr/include/glib-2.0 -I/usr/lib64/glib-2.0/include -I/usr/include/p11-kit-1 -pipe -Wall -Wcast-align -Wendif-labels -Werror=declaration-after-statement -Wformat=2 -Werror=format-nonliteral -Werror=format-security -Werror=implicit-function-declaration -Werror=init-self -Werror=missing-include-dirs -Werror=missing-prototypes -Werror=pointer-arith -Wextra -Wfloat-equal -Wlogical-op -Wmisleading-indentation -Wmissing-declarations -Wmissing-include-dirs -Wmissing-format-attribute -Wmissing-noreturn -Wno-missing-field-initializers -Wno-switch-enum -Wno-unused-parameter -Wno-packed -Wshadow -Wsign-compare -Wstrict-aliasing=2 -Wundef -Wuninitialized -Wunsafe-loop-optimizations -Wwrite-strings -fno-common -fdiagnostics-show-option -fno-strict-aliasing -fstack-protector -fstack-protector-strong -fno-semantic-interposition -Wno-deprecated-declarations -Wstrict-null-sentinel -fno-rtti -fno-exceptions -fvisibility=hidden -fvisibility-inlines-hidden -march=native -O2 -pipe -c utf8.cc -fPIC -DPIC -o .libs/libvte_2_91_la-utf8.o
  468. /bin/sh ../libtool --tag=CXX --mode=compile x86_64-pc-linux-gnu-g++ -DHAVE_CONFIG_H -I. -I.. -DG_LOG_DOMAIN=\"Vte\" -DVTE_API_VERSION=\"2.91\" -DDATADIR='"/usr/share"' -DLIBEXECDIR='"/usr/libexec"' -DLOCALEDIR='"/usr/share/locale"' -DGLIB_DISABLE_DEPRECATION_WARNINGS -DVTE_COMPILATION -UPARSER_INCLUDE_NOP -I./vte -I./vte -pthread -I/usr/include/gtk-3.0 -I/usr/include/at-spi2-atk/2.0 -I/usr/include/at-spi-2.0 -I/usr/include/dbus-1.0 -I/usr/lib64/dbus-1.0/include -I/usr/include/gtk-3.0 -I/usr/include/cairo -I/usr/include/pango-1.0 -I/usr/include/harfbuzz -I/usr/include/pango-1.0 -I/usr/include/fribidi -I/usr/include/atk-1.0 -I/usr/include/cairo -I/usr/include/pixman-1 -I/usr/include/freetype2 -I/usr/include/libdrm -I/usr/include/libpng16 -I/usr/include/gdk-pixbuf-2.0 -I/usr/include/gio-unix-2.0/ -I/usr/include/libmount -I/usr/include/blkid -I/usr/include/uuid -I/usr/include/glib-2.0 -I/usr/lib64/glib-2.0/include -I/usr/include/p11-kit-1 -pipe -Wall -Wcast-align -Wendif-labels -Werror=declaration-after-statement -Wformat=2 -Werror=format-nonliteral -Werror=format-security -Werror=implicit-function-declaration -Werror=init-self -Werror=missing-include-dirs -Werror=missing-prototypes -Werror=pointer-arith -Wextra -Wfloat-equal -Wlogical-op -Wmisleading-indentation -Wmissing-declarations -Wmissing-include-dirs -Wmissing-format-attribute -Wmissing-noreturn -Wno-missing-field-initializers -Wno-switch-enum -Wno-unused-parameter -Wno-packed -Wshadow -Wsign-compare -Wstrict-aliasing=2 -Wundef -Wuninitialized -Wunsafe-loop-optimizations -Wwrite-strings -fno-common -fdiagnostics-show-option -fno-strict-aliasing -fstack-protector -fstack-protector-strong -fno-semantic-interposition -Wno-deprecated-declarations -Wstrict-null-sentinel -fno-rtti -fno-exceptions -fvisibility=hidden -fvisibility-inlines-hidden -march=native -O2 -pipe -c -o libvte_2_91_la-vteaccess.lo `test -f 'vteaccess.cc' || echo './'`vteaccess.cc
  469. /bin/sh ../libtool --tag=CXX --mode=compile x86_64-pc-linux-gnu-g++ -DHAVE_CONFIG_H -I. -I.. -DG_LOG_DOMAIN=\"Vte\" -DVTE_API_VERSION=\"2.91\" -DDATADIR='"/usr/share"' -DLIBEXECDIR='"/usr/libexec"' -DLOCALEDIR='"/usr/share/locale"' -DGLIB_DISABLE_DEPRECATION_WARNINGS -DVTE_COMPILATION -UPARSER_INCLUDE_NOP -I./vte -I./vte -pthread -I/usr/include/gtk-3.0 -I/usr/include/at-spi2-atk/2.0 -I/usr/include/at-spi-2.0 -I/usr/include/dbus-1.0 -I/usr/lib64/dbus-1.0/include -I/usr/include/gtk-3.0 -I/usr/include/cairo -I/usr/include/pango-1.0 -I/usr/include/harfbuzz -I/usr/include/pango-1.0 -I/usr/include/fribidi -I/usr/include/atk-1.0 -I/usr/include/cairo -I/usr/include/pixman-1 -I/usr/include/freetype2 -I/usr/include/libdrm -I/usr/include/libpng16 -I/usr/include/gdk-pixbuf-2.0 -I/usr/include/gio-unix-2.0/ -I/usr/include/libmount -I/usr/include/blkid -I/usr/include/uuid -I/usr/include/glib-2.0 -I/usr/lib64/glib-2.0/include -I/usr/include/p11-kit-1 -pipe -Wall -Wcast-align -Wendif-labels -Werror=declaration-after-statement -Wformat=2 -Werror=format-nonliteral -Werror=format-security -Werror=implicit-function-declaration -Werror=init-self -Werror=missing-include-dirs -Werror=missing-prototypes -Werror=pointer-arith -Wextra -Wfloat-equal -Wlogical-op -Wmisleading-indentation -Wmissing-declarations -Wmissing-include-dirs -Wmissing-format-attribute -Wmissing-noreturn -Wno-missing-field-initializers -Wno-switch-enum -Wno-unused-parameter -Wno-packed -Wshadow -Wsign-compare -Wstrict-aliasing=2 -Wundef -Wuninitialized -Wunsafe-loop-optimizations -Wwrite-strings -fno-common -fdiagnostics-show-option -fno-strict-aliasing -fstack-protector -fstack-protector-strong -fno-semantic-interposition -Wno-deprecated-declarations -Wstrict-null-sentinel -fno-rtti -fno-exceptions -fvisibility=hidden -fvisibility-inlines-hidden -march=native -O2 -pipe -c -o libvte_2_91_la-vtedraw.lo `test -f 'vtedraw.cc' || echo './'`vtedraw.cc
  470. libtool: compile: x86_64-pc-linux-gnu-g++ -DHAVE_CONFIG_H -I. -I.. -DG_LOG_DOMAIN=\"Vte\" -DVTE_API_VERSION=\"2.91\" -DDATADIR=\"/usr/share\" -DLIBEXECDIR=\"/usr/libexec\" -DLOCALEDIR=\"/usr/share/locale\" -DGLIB_DISABLE_DEPRECATION_WARNINGS -DVTE_COMPILATION -UPARSER_INCLUDE_NOP -I./vte -I./vte -pthread -I/usr/include/gtk-3.0 -I/usr/include/at-spi2-atk/2.0 -I/usr/include/at-spi-2.0 -I/usr/include/dbus-1.0 -I/usr/lib64/dbus-1.0/include -I/usr/include/gtk-3.0 -I/usr/include/cairo -I/usr/include/pango-1.0 -I/usr/include/harfbuzz -I/usr/include/pango-1.0 -I/usr/include/fribidi -I/usr/include/atk-1.0 -I/usr/include/cairo -I/usr/include/pixman-1 -I/usr/include/freetype2 -I/usr/include/libdrm -I/usr/include/libpng16 -I/usr/include/gdk-pixbuf-2.0 -I/usr/include/gio-unix-2.0/ -I/usr/include/libmount -I/usr/include/blkid -I/usr/include/uuid -I/usr/include/glib-2.0 -I/usr/lib64/glib-2.0/include -I/usr/include/p11-kit-1 -pipe -Wall -Wcast-align -Wendif-labels -Werror=declaration-after-statement -Wformat=2 -Werror=format-nonliteral -Werror=format-security -Werror=implicit-function-declaration -Werror=init-self -Werror=missing-include-dirs -Werror=missing-prototypes -Werror=pointer-arith -Wextra -Wfloat-equal -Wlogical-op -Wmisleading-indentation -Wmissing-declarations -Wmissing-include-dirs -Wmissing-format-attribute -Wmissing-noreturn -Wno-missing-field-initializers -Wno-switch-enum -Wno-unused-parameter -Wno-packed -Wshadow -Wsign-compare -Wstrict-aliasing=2 -Wundef -Wuninitialized -Wunsafe-loop-optimizations -Wwrite-strings -fno-common -fdiagnostics-show-option -fno-strict-aliasing -fstack-protector -fstack-protector-strong -fno-semantic-interposition -Wno-deprecated-declarations -Wstrict-null-sentinel -fno-rtti -fno-exceptions -fvisibility=hidden -fvisibility-inlines-hidden -march=native -O2 -pipe -c vte.cc -fPIC -DPIC -o .libs/libvte_2_91_la-vte.o
  471. ring.cc: In member function ‘void vte::base::Ring::rewrap(vte::base::Ring::column_t, VteVisualPosition**)’:
  472. ring.cc:1185:9: warning: unused variable ‘paragraph_start_row’ [-Wunused-variable]
  473. gsize paragraph_start_row = old_row_index - 1;
  474. ^~~~~~~~~~~~~~~~~~~
  475. ring.cc:1186:9: warning: variable ‘paragraph_end_row’ set but not used [-Wunused-but-set-variable]
  476. gsize paragraph_end_row; /* points to beyond the end */
  477. ^~~~~~~~~~~~~~~~~
  478. libtool: compile: x86_64-pc-linux-gnu-g++ -DHAVE_CONFIG_H -I. -I.. -DG_LOG_DOMAIN=\"Vte\" -DVTE_API_VERSION=\"2.91\" -DDATADIR=\"/usr/share\" -DLIBEXECDIR=\"/usr/libexec\" -DLOCALEDIR=\"/usr/share/locale\" -DGLIB_DISABLE_DEPRECATION_WARNINGS -DVTE_COMPILATION -UPARSER_INCLUDE_NOP -I./vte -I./vte -pthread -I/usr/include/gtk-3.0 -I/usr/include/at-spi2-atk/2.0 -I/usr/include/at-spi-2.0 -I/usr/include/dbus-1.0 -I/usr/lib64/dbus-1.0/include -I/usr/include/gtk-3.0 -I/usr/include/cairo -I/usr/include/pango-1.0 -I/usr/include/harfbuzz -I/usr/include/pango-1.0 -I/usr/include/fribidi -I/usr/include/atk-1.0 -I/usr/include/cairo -I/usr/include/pixman-1 -I/usr/include/freetype2 -I/usr/include/libdrm -I/usr/include/libpng16 -I/usr/include/gdk-pixbuf-2.0 -I/usr/include/gio-unix-2.0/ -I/usr/include/libmount -I/usr/include/blkid -I/usr/include/uuid -I/usr/include/glib-2.0 -I/usr/lib64/glib-2.0/include -I/usr/include/p11-kit-1 -pipe -Wall -Wcast-align -Wendif-labels -Werror=declaration-after-statement -Wformat=2 -Werror=format-nonliteral -Werror=format-security -Werror=implicit-function-declaration -Werror=init-self -Werror=missing-include-dirs -Werror=missing-prototypes -Werror=pointer-arith -Wextra -Wfloat-equal -Wlogical-op -Wmisleading-indentation -Wmissing-declarations -Wmissing-include-dirs -Wmissing-format-attribute -Wmissing-noreturn -Wno-missing-field-initializers -Wno-switch-enum -Wno-unused-parameter -Wno-packed -Wshadow -Wsign-compare -Wstrict-aliasing=2 -Wundef -Wuninitialized -Wunsafe-loop-optimizations -Wwrite-strings -fno-common -fdiagnostics-show-option -fno-strict-aliasing -fstack-protector -fstack-protector-strong -fno-semantic-interposition -Wno-deprecated-declarations -Wstrict-null-sentinel -fno-rtti -fno-exceptions -fvisibility=hidden -fvisibility-inlines-hidden -march=native -O2 -pipe -c vteaccess.cc -fPIC -DPIC -o .libs/libvte_2_91_la-vteaccess.o
  479. libtool: compile: x86_64-pc-linux-gnu-g++ -DHAVE_CONFIG_H -I. -I.. -DG_LOG_DOMAIN=\"Vte\" -DVTE_API_VERSION=\"2.91\" -DDATADIR=\"/usr/share\" -DLIBEXECDIR=\"/usr/libexec\" -DLOCALEDIR=\"/usr/share/locale\" -DGLIB_DISABLE_DEPRECATION_WARNINGS -DVTE_COMPILATION -UPARSER_INCLUDE_NOP -I./vte -I./vte -pthread -I/usr/include/gtk-3.0 -I/usr/include/at-spi2-atk/2.0 -I/usr/include/at-spi-2.0 -I/usr/include/dbus-1.0 -I/usr/lib64/dbus-1.0/include -I/usr/include/gtk-3.0 -I/usr/include/cairo -I/usr/include/pango-1.0 -I/usr/include/harfbuzz -I/usr/include/pango-1.0 -I/usr/include/fribidi -I/usr/include/atk-1.0 -I/usr/include/cairo -I/usr/include/pixman-1 -I/usr/include/freetype2 -I/usr/include/libdrm -I/usr/include/libpng16 -I/usr/include/gdk-pixbuf-2.0 -I/usr/include/gio-unix-2.0/ -I/usr/include/libmount -I/usr/include/blkid -I/usr/include/uuid -I/usr/include/glib-2.0 -I/usr/lib64/glib-2.0/include -I/usr/include/p11-kit-1 -pipe -Wall -Wcast-align -Wendif-labels -Werror=declaration-after-statement -Wformat=2 -Werror=format-nonliteral -Werror=format-security -Werror=implicit-function-declaration -Werror=init-self -Werror=missing-include-dirs -Werror=missing-prototypes -Werror=pointer-arith -Wextra -Wfloat-equal -Wlogical-op -Wmisleading-indentation -Wmissing-declarations -Wmissing-include-dirs -Wmissing-format-attribute -Wmissing-noreturn -Wno-missing-field-initializers -Wno-switch-enum -Wno-unused-parameter -Wno-packed -Wshadow -Wsign-compare -Wstrict-aliasing=2 -Wundef -Wuninitialized -Wunsafe-loop-optimizations -Wwrite-strings -fno-common -fdiagnostics-show-option -fno-strict-aliasing -fstack-protector -fstack-protector-strong -fno-semantic-interposition -Wno-deprecated-declarations -Wstrict-null-sentinel -fno-rtti -fno-exceptions -fvisibility=hidden -fvisibility-inlines-hidden -march=native -O2 -pipe -c vtedraw.cc -fPIC -DPIC -o .libs/libvte_2_91_la-vtedraw.o
  480. /bin/sh ../libtool --tag=CXX --mode=compile x86_64-pc-linux-gnu-g++ -DHAVE_CONFIG_H -I. -I.. -DG_LOG_DOMAIN=\"Vte\" -DVTE_API_VERSION=\"2.91\" -DDATADIR='"/usr/share"' -DLIBEXECDIR='"/usr/libexec"' -DLOCALEDIR='"/usr/share/locale"' -DGLIB_DISABLE_DEPRECATION_WARNINGS -DVTE_COMPILATION -UPARSER_INCLUDE_NOP -I./vte -I./vte -pthread -I/usr/include/gtk-3.0 -I/usr/include/at-spi2-atk/2.0 -I/usr/include/at-spi-2.0 -I/usr/include/dbus-1.0 -I/usr/lib64/dbus-1.0/include -I/usr/include/gtk-3.0 -I/usr/include/cairo -I/usr/include/pango-1.0 -I/usr/include/harfbuzz -I/usr/include/pango-1.0 -I/usr/include/fribidi -I/usr/include/atk-1.0 -I/usr/include/cairo -I/usr/include/pixman-1 -I/usr/include/freetype2 -I/usr/include/libdrm -I/usr/include/libpng16 -I/usr/include/gdk-pixbuf-2.0 -I/usr/include/gio-unix-2.0/ -I/usr/include/libmount -I/usr/include/blkid -I/usr/include/uuid -I/usr/include/glib-2.0 -I/usr/lib64/glib-2.0/include -I/usr/include/p11-kit-1 -pipe -Wall -Wcast-align -Wendif-labels -Werror=declaration-after-statement -Wformat=2 -Werror=format-nonliteral -Werror=format-security -Werror=implicit-function-declaration -Werror=init-self -Werror=missing-include-dirs -Werror=missing-prototypes -Werror=pointer-arith -Wextra -Wfloat-equal -Wlogical-op -Wmisleading-indentation -Wmissing-declarations -Wmissing-include-dirs -Wmissing-format-attribute -Wmissing-noreturn -Wno-missing-field-initializers -Wno-switch-enum -Wno-unused-parameter -Wno-packed -Wshadow -Wsign-compare -Wstrict-aliasing=2 -Wundef -Wuninitialized -Wunsafe-loop-optimizations -Wwrite-strings -fno-common -fdiagnostics-show-option -fno-strict-aliasing -fstack-protector -fstack-protector-strong -fno-semantic-interposition -Wno-deprecated-declarations -Wstrict-null-sentinel -fno-rtti -fno-exceptions -fvisibility=hidden -fvisibility-inlines-hidden -march=native -O2 -pipe -c -o libvte_2_91_la-vtegtk.lo `test -f 'vtegtk.cc' || echo './'`vtegtk.cc
  481. libtool: compile: x86_64-pc-linux-gnu-g++ -DHAVE_CONFIG_H -I. -I.. -DG_LOG_DOMAIN=\"Vte\" -DVTE_API_VERSION=\"2.91\" -DDATADIR=\"/usr/share\" -DLIBEXECDIR=\"/usr/libexec\" -DLOCALEDIR=\"/usr/share/locale\" -DGLIB_DISABLE_DEPRECATION_WARNINGS -DVTE_COMPILATION -UPARSER_INCLUDE_NOP -I./vte -I./vte -pthread -I/usr/include/gtk-3.0 -I/usr/include/at-spi2-atk/2.0 -I/usr/include/at-spi-2.0 -I/usr/include/dbus-1.0 -I/usr/lib64/dbus-1.0/include -I/usr/include/gtk-3.0 -I/usr/include/cairo -I/usr/include/pango-1.0 -I/usr/include/harfbuzz -I/usr/include/pango-1.0 -I/usr/include/fribidi -I/usr/include/atk-1.0 -I/usr/include/cairo -I/usr/include/pixman-1 -I/usr/include/freetype2 -I/usr/include/libdrm -I/usr/include/libpng16 -I/usr/include/gdk-pixbuf-2.0 -I/usr/include/gio-unix-2.0/ -I/usr/include/libmount -I/usr/include/blkid -I/usr/include/uuid -I/usr/include/glib-2.0 -I/usr/lib64/glib-2.0/include -I/usr/include/p11-kit-1 -pipe -Wall -Wcast-align -Wendif-labels -Werror=declaration-after-statement -Wformat=2 -Werror=format-nonliteral -Werror=format-security -Werror=implicit-function-declaration -Werror=init-self -Werror=missing-include-dirs -Werror=missing-prototypes -Werror=pointer-arith -Wextra -Wfloat-equal -Wlogical-op -Wmisleading-indentation -Wmissing-declarations -Wmissing-include-dirs -Wmissing-format-attribute -Wmissing-noreturn -Wno-missing-field-initializers -Wno-switch-enum -Wno-unused-parameter -Wno-packed -Wshadow -Wsign-compare -Wstrict-aliasing=2 -Wundef -Wuninitialized -Wunsafe-loop-optimizations -Wwrite-strings -fno-common -fdiagnostics-show-option -fno-strict-aliasing -fstack-protector -fstack-protector-strong -fno-semantic-interposition -Wno-deprecated-declarations -Wstrict-null-sentinel -fno-rtti -fno-exceptions -fvisibility=hidden -fvisibility-inlines-hidden -march=native -O2 -pipe -c vtegtk.cc -fPIC -DPIC -o .libs/libvte_2_91_la-vtegtk.o
  482. vte.cc: In member function ‘void vte::terminal::Terminal::process_incoming()’:
  483. vte.cc:3610:53: warning: unused variable ‘wp_str’ [-Wunused-variable]
  484. char const* wp_str = g_unichar_isprint(c) ? c_buf : _vte_debug_sequence_to_string(c_buf, -1);
  485. ^~~~~~
  486. vte.cc: In member function ‘void vte::terminal::Terminal::expand_rectangle(cairo_rectangle_int_t&) const’:
  487. vte.cc:9354:31: warning: variable ‘old_rect’ set but not used [-Wunused-but-set-variable]
  488. cairo_rectangle_int_t old_rect = rect;
  489. ^~~~~~~~
  490. vte.cc: In member function ‘void vte::terminal::Terminal::process_incoming()’:
  491. vte.cc:3598:33: warning: this statement may fall through [-Wimplicit-fallthrough=]
  492. --ip;
  493. ^~~~
  494. vte.cc:3600:25: note: here
  495. case vte::base::UTF8Decoder::REJECT:
  496. ^~~~
  497. vte.cc:3601:53: warning: this statement may fall through [-Wimplicit-fallthrough=]
  498. m_utf8_decoder.reset();
  499. ~~~~~~~~~~~~~~~~~~~~^~
  500. vte.cc:3604:25: note: here
  501. case vte::base::UTF8Decoder::ACCEPT: {
  502. ^~~~
  503. /bin/sh ../libtool --tag=CXX --mode=compile x86_64-pc-linux-gnu-g++ -DHAVE_CONFIG_H -I. -I.. -DG_LOG_DOMAIN=\"Vte\" -DVTE_API_VERSION=\"2.91\" -DDATADIR='"/usr/share"' -DLIBEXECDIR='"/usr/libexec"' -DLOCALEDIR='"/usr/share/locale"' -DGLIB_DISABLE_DEPRECATION_WARNINGS -DVTE_COMPILATION -UPARSER_INCLUDE_NOP -I./vte -I./vte -pthread -I/usr/include/gtk-3.0 -I/usr/include/at-spi2-atk/2.0 -I/usr/include/at-spi-2.0 -I/usr/include/dbus-1.0 -I/usr/lib64/dbus-1.0/include -I/usr/include/gtk-3.0 -I/usr/include/cairo -I/usr/include/pango-1.0 -I/usr/include/harfbuzz -I/usr/include/pango-1.0 -I/usr/include/fribidi -I/usr/include/atk-1.0 -I/usr/include/cairo -I/usr/include/pixman-1 -I/usr/include/freetype2 -I/usr/include/libdrm -I/usr/include/libpng16 -I/usr/include/gdk-pixbuf-2.0 -I/usr/include/gio-unix-2.0/ -I/usr/include/libmount -I/usr/include/blkid -I/usr/include/uuid -I/usr/include/glib-2.0 -I/usr/lib64/glib-2.0/include -I/usr/include/p11-kit-1 -pipe -Wall -Wcast-align -Wendif-labels -Werror=declaration-after-statement -Wformat=2 -Werror=format-nonliteral -Werror=format-security -Werror=implicit-function-declaration -Werror=init-self -Werror=missing-include-dirs -Werror=missing-prototypes -Werror=pointer-arith -Wextra -Wfloat-equal -Wlogical-op -Wmisleading-indentation -Wmissing-declarations -Wmissing-include-dirs -Wmissing-format-attribute -Wmissing-noreturn -Wno-missing-field-initializers -Wno-switch-enum -Wno-unused-parameter -Wno-packed -Wshadow -Wsign-compare -Wstrict-aliasing=2 -Wundef -Wuninitialized -Wunsafe-loop-optimizations -Wwrite-strings -fno-common -fdiagnostics-show-option -fno-strict-aliasing -fstack-protector -fstack-protector-strong -fno-semantic-interposition -Wno-deprecated-declarations -Wstrict-null-sentinel -fno-rtti -fno-exceptions -fvisibility=hidden -fvisibility-inlines-hidden -march=native -O2 -pipe -c -o libvte_2_91_la-vteregex.lo `test -f 'vteregex.cc' || echo './'`vteregex.cc
  504. /bin/sh ../libtool --tag=CXX --mode=compile x86_64-pc-linux-gnu-g++ -DHAVE_CONFIG_H -I. -I.. -DG_LOG_DOMAIN=\"Vte\" -DVTE_API_VERSION=\"2.91\" -DDATADIR='"/usr/share"' -DLIBEXECDIR='"/usr/libexec"' -DLOCALEDIR='"/usr/share/locale"' -DGLIB_DISABLE_DEPRECATION_WARNINGS -DVTE_COMPILATION -UPARSER_INCLUDE_NOP -I./vte -I./vte -pthread -I/usr/include/gtk-3.0 -I/usr/include/at-spi2-atk/2.0 -I/usr/include/at-spi-2.0 -I/usr/include/dbus-1.0 -I/usr/lib64/dbus-1.0/include -I/usr/include/gtk-3.0 -I/usr/include/cairo -I/usr/include/pango-1.0 -I/usr/include/harfbuzz -I/usr/include/pango-1.0 -I/usr/include/fribidi -I/usr/include/atk-1.0 -I/usr/include/cairo -I/usr/include/pixman-1 -I/usr/include/freetype2 -I/usr/include/libdrm -I/usr/include/libpng16 -I/usr/include/gdk-pixbuf-2.0 -I/usr/include/gio-unix-2.0/ -I/usr/include/libmount -I/usr/include/blkid -I/usr/include/uuid -I/usr/include/glib-2.0 -I/usr/lib64/glib-2.0/include -I/usr/include/p11-kit-1 -pipe -Wall -Wcast-align -Wendif-labels -Werror=declaration-after-statement -Wformat=2 -Werror=format-nonliteral -Werror=format-security -Werror=implicit-function-declaration -Werror=init-self -Werror=missing-include-dirs -Werror=missing-prototypes -Werror=pointer-arith -Wextra -Wfloat-equal -Wlogical-op -Wmisleading-indentation -Wmissing-declarations -Wmissing-include-dirs -Wmissing-format-attribute -Wmissing-noreturn -Wno-missing-field-initializers -Wno-switch-enum -Wno-unused-parameter -Wno-packed -Wshadow -Wsign-compare -Wstrict-aliasing=2 -Wundef -Wuninitialized -Wunsafe-loop-optimizations -Wwrite-strings -fno-common -fdiagnostics-show-option -fno-strict-aliasing -fstack-protector -fstack-protector-strong -fno-semantic-interposition -Wno-deprecated-declarations -Wstrict-null-sentinel -fno-rtti -fno-exceptions -fvisibility=hidden -fvisibility-inlines-hidden -march=native -O2 -pipe -c -o libvte_2_91_la-vterowdata.lo `test -f 'vterowdata.cc' || echo './'`vterowdata.cc
  505. libtool: compile: x86_64-pc-linux-gnu-g++ -DHAVE_CONFIG_H -I. -I.. -DG_LOG_DOMAIN=\"Vte\" -DVTE_API_VERSION=\"2.91\" -DDATADIR=\"/usr/share\" -DLIBEXECDIR=\"/usr/libexec\" -DLOCALEDIR=\"/usr/share/locale\" -DGLIB_DISABLE_DEPRECATION_WARNINGS -DVTE_COMPILATION -UPARSER_INCLUDE_NOP -I./vte -I./vte -pthread -I/usr/include/gtk-3.0 -I/usr/include/at-spi2-atk/2.0 -I/usr/include/at-spi-2.0 -I/usr/include/dbus-1.0 -I/usr/lib64/dbus-1.0/include -I/usr/include/gtk-3.0 -I/usr/include/cairo -I/usr/include/pango-1.0 -I/usr/include/harfbuzz -I/usr/include/pango-1.0 -I/usr/include/fribidi -I/usr/include/atk-1.0 -I/usr/include/cairo -I/usr/include/pixman-1 -I/usr/include/freetype2 -I/usr/include/libdrm -I/usr/include/libpng16 -I/usr/include/gdk-pixbuf-2.0 -I/usr/include/gio-unix-2.0/ -I/usr/include/libmount -I/usr/include/blkid -I/usr/include/uuid -I/usr/include/glib-2.0 -I/usr/lib64/glib-2.0/include -I/usr/include/p11-kit-1 -pipe -Wall -Wcast-align -Wendif-labels -Werror=declaration-after-statement -Wformat=2 -Werror=format-nonliteral -Werror=format-security -Werror=implicit-function-declaration -Werror=init-self -Werror=missing-include-dirs -Werror=missing-prototypes -Werror=pointer-arith -Wextra -Wfloat-equal -Wlogical-op -Wmisleading-indentation -Wmissing-declarations -Wmissing-include-dirs -Wmissing-format-attribute -Wmissing-noreturn -Wno-missing-field-initializers -Wno-switch-enum -Wno-unused-parameter -Wno-packed -Wshadow -Wsign-compare -Wstrict-aliasing=2 -Wundef -Wuninitialized -Wunsafe-loop-optimizations -Wwrite-strings -fno-common -fdiagnostics-show-option -fno-strict-aliasing -fstack-protector -fstack-protector-strong -fno-semantic-interposition -Wno-deprecated-declarations -Wstrict-null-sentinel -fno-rtti -fno-exceptions -fvisibility=hidden -fvisibility-inlines-hidden -march=native -O2 -pipe -c vteregex.cc -fPIC -DPIC -o .libs/libvte_2_91_la-vteregex.o
  506. libtool: compile: x86_64-pc-linux-gnu-g++ -DHAVE_CONFIG_H -I. -I.. -DG_LOG_DOMAIN=\"Vte\" -DVTE_API_VERSION=\"2.91\" -DDATADIR=\"/usr/share\" -DLIBEXECDIR=\"/usr/libexec\" -DLOCALEDIR=\"/usr/share/locale\" -DGLIB_DISABLE_DEPRECATION_WARNINGS -DVTE_COMPILATION -UPARSER_INCLUDE_NOP -I./vte -I./vte -pthread -I/usr/include/gtk-3.0 -I/usr/include/at-spi2-atk/2.0 -I/usr/include/at-spi-2.0 -I/usr/include/dbus-1.0 -I/usr/lib64/dbus-1.0/include -I/usr/include/gtk-3.0 -I/usr/include/cairo -I/usr/include/pango-1.0 -I/usr/include/harfbuzz -I/usr/include/pango-1.0 -I/usr/include/fribidi -I/usr/include/atk-1.0 -I/usr/include/cairo -I/usr/include/pixman-1 -I/usr/include/freetype2 -I/usr/include/libdrm -I/usr/include/libpng16 -I/usr/include/gdk-pixbuf-2.0 -I/usr/include/gio-unix-2.0/ -I/usr/include/libmount -I/usr/include/blkid -I/usr/include/uuid -I/usr/include/glib-2.0 -I/usr/lib64/glib-2.0/include -I/usr/include/p11-kit-1 -pipe -Wall -Wcast-align -Wendif-labels -Werror=declaration-after-statement -Wformat=2 -Werror=format-nonliteral -Werror=format-security -Werror=implicit-function-declaration -Werror=init-self -Werror=missing-include-dirs -Werror=missing-prototypes -Werror=pointer-arith -Wextra -Wfloat-equal -Wlogical-op -Wmisleading-indentation -Wmissing-declarations -Wmissing-include-dirs -Wmissing-format-attribute -Wmissing-noreturn -Wno-missing-field-initializers -Wno-switch-enum -Wno-unused-parameter -Wno-packed -Wshadow -Wsign-compare -Wstrict-aliasing=2 -Wundef -Wuninitialized -Wunsafe-loop-optimizations -Wwrite-strings -fno-common -fdiagnostics-show-option -fno-strict-aliasing -fstack-protector -fstack-protector-strong -fno-semantic-interposition -Wno-deprecated-declarations -Wstrict-null-sentinel -fno-rtti -fno-exceptions -fvisibility=hidden -fvisibility-inlines-hidden -march=native -O2 -pipe -c vterowdata.cc -fPIC -DPIC -o .libs/libvte_2_91_la-vterowdata.o
  507. In file included from /usr/include/glib-2.0/gobject/gobject.h:24,
  508. from /usr/include/glib-2.0/gobject/gbinding.h:29,
  509. from /usr/include/glib-2.0/glib-object.h:23,
  510. from ./vte/vteregex.h:26,
  511. from vteregex.cc:29:
  512. vteregex.cc: In function ‘GType vte_regex_get_type_once()’:
  513. vteregex.cc:108:52: warning: cast between incompatible function types from ‘VteRegex* (*)(VteRegex*)’ {aka ‘_VteRegex* (*)(_VteRegex*)’} to ‘GBoxedFreeFunc’ {aka ‘void (*)(void*)’} [-Wcast-function-type]
  514. vte_regex_ref, (GBoxedFreeFunc)vte_regex_unref)
  515. ^~~~~~~~~~~~~~~
  516. /usr/include/glib-2.0/gobject/gtype.h:2142:52: note: in definition of macro ‘_G_DEFINE_BOXED_TYPE_BEGIN’
  517. (GBoxedFreeFunc) free_func); \
  518. ^~~~~~~~~
  519. /usr/include/glib-2.0/gobject/gtype.h:2050:72: note: in expansion of macro ‘G_DEFINE_BOXED_TYPE_WITH_CODE’
  520. #define G_DEFINE_BOXED_TYPE(TypeName, type_name, copy_func, free_func) G_DEFINE_BOXED_TYPE_WITH_CODE (TypeName, type_name, copy_func, free_func, {})
  521. ^~~~~~~~~~~~~~~~~~~~~~~~~~~~~
  522. vteregex.cc:107:1: note: in expansion of macro ‘G_DEFINE_BOXED_TYPE’
  523. G_DEFINE_BOXED_TYPE(VteRegex, vte_regex,
  524. ^~~~~~~~~~~~~~~~~~~
  525. /bin/sh ../libtool --tag=CXX --mode=compile x86_64-pc-linux-gnu-g++ -DHAVE_CONFIG_H -I. -I.. -DG_LOG_DOMAIN=\"Vte\" -DVTE_API_VERSION=\"2.91\" -DDATADIR='"/usr/share"' -DLIBEXECDIR='"/usr/libexec"' -DLOCALEDIR='"/usr/share/locale"' -DGLIB_DISABLE_DEPRECATION_WARNINGS -DVTE_COMPILATION -UPARSER_INCLUDE_NOP -I./vte -I./vte -pthread -I/usr/include/gtk-3.0 -I/usr/include/at-spi2-atk/2.0 -I/usr/include/at-spi-2.0 -I/usr/include/dbus-1.0 -I/usr/lib64/dbus-1.0/include -I/usr/include/gtk-3.0 -I/usr/include/cairo -I/usr/include/pango-1.0 -I/usr/include/harfbuzz -I/usr/include/pango-1.0 -I/usr/include/fribidi -I/usr/include/atk-1.0 -I/usr/include/cairo -I/usr/include/pixman-1 -I/usr/include/freetype2 -I/usr/include/libdrm -I/usr/include/libpng16 -I/usr/include/gdk-pixbuf-2.0 -I/usr/include/gio-unix-2.0/ -I/usr/include/libmount -I/usr/include/blkid -I/usr/include/uuid -I/usr/include/glib-2.0 -I/usr/lib64/glib-2.0/include -I/usr/include/p11-kit-1 -pipe -Wall -Wcast-align -Wendif-labels -Werror=declaration-after-statement -Wformat=2 -Werror=format-nonliteral -Werror=format-security -Werror=implicit-function-declaration -Werror=init-self -Werror=missing-include-dirs -Werror=missing-prototypes -Werror=pointer-arith -Wextra -Wfloat-equal -Wlogical-op -Wmisleading-indentation -Wmissing-declarations -Wmissing-include-dirs -Wmissing-format-attribute -Wmissing-noreturn -Wno-missing-field-initializers -Wno-switch-enum -Wno-unused-parameter -Wno-packed -Wshadow -Wsign-compare -Wstrict-aliasing=2 -Wundef -Wuninitialized -Wunsafe-loop-optimizations -Wwrite-strings -fno-common -fdiagnostics-show-option -fno-strict-aliasing -fstack-protector -fstack-protector-strong -fno-semantic-interposition -Wno-deprecated-declarations -Wstrict-null-sentinel -fno-rtti -fno-exceptions -fvisibility=hidden -fvisibility-inlines-hidden -march=native -O2 -pipe -c -o libvte_2_91_la-vtespawn.lo `test -f 'vtespawn.cc' || echo './'`vtespawn.cc
  526. /bin/sh ../libtool --tag=CXX --mode=compile x86_64-pc-linux-gnu-g++ -DHAVE_CONFIG_H -I. -I.. -DG_LOG_DOMAIN=\"Vte\" -DVTE_API_VERSION=\"2.91\" -DDATADIR='"/usr/share"' -DLIBEXECDIR='"/usr/libexec"' -DLOCALEDIR='"/usr/share/locale"' -DGLIB_DISABLE_DEPRECATION_WARNINGS -DVTE_COMPILATION -UPARSER_INCLUDE_NOP -I./vte -I./vte -pthread -I/usr/include/gtk-3.0 -I/usr/include/at-spi2-atk/2.0 -I/usr/include/at-spi-2.0 -I/usr/include/dbus-1.0 -I/usr/lib64/dbus-1.0/include -I/usr/include/gtk-3.0 -I/usr/include/cairo -I/usr/include/pango-1.0 -I/usr/include/harfbuzz -I/usr/include/pango-1.0 -I/usr/include/fribidi -I/usr/include/atk-1.0 -I/usr/include/cairo -I/usr/include/pixman-1 -I/usr/include/freetype2 -I/usr/include/libdrm -I/usr/include/libpng16 -I/usr/include/gdk-pixbuf-2.0 -I/usr/include/gio-unix-2.0/ -I/usr/include/libmount -I/usr/include/blkid -I/usr/include/uuid -I/usr/include/glib-2.0 -I/usr/lib64/glib-2.0/include -I/usr/include/p11-kit-1 -pipe -Wall -Wcast-align -Wendif-labels -Werror=declaration-after-statement -Wformat=2 -Werror=format-nonliteral -Werror=format-security -Werror=implicit-function-declaration -Werror=init-self -Werror=missing-include-dirs -Werror=missing-prototypes -Werror=pointer-arith -Wextra -Wfloat-equal -Wlogical-op -Wmisleading-indentation -Wmissing-declarations -Wmissing-include-dirs -Wmissing-format-attribute -Wmissing-noreturn -Wno-missing-field-initializers -Wno-switch-enum -Wno-unused-parameter -Wno-packed -Wshadow -Wsign-compare -Wstrict-aliasing=2 -Wundef -Wuninitialized -Wunsafe-loop-optimizations -Wwrite-strings -fno-common -fdiagnostics-show-option -fno-strict-aliasing -fstack-protector -fstack-protector-strong -fno-semantic-interposition -Wno-deprecated-declarations -Wstrict-null-sentinel -fno-rtti -fno-exceptions -fvisibility=hidden -fvisibility-inlines-hidden -march=native -O2 -pipe -c -o libvte_2_91_la-vteseq.lo `test -f 'vteseq.cc' || echo './'`vteseq.cc
  527. libtool: compile: x86_64-pc-linux-gnu-g++ -DHAVE_CONFIG_H -I. -I.. -DG_LOG_DOMAIN=\"Vte\" -DVTE_API_VERSION=\"2.91\" -DDATADIR=\"/usr/share\" -DLIBEXECDIR=\"/usr/libexec\" -DLOCALEDIR=\"/usr/share/locale\" -DGLIB_DISABLE_DEPRECATION_WARNINGS -DVTE_COMPILATION -UPARSER_INCLUDE_NOP -I./vte -I./vte -pthread -I/usr/include/gtk-3.0 -I/usr/include/at-spi2-atk/2.0 -I/usr/include/at-spi-2.0 -I/usr/include/dbus-1.0 -I/usr/lib64/dbus-1.0/include -I/usr/include/gtk-3.0 -I/usr/include/cairo -I/usr/include/pango-1.0 -I/usr/include/harfbuzz -I/usr/include/pango-1.0 -I/usr/include/fribidi -I/usr/include/atk-1.0 -I/usr/include/cairo -I/usr/include/pixman-1 -I/usr/include/freetype2 -I/usr/include/libdrm -I/usr/include/libpng16 -I/usr/include/gdk-pixbuf-2.0 -I/usr/include/gio-unix-2.0/ -I/usr/include/libmount -I/usr/include/blkid -I/usr/include/uuid -I/usr/include/glib-2.0 -I/usr/lib64/glib-2.0/include -I/usr/include/p11-kit-1 -pipe -Wall -Wcast-align -Wendif-labels -Werror=declaration-after-statement -Wformat=2 -Werror=format-nonliteral -Werror=format-security -Werror=implicit-function-declaration -Werror=init-self -Werror=missing-include-dirs -Werror=missing-prototypes -Werror=pointer-arith -Wextra -Wfloat-equal -Wlogical-op -Wmisleading-indentation -Wmissing-declarations -Wmissing-include-dirs -Wmissing-format-attribute -Wmissing-noreturn -Wno-missing-field-initializers -Wno-switch-enum -Wno-unused-parameter -Wno-packed -Wshadow -Wsign-compare -Wstrict-aliasing=2 -Wundef -Wuninitialized -Wunsafe-loop-optimizations -Wwrite-strings -fno-common -fdiagnostics-show-option -fno-strict-aliasing -fstack-protector -fstack-protector-strong -fno-semantic-interposition -Wno-deprecated-declarations -Wstrict-null-sentinel -fno-rtti -fno-exceptions -fvisibility=hidden -fvisibility-inlines-hidden -march=native -O2 -pipe -c vtespawn.cc -fPIC -DPIC -o .libs/libvte_2_91_la-vtespawn.o
  528. libtool: compile: x86_64-pc-linux-gnu-g++ -DHAVE_CONFIG_H -I. -I.. -DG_LOG_DOMAIN=\"Vte\" -DVTE_API_VERSION=\"2.91\" -DDATADIR=\"/usr/share\" -DLIBEXECDIR=\"/usr/libexec\" -DLOCALEDIR=\"/usr/share/locale\" -DGLIB_DISABLE_DEPRECATION_WARNINGS -DVTE_COMPILATION -UPARSER_INCLUDE_NOP -I./vte -I./vte -pthread -I/usr/include/gtk-3.0 -I/usr/include/at-spi2-atk/2.0 -I/usr/include/at-spi-2.0 -I/usr/include/dbus-1.0 -I/usr/lib64/dbus-1.0/include -I/usr/include/gtk-3.0 -I/usr/include/cairo -I/usr/include/pango-1.0 -I/usr/include/harfbuzz -I/usr/include/pango-1.0 -I/usr/include/fribidi -I/usr/include/atk-1.0 -I/usr/include/cairo -I/usr/include/pixman-1 -I/usr/include/freetype2 -I/usr/include/libdrm -I/usr/include/libpng16 -I/usr/include/gdk-pixbuf-2.0 -I/usr/include/gio-unix-2.0/ -I/usr/include/libmount -I/usr/include/blkid -I/usr/include/uuid -I/usr/include/glib-2.0 -I/usr/lib64/glib-2.0/include -I/usr/include/p11-kit-1 -pipe -Wall -Wcast-align -Wendif-labels -Werror=declaration-after-statement -Wformat=2 -Werror=format-nonliteral -Werror=format-security -Werror=implicit-function-declaration -Werror=init-self -Werror=missing-include-dirs -Werror=missing-prototypes -Werror=pointer-arith -Wextra -Wfloat-equal -Wlogical-op -Wmisleading-indentation -Wmissing-declarations -Wmissing-include-dirs -Wmissing-format-attribute -Wmissing-noreturn -Wno-missing-field-initializers -Wno-switch-enum -Wno-unused-parameter -Wno-packed -Wshadow -Wsign-compare -Wstrict-aliasing=2 -Wundef -Wuninitialized -Wunsafe-loop-optimizations -Wwrite-strings -fno-common -fdiagnostics-show-option -fno-strict-aliasing -fstack-protector -fstack-protector-strong -fno-semantic-interposition -Wno-deprecated-declarations -Wstrict-null-sentinel -fno-rtti -fno-exceptions -fvisibility=hidden -fvisibility-inlines-hidden -march=native -O2 -pipe -c vteseq.cc -fPIC -DPIC -o .libs/libvte_2_91_la-vteseq.o
  529. /bin/sh ../libtool --tag=CXX --mode=compile x86_64-pc-linux-gnu-g++ -DHAVE_CONFIG_H -I. -I.. -DG_LOG_DOMAIN=\"Vte\" -DVTE_API_VERSION=\"2.91\" -DDATADIR='"/usr/share"' -DLIBEXECDIR='"/usr/libexec"' -DLOCALEDIR='"/usr/share/locale"' -DGLIB_DISABLE_DEPRECATION_WARNINGS -DVTE_COMPILATION -UPARSER_INCLUDE_NOP -I./vte -I./vte -pthread -I/usr/include/gtk-3.0 -I/usr/include/at-spi2-atk/2.0 -I/usr/include/at-spi-2.0 -I/usr/include/dbus-1.0 -I/usr/lib64/dbus-1.0/include -I/usr/include/gtk-3.0 -I/usr/include/cairo -I/usr/include/pango-1.0 -I/usr/include/harfbuzz -I/usr/include/pango-1.0 -I/usr/include/fribidi -I/usr/include/atk-1.0 -I/usr/include/cairo -I/usr/include/pixman-1 -I/usr/include/freetype2 -I/usr/include/libdrm -I/usr/include/libpng16 -I/usr/include/gdk-pixbuf-2.0 -I/usr/include/gio-unix-2.0/ -I/usr/include/libmount -I/usr/include/blkid -I/usr/include/uuid -I/usr/include/glib-2.0 -I/usr/lib64/glib-2.0/include -I/usr/include/p11-kit-1 -pipe -Wall -Wcast-align -Wendif-labels -Werror=declaration-after-statement -Wformat=2 -Werror=format-nonliteral -Werror=format-security -Werror=implicit-function-declaration -Werror=init-self -Werror=missing-include-dirs -Werror=missing-prototypes -Werror=pointer-arith -Wextra -Wfloat-equal -Wlogical-op -Wmisleading-indentation -Wmissing-declarations -Wmissing-include-dirs -Wmissing-format-attribute -Wmissing-noreturn -Wno-missing-field-initializers -Wno-switch-enum -Wno-unused-parameter -Wno-packed -Wshadow -Wsign-compare -Wstrict-aliasing=2 -Wundef -Wuninitialized -Wunsafe-loop-optimizations -Wwrite-strings -fno-common -fdiagnostics-show-option -fno-strict-aliasing -fstack-protector -fstack-protector-strong -fno-semantic-interposition -Wno-deprecated-declarations -Wstrict-null-sentinel -fno-rtti -fno-exceptions -fvisibility=hidden -fvisibility-inlines-hidden -march=native -O2 -pipe -c -o libvte_2_91_la-vtestream.lo `test -f 'vtestream.cc' || echo './'`vtestream.cc
  530. /bin/sh ../libtool --tag=CXX --mode=compile x86_64-pc-linux-gnu-g++ -DHAVE_CONFIG_H -I. -I.. -DG_LOG_DOMAIN=\"Vte\" -DVTE_API_VERSION=\"2.91\" -DDATADIR='"/usr/share"' -DLIBEXECDIR='"/usr/libexec"' -DLOCALEDIR='"/usr/share/locale"' -DGLIB_DISABLE_DEPRECATION_WARNINGS -DVTE_COMPILATION -UPARSER_INCLUDE_NOP -I./vte -I./vte -pthread -I/usr/include/gtk-3.0 -I/usr/include/at-spi2-atk/2.0 -I/usr/include/at-spi-2.0 -I/usr/include/dbus-1.0 -I/usr/lib64/dbus-1.0/include -I/usr/include/gtk-3.0 -I/usr/include/cairo -I/usr/include/pango-1.0 -I/usr/include/harfbuzz -I/usr/include/pango-1.0 -I/usr/include/fribidi -I/usr/include/atk-1.0 -I/usr/include/cairo -I/usr/include/pixman-1 -I/usr/include/freetype2 -I/usr/include/libdrm -I/usr/include/libpng16 -I/usr/include/gdk-pixbuf-2.0 -I/usr/include/gio-unix-2.0/ -I/usr/include/libmount -I/usr/include/blkid -I/usr/include/uuid -I/usr/include/glib-2.0 -I/usr/lib64/glib-2.0/include -I/usr/include/p11-kit-1 -pipe -Wall -Wcast-align -Wendif-labels -Werror=declaration-after-statement -Wformat=2 -Werror=format-nonliteral -Werror=format-security -Werror=implicit-function-declaration -Werror=init-self -Werror=missing-include-dirs -Werror=missing-prototypes -Werror=pointer-arith -Wextra -Wfloat-equal -Wlogical-op -Wmisleading-indentation -Wmissing-declarations -Wmissing-include-dirs -Wmissing-format-attribute -Wmissing-noreturn -Wno-missing-field-initializers -Wno-switch-enum -Wno-unused-parameter -Wno-packed -Wshadow -Wsign-compare -Wstrict-aliasing=2 -Wundef -Wuninitialized -Wunsafe-loop-optimizations -Wwrite-strings -fno-common -fdiagnostics-show-option -fno-strict-aliasing -fstack-protector -fstack-protector-strong -fno-semantic-interposition -Wno-deprecated-declarations -Wstrict-null-sentinel -fno-rtti -fno-exceptions -fvisibility=hidden -fvisibility-inlines-hidden -march=native -O2 -pipe -c -o libvte_2_91_la-vtetypes.lo `test -f 'vtetypes.cc' || echo './'`vtetypes.cc
  531. libtool: compile: x86_64-pc-linux-gnu-g++ -DHAVE_CONFIG_H -I. -I.. -DG_LOG_DOMAIN=\"Vte\" -DVTE_API_VERSION=\"2.91\" -DDATADIR=\"/usr/share\" -DLIBEXECDIR=\"/usr/libexec\" -DLOCALEDIR=\"/usr/share/locale\" -DGLIB_DISABLE_DEPRECATION_WARNINGS -DVTE_COMPILATION -UPARSER_INCLUDE_NOP -I./vte -I./vte -pthread -I/usr/include/gtk-3.0 -I/usr/include/at-spi2-atk/2.0 -I/usr/include/at-spi-2.0 -I/usr/include/dbus-1.0 -I/usr/lib64/dbus-1.0/include -I/usr/include/gtk-3.0 -I/usr/include/cairo -I/usr/include/pango-1.0 -I/usr/include/harfbuzz -I/usr/include/pango-1.0 -I/usr/include/fribidi -I/usr/include/atk-1.0 -I/usr/include/cairo -I/usr/include/pixman-1 -I/usr/include/freetype2 -I/usr/include/libdrm -I/usr/include/libpng16 -I/usr/include/gdk-pixbuf-2.0 -I/usr/include/gio-unix-2.0/ -I/usr/include/libmount -I/usr/include/blkid -I/usr/include/uuid -I/usr/include/glib-2.0 -I/usr/lib64/glib-2.0/include -I/usr/include/p11-kit-1 -pipe -Wall -Wcast-align -Wendif-labels -Werror=declaration-after-statement -Wformat=2 -Werror=format-nonliteral -Werror=format-security -Werror=implicit-function-declaration -Werror=init-self -Werror=missing-include-dirs -Werror=missing-prototypes -Werror=pointer-arith -Wextra -Wfloat-equal -Wlogical-op -Wmisleading-indentation -Wmissing-declarations -Wmissing-include-dirs -Wmissing-format-attribute -Wmissing-noreturn -Wno-missing-field-initializers -Wno-switch-enum -Wno-unused-parameter -Wno-packed -Wshadow -Wsign-compare -Wstrict-aliasing=2 -Wundef -Wuninitialized -Wunsafe-loop-optimizations -Wwrite-strings -fno-common -fdiagnostics-show-option -fno-strict-aliasing -fstack-protector -fstack-protector-strong -fno-semantic-interposition -Wno-deprecated-declarations -Wstrict-null-sentinel -fno-rtti -fno-exceptions -fvisibility=hidden -fvisibility-inlines-hidden -march=native -O2 -pipe -c vtestream.cc -fPIC -DPIC -o .libs/libvte_2_91_la-vtestream.o
  532. libtool: compile: x86_64-pc-linux-gnu-g++ -DHAVE_CONFIG_H -I. -I.. -DG_LOG_DOMAIN=\"Vte\" -DVTE_API_VERSION=\"2.91\" -DDATADIR=\"/usr/share\" -DLIBEXECDIR=\"/usr/libexec\" -DLOCALEDIR=\"/usr/share/locale\" -DGLIB_DISABLE_DEPRECATION_WARNINGS -DVTE_COMPILATION -UPARSER_INCLUDE_NOP -I./vte -I./vte -pthread -I/usr/include/gtk-3.0 -I/usr/include/at-spi2-atk/2.0 -I/usr/include/at-spi-2.0 -I/usr/include/dbus-1.0 -I/usr/lib64/dbus-1.0/include -I/usr/include/gtk-3.0 -I/usr/include/cairo -I/usr/include/pango-1.0 -I/usr/include/harfbuzz -I/usr/include/pango-1.0 -I/usr/include/fribidi -I/usr/include/atk-1.0 -I/usr/include/cairo -I/usr/include/pixman-1 -I/usr/include/freetype2 -I/usr/include/libdrm -I/usr/include/libpng16 -I/usr/include/gdk-pixbuf-2.0 -I/usr/include/gio-unix-2.0/ -I/usr/include/libmount -I/usr/include/blkid -I/usr/include/uuid -I/usr/include/glib-2.0 -I/usr/lib64/glib-2.0/include -I/usr/include/p11-kit-1 -pipe -Wall -Wcast-align -Wendif-labels -Werror=declaration-after-statement -Wformat=2 -Werror=format-nonliteral -Werror=format-security -Werror=implicit-function-declaration -Werror=init-self -Werror=missing-include-dirs -Werror=missing-prototypes -Werror=pointer-arith -Wextra -Wfloat-equal -Wlogical-op -Wmisleading-indentation -Wmissing-declarations -Wmissing-include-dirs -Wmissing-format-attribute -Wmissing-noreturn -Wno-missing-field-initializers -Wno-switch-enum -Wno-unused-parameter -Wno-packed -Wshadow -Wsign-compare -Wstrict-aliasing=2 -Wundef -Wuninitialized -Wunsafe-loop-optimizations -Wwrite-strings -fno-common -fdiagnostics-show-option -fno-strict-aliasing -fstack-protector -fstack-protector-strong -fno-semantic-interposition -Wno-deprecated-declarations -Wstrict-null-sentinel -fno-rtti -fno-exceptions -fvisibility=hidden -fvisibility-inlines-hidden -march=native -O2 -pipe -c vtetypes.cc -fPIC -DPIC -o .libs/libvte_2_91_la-vtetypes.o
  533. /bin/sh ../libtool --tag=CXX --mode=compile x86_64-pc-linux-gnu-g++ -DHAVE_CONFIG_H -I. -I.. -DG_LOG_DOMAIN=\"Vte\" -DVTE_API_VERSION=\"2.91\" -DDATADIR='"/usr/share"' -DLIBEXECDIR='"/usr/libexec"' -DLOCALEDIR='"/usr/share/locale"' -DGLIB_DISABLE_DEPRECATION_WARNINGS -DVTE_COMPILATION -UPARSER_INCLUDE_NOP -I./vte -I./vte -pthread -I/usr/include/gtk-3.0 -I/usr/include/at-spi2-atk/2.0 -I/usr/include/at-spi-2.0 -I/usr/include/dbus-1.0 -I/usr/lib64/dbus-1.0/include -I/usr/include/gtk-3.0 -I/usr/include/cairo -I/usr/include/pango-1.0 -I/usr/include/harfbuzz -I/usr/include/pango-1.0 -I/usr/include/fribidi -I/usr/include/atk-1.0 -I/usr/include/cairo -I/usr/include/pixman-1 -I/usr/include/freetype2 -I/usr/include/libdrm -I/usr/include/libpng16 -I/usr/include/gdk-pixbuf-2.0 -I/usr/include/gio-unix-2.0/ -I/usr/include/libmount -I/usr/include/blkid -I/usr/include/uuid -I/usr/include/glib-2.0 -I/usr/lib64/glib-2.0/include -I/usr/include/p11-kit-1 -pipe -Wall -Wcast-align -Wendif-labels -Werror=declaration-after-statement -Wformat=2 -Werror=format-nonliteral -Werror=format-security -Werror=implicit-function-declaration -Werror=init-self -Werror=missing-include-dirs -Werror=missing-prototypes -Werror=pointer-arith -Wextra -Wfloat-equal -Wlogical-op -Wmisleading-indentation -Wmissing-declarations -Wmissing-include-dirs -Wmissing-format-attribute -Wmissing-noreturn -Wno-missing-field-initializers -Wno-switch-enum -Wno-unused-parameter -Wno-packed -Wshadow -Wsign-compare -Wstrict-aliasing=2 -Wundef -Wuninitialized -Wunsafe-loop-optimizations -Wwrite-strings -fno-common -fdiagnostics-show-option -fno-strict-aliasing -fstack-protector -fstack-protector-strong -fno-semantic-interposition -Wno-deprecated-declarations -Wstrict-null-sentinel -fno-rtti -fno-exceptions -fvisibility=hidden -fvisibility-inlines-hidden -march=native -O2 -pipe -c -o libvte_2_91_la-vteunistr.lo `test -f 'vteunistr.cc' || echo './'`vteunistr.cc
  534. /bin/sh ../libtool --tag=CXX --mode=compile x86_64-pc-linux-gnu-g++ -DHAVE_CONFIG_H -I. -I.. -DG_LOG_DOMAIN=\"Vte\" -DVTE_API_VERSION=\"2.91\" -DDATADIR='"/usr/share"' -DLIBEXECDIR='"/usr/libexec"' -DLOCALEDIR='"/usr/share/locale"' -DGLIB_DISABLE_DEPRECATION_WARNINGS -DVTE_COMPILATION -UPARSER_INCLUDE_NOP -I./vte -I./vte -pthread -I/usr/include/gtk-3.0 -I/usr/include/at-spi2-atk/2.0 -I/usr/include/at-spi-2.0 -I/usr/include/dbus-1.0 -I/usr/lib64/dbus-1.0/include -I/usr/include/gtk-3.0 -I/usr/include/cairo -I/usr/include/pango-1.0 -I/usr/include/harfbuzz -I/usr/include/pango-1.0 -I/usr/include/fribidi -I/usr/include/atk-1.0 -I/usr/include/cairo -I/usr/include/pixman-1 -I/usr/include/freetype2 -I/usr/include/libdrm -I/usr/include/libpng16 -I/usr/include/gdk-pixbuf-2.0 -I/usr/include/gio-unix-2.0/ -I/usr/include/libmount -I/usr/include/blkid -I/usr/include/uuid -I/usr/include/glib-2.0 -I/usr/lib64/glib-2.0/include -I/usr/include/p11-kit-1 -pipe -Wall -Wcast-align -Wendif-labels -Werror=declaration-after-statement -Wformat=2 -Werror=format-nonliteral -Werror=format-security -Werror=implicit-function-declaration -Werror=init-self -Werror=missing-include-dirs -Werror=missing-prototypes -Werror=pointer-arith -Wextra -Wfloat-equal -Wlogical-op -Wmisleading-indentation -Wmissing-declarations -Wmissing-include-dirs -Wmissing-format-attribute -Wmissing-noreturn -Wno-missing-field-initializers -Wno-switch-enum -Wno-unused-parameter -Wno-packed -Wshadow -Wsign-compare -Wstrict-aliasing=2 -Wundef -Wuninitialized -Wunsafe-loop-optimizations -Wwrite-strings -fno-common -fdiagnostics-show-option -fno-strict-aliasing -fstack-protector -fstack-protector-strong -fno-semantic-interposition -Wno-deprecated-declarations -Wstrict-null-sentinel -fno-rtti -fno-exceptions -fvisibility=hidden -fvisibility-inlines-hidden -march=native -O2 -pipe -c -o libvte_2_91_la-vteutils.lo `test -f 'vteutils.cc' || echo './'`vteutils.cc
  535. libtool: compile: x86_64-pc-linux-gnu-g++ -DHAVE_CONFIG_H -I. -I.. -DG_LOG_DOMAIN=\"Vte\" -DVTE_API_VERSION=\"2.91\" -DDATADIR=\"/usr/share\" -DLIBEXECDIR=\"/usr/libexec\" -DLOCALEDIR=\"/usr/share/locale\" -DGLIB_DISABLE_DEPRECATION_WARNINGS -DVTE_COMPILATION -UPARSER_INCLUDE_NOP -I./vte -I./vte -pthread -I/usr/include/gtk-3.0 -I/usr/include/at-spi2-atk/2.0 -I/usr/include/at-spi-2.0 -I/usr/include/dbus-1.0 -I/usr/lib64/dbus-1.0/include -I/usr/include/gtk-3.0 -I/usr/include/cairo -I/usr/include/pango-1.0 -I/usr/include/harfbuzz -I/usr/include/pango-1.0 -I/usr/include/fribidi -I/usr/include/atk-1.0 -I/usr/include/cairo -I/usr/include/pixman-1 -I/usr/include/freetype2 -I/usr/include/libdrm -I/usr/include/libpng16 -I/usr/include/gdk-pixbuf-2.0 -I/usr/include/gio-unix-2.0/ -I/usr/include/libmount -I/usr/include/blkid -I/usr/include/uuid -I/usr/include/glib-2.0 -I/usr/lib64/glib-2.0/include -I/usr/include/p11-kit-1 -pipe -Wall -Wcast-align -Wendif-labels -Werror=declaration-after-statement -Wformat=2 -Werror=format-nonliteral -Werror=format-security -Werror=implicit-function-declaration -Werror=init-self -Werror=missing-include-dirs -Werror=missing-prototypes -Werror=pointer-arith -Wextra -Wfloat-equal -Wlogical-op -Wmisleading-indentation -Wmissing-declarations -Wmissing-include-dirs -Wmissing-format-attribute -Wmissing-noreturn -Wno-missing-field-initializers -Wno-switch-enum -Wno-unused-parameter -Wno-packed -Wshadow -Wsign-compare -Wstrict-aliasing=2 -Wundef -Wuninitialized -Wunsafe-loop-optimizations -Wwrite-strings -fno-common -fdiagnostics-show-option -fno-strict-aliasing -fstack-protector -fstack-protector-strong -fno-semantic-interposition -Wno-deprecated-declarations -Wstrict-null-sentinel -fno-rtti -fno-exceptions -fvisibility=hidden -fvisibility-inlines-hidden -march=native -O2 -pipe -c vteunistr.cc -fPIC -DPIC -o .libs/libvte_2_91_la-vteunistr.o
  536. /bin/sh ../libtool --tag=CXX --mode=compile x86_64-pc-linux-gnu-g++ -DHAVE_CONFIG_H -I. -I.. -DG_LOG_DOMAIN=\"Vte\" -DVTE_API_VERSION=\"2.91\" -DDATADIR='"/usr/share"' -DLIBEXECDIR='"/usr/libexec"' -DLOCALEDIR='"/usr/share/locale"' -DGLIB_DISABLE_DEPRECATION_WARNINGS -DVTE_COMPILATION -UPARSER_INCLUDE_NOP -I./vte -I./vte -pthread -I/usr/include/gtk-3.0 -I/usr/include/at-spi2-atk/2.0 -I/usr/include/at-spi-2.0 -I/usr/include/dbus-1.0 -I/usr/lib64/dbus-1.0/include -I/usr/include/gtk-3.0 -I/usr/include/cairo -I/usr/include/pango-1.0 -I/usr/include/harfbuzz -I/usr/include/pango-1.0 -I/usr/include/fribidi -I/usr/include/atk-1.0 -I/usr/include/cairo -I/usr/include/pixman-1 -I/usr/include/freetype2 -I/usr/include/libdrm -I/usr/include/libpng16 -I/usr/include/gdk-pixbuf-2.0 -I/usr/include/gio-unix-2.0/ -I/usr/include/libmount -I/usr/include/blkid -I/usr/include/uuid -I/usr/include/glib-2.0 -I/usr/lib64/glib-2.0/include -I/usr/include/p11-kit-1 -pipe -Wall -Wcast-align -Wendif-labels -Werror=declaration-after-statement -Wformat=2 -Werror=format-nonliteral -Werror=format-security -Werror=implicit-function-declaration -Werror=init-self -Werror=missing-include-dirs -Werror=missing-prototypes -Werror=pointer-arith -Wextra -Wfloat-equal -Wlogical-op -Wmisleading-indentation -Wmissing-declarations -Wmissing-include-dirs -Wmissing-format-attribute -Wmissing-noreturn -Wno-missing-field-initializers -Wno-switch-enum -Wno-unused-parameter -Wno-packed -Wshadow -Wsign-compare -Wstrict-aliasing=2 -Wundef -Wuninitialized -Wunsafe-loop-optimizations -Wwrite-strings -fno-common -fdiagnostics-show-option -fno-strict-aliasing -fstack-protector -fstack-protector-strong -fno-semantic-interposition -Wno-deprecated-declarations -Wstrict-null-sentinel -fno-rtti -fno-exceptions -fvisibility=hidden -fvisibility-inlines-hidden -march=native -O2 -pipe -c -o libvte_2_91_la-widget.lo `test -f 'widget.cc' || echo './'`widget.cc
  537. libtool: compile: x86_64-pc-linux-gnu-g++ -DHAVE_CONFIG_H -I. -I.. -DG_LOG_DOMAIN=\"Vte\" -DVTE_API_VERSION=\"2.91\" -DDATADIR=\"/usr/share\" -DLIBEXECDIR=\"/usr/libexec\" -DLOCALEDIR=\"/usr/share/locale\" -DGLIB_DISABLE_DEPRECATION_WARNINGS -DVTE_COMPILATION -UPARSER_INCLUDE_NOP -I./vte -I./vte -pthread -I/usr/include/gtk-3.0 -I/usr/include/at-spi2-atk/2.0 -I/usr/include/at-spi-2.0 -I/usr/include/dbus-1.0 -I/usr/lib64/dbus-1.0/include -I/usr/include/gtk-3.0 -I/usr/include/cairo -I/usr/include/pango-1.0 -I/usr/include/harfbuzz -I/usr/include/pango-1.0 -I/usr/include/fribidi -I/usr/include/atk-1.0 -I/usr/include/cairo -I/usr/include/pixman-1 -I/usr/include/freetype2 -I/usr/include/libdrm -I/usr/include/libpng16 -I/usr/include/gdk-pixbuf-2.0 -I/usr/include/gio-unix-2.0/ -I/usr/include/libmount -I/usr/include/blkid -I/usr/include/uuid -I/usr/include/glib-2.0 -I/usr/lib64/glib-2.0/include -I/usr/include/p11-kit-1 -pipe -Wall -Wcast-align -Wendif-labels -Werror=declaration-after-statement -Wformat=2 -Werror=format-nonliteral -Werror=format-security -Werror=implicit-function-declaration -Werror=init-self -Werror=missing-include-dirs -Werror=missing-prototypes -Werror=pointer-arith -Wextra -Wfloat-equal -Wlogical-op -Wmisleading-indentation -Wmissing-declarations -Wmissing-include-dirs -Wmissing-format-attribute -Wmissing-noreturn -Wno-missing-field-initializers -Wno-switch-enum -Wno-unused-parameter -Wno-packed -Wshadow -Wsign-compare -Wstrict-aliasing=2 -Wundef -Wuninitialized -Wunsafe-loop-optimizations -Wwrite-strings -fno-common -fdiagnostics-show-option -fno-strict-aliasing -fstack-protector -fstack-protector-strong -fno-semantic-interposition -Wno-deprecated-declarations -Wstrict-null-sentinel -fno-rtti -fno-exceptions -fvisibility=hidden -fvisibility-inlines-hidden -march=native -O2 -pipe -c vteutils.cc -fPIC -DPIC -o .libs/libvte_2_91_la-vteutils.o
  538. /bin/sh ../libtool --tag=CXX --mode=compile x86_64-pc-linux-gnu-g++ -DHAVE_CONFIG_H -I. -I.. -DG_LOG_DOMAIN=\"Vte\" -DVTE_API_VERSION=\"2.91\" -DDATADIR='"/usr/share"' -DLIBEXECDIR='"/usr/libexec"' -DLOCALEDIR='"/usr/share/locale"' -DGLIB_DISABLE_DEPRECATION_WARNINGS -DVTE_COMPILATION -UPARSER_INCLUDE_NOP -I./vte -I./vte -pthread -I/usr/include/gtk-3.0 -I/usr/include/at-spi2-atk/2.0 -I/usr/include/at-spi-2.0 -I/usr/include/dbus-1.0 -I/usr/lib64/dbus-1.0/include -I/usr/include/gtk-3.0 -I/usr/include/cairo -I/usr/include/pango-1.0 -I/usr/include/harfbuzz -I/usr/include/pango-1.0 -I/usr/include/fribidi -I/usr/include/atk-1.0 -I/usr/include/cairo -I/usr/include/pixman-1 -I/usr/include/freetype2 -I/usr/include/libdrm -I/usr/include/libpng16 -I/usr/include/gdk-pixbuf-2.0 -I/usr/include/gio-unix-2.0/ -I/usr/include/libmount -I/usr/include/blkid -I/usr/include/uuid -I/usr/include/glib-2.0 -I/usr/lib64/glib-2.0/include -I/usr/include/p11-kit-1 -pipe -Wall -Wcast-align -Wendif-labels -Werror=declaration-after-statement -Wformat=2 -Werror=format-nonliteral -Werror=format-security -Werror=implicit-function-declaration -Werror=init-self -Werror=missing-include-dirs -Werror=missing-prototypes -Werror=pointer-arith -Wextra -Wfloat-equal -Wlogical-op -Wmisleading-indentation -Wmissing-declarations -Wmissing-include-dirs -Wmissing-format-attribute -Wmissing-noreturn -Wno-missing-field-initializers -Wno-switch-enum -Wno-unused-parameter -Wno-packed -Wshadow -Wsign-compare -Wstrict-aliasing=2 -Wundef -Wuninitialized -Wunsafe-loop-optimizations -Wwrite-strings -fno-common -fdiagnostics-show-option -fno-strict-aliasing -fstack-protector -fstack-protector-strong -fno-semantic-interposition -Wno-deprecated-declarations -Wstrict-null-sentinel -fno-rtti -fno-exceptions -fvisibility=hidden -fvisibility-inlines-hidden -march=native -O2 -pipe -c -o libvte_2_91_la-marshal.lo `test -f 'marshal.cc' || echo './'`marshal.cc
  539. libtool: compile: x86_64-pc-linux-gnu-g++ -DHAVE_CONFIG_H -I. -I.. -DG_LOG_DOMAIN=\"Vte\" -DVTE_API_VERSION=\"2.91\" -DDATADIR=\"/usr/share\" -DLIBEXECDIR=\"/usr/libexec\" -DLOCALEDIR=\"/usr/share/locale\" -DGLIB_DISABLE_DEPRECATION_WARNINGS -DVTE_COMPILATION -UPARSER_INCLUDE_NOP -I./vte -I./vte -pthread -I/usr/include/gtk-3.0 -I/usr/include/at-spi2-atk/2.0 -I/usr/include/at-spi-2.0 -I/usr/include/dbus-1.0 -I/usr/lib64/dbus-1.0/include -I/usr/include/gtk-3.0 -I/usr/include/cairo -I/usr/include/pango-1.0 -I/usr/include/harfbuzz -I/usr/include/pango-1.0 -I/usr/include/fribidi -I/usr/include/atk-1.0 -I/usr/include/cairo -I/usr/include/pixman-1 -I/usr/include/freetype2 -I/usr/include/libdrm -I/usr/include/libpng16 -I/usr/include/gdk-pixbuf-2.0 -I/usr/include/gio-unix-2.0/ -I/usr/include/libmount -I/usr/include/blkid -I/usr/include/uuid -I/usr/include/glib-2.0 -I/usr/lib64/glib-2.0/include -I/usr/include/p11-kit-1 -pipe -Wall -Wcast-align -Wendif-labels -Werror=declaration-after-statement -Wformat=2 -Werror=format-nonliteral -Werror=format-security -Werror=implicit-function-declaration -Werror=init-self -Werror=missing-include-dirs -Werror=missing-prototypes -Werror=pointer-arith -Wextra -Wfloat-equal -Wlogical-op -Wmisleading-indentation -Wmissing-declarations -Wmissing-include-dirs -Wmissing-format-attribute -Wmissing-noreturn -Wno-missing-field-initializers -Wno-switch-enum -Wno-unused-parameter -Wno-packed -Wshadow -Wsign-compare -Wstrict-aliasing=2 -Wundef -Wuninitialized -Wunsafe-loop-optimizations -Wwrite-strings -fno-common -fdiagnostics-show-option -fno-strict-aliasing -fstack-protector -fstack-protector-strong -fno-semantic-interposition -Wno-deprecated-declarations -Wstrict-null-sentinel -fno-rtti -fno-exceptions -fvisibility=hidden -fvisibility-inlines-hidden -march=native -O2 -pipe -c widget.cc -fPIC -DPIC -o .libs/libvte_2_91_la-widget.o
  540. libtool: compile: x86_64-pc-linux-gnu-g++ -DHAVE_CONFIG_H -I. -I.. -DG_LOG_DOMAIN=\"Vte\" -DVTE_API_VERSION=\"2.91\" -DDATADIR=\"/usr/share\" -DLIBEXECDIR=\"/usr/libexec\" -DLOCALEDIR=\"/usr/share/locale\" -DGLIB_DISABLE_DEPRECATION_WARNINGS -DVTE_COMPILATION -UPARSER_INCLUDE_NOP -I./vte -I./vte -pthread -I/usr/include/gtk-3.0 -I/usr/include/at-spi2-atk/2.0 -I/usr/include/at-spi-2.0 -I/usr/include/dbus-1.0 -I/usr/lib64/dbus-1.0/include -I/usr/include/gtk-3.0 -I/usr/include/cairo -I/usr/include/pango-1.0 -I/usr/include/harfbuzz -I/usr/include/pango-1.0 -I/usr/include/fribidi -I/usr/include/atk-1.0 -I/usr/include/cairo -I/usr/include/pixman-1 -I/usr/include/freetype2 -I/usr/include/libdrm -I/usr/include/libpng16 -I/usr/include/gdk-pixbuf-2.0 -I/usr/include/gio-unix-2.0/ -I/usr/include/libmount -I/usr/include/blkid -I/usr/include/uuid -I/usr/include/glib-2.0 -I/usr/lib64/glib-2.0/include -I/usr/include/p11-kit-1 -pipe -Wall -Wcast-align -Wendif-labels -Werror=declaration-after-statement -Wformat=2 -Werror=format-nonliteral -Werror=format-security -Werror=implicit-function-declaration -Werror=init-self -Werror=missing-include-dirs -Werror=missing-prototypes -Werror=pointer-arith -Wextra -Wfloat-equal -Wlogical-op -Wmisleading-indentation -Wmissing-declarations -Wmissing-include-dirs -Wmissing-format-attribute -Wmissing-noreturn -Wno-missing-field-initializers -Wno-switch-enum -Wno-unused-parameter -Wno-packed -Wshadow -Wsign-compare -Wstrict-aliasing=2 -Wundef -Wuninitialized -Wunsafe-loop-optimizations -Wwrite-strings -fno-common -fdiagnostics-show-option -fno-strict-aliasing -fstack-protector -fstack-protector-strong -fno-semantic-interposition -Wno-deprecated-declarations -Wstrict-null-sentinel -fno-rtti -fno-exceptions -fvisibility=hidden -fvisibility-inlines-hidden -march=native -O2 -pipe -c marshal.cc -fPIC -DPIC -o .libs/libvte_2_91_la-marshal.o
  541. /bin/sh ../libtool --tag=CXX --mode=compile x86_64-pc-linux-gnu-g++ -DHAVE_CONFIG_H -I. -I.. -DG_LOG_DOMAIN=\"Vte\" -DVTE_API_VERSION=\"2.91\" -DDATADIR='"/usr/share"' -DLIBEXECDIR='"/usr/libexec"' -DLOCALEDIR='"/usr/share/locale"' -DGLIB_DISABLE_DEPRECATION_WARNINGS -DVTE_COMPILATION -UPARSER_INCLUDE_NOP -I./vte -I./vte -pthread -I/usr/include/gtk-3.0 -I/usr/include/at-spi2-atk/2.0 -I/usr/include/at-spi-2.0 -I/usr/include/dbus-1.0 -I/usr/lib64/dbus-1.0/include -I/usr/include/gtk-3.0 -I/usr/include/cairo -I/usr/include/pango-1.0 -I/usr/include/harfbuzz -I/usr/include/pango-1.0 -I/usr/include/fribidi -I/usr/include/atk-1.0 -I/usr/include/cairo -I/usr/include/pixman-1 -I/usr/include/freetype2 -I/usr/include/libdrm -I/usr/include/libpng16 -I/usr/include/gdk-pixbuf-2.0 -I/usr/include/gio-unix-2.0/ -I/usr/include/libmount -I/usr/include/blkid -I/usr/include/uuid -I/usr/include/glib-2.0 -I/usr/lib64/glib-2.0/include -I/usr/include/p11-kit-1 -pipe -Wall -Wcast-align -Wendif-labels -Werror=declaration-after-statement -Wformat=2 -Werror=format-nonliteral -Werror=format-security -Werror=implicit-function-declaration -Werror=init-self -Werror=missing-include-dirs -Werror=missing-prototypes -Werror=pointer-arith -Wextra -Wfloat-equal -Wlogical-op -Wmisleading-indentation -Wmissing-declarations -Wmissing-include-dirs -Wmissing-format-attribute -Wmissing-noreturn -Wno-missing-field-initializers -Wno-switch-enum -Wno-unused-parameter -Wno-packed -Wshadow -Wsign-compare -Wstrict-aliasing=2 -Wundef -Wuninitialized -Wunsafe-loop-optimizations -Wwrite-strings -fno-common -fdiagnostics-show-option -fno-strict-aliasing -fstack-protector -fstack-protector-strong -fno-semantic-interposition -Wno-deprecated-declarations -Wstrict-null-sentinel -fno-rtti -fno-exceptions -fvisibility=hidden -fvisibility-inlines-hidden -march=native -O2 -pipe -c -o libvte_2_91_la-vteresources.lo `test -f 'vteresources.cc' || echo './'`vteresources.cc
  542. /bin/sh ../libtool --tag=CXX --mode=compile x86_64-pc-linux-gnu-g++ -DHAVE_CONFIG_H -I. -I.. -DG_LOG_DOMAIN=\"Vte\" -DVTE_API_VERSION=\"2.91\" -DDATADIR='"/usr/share"' -DLIBEXECDIR='"/usr/libexec"' -DLOCALEDIR='"/usr/share/locale"' -DGLIB_DISABLE_DEPRECATION_WARNINGS -DVTE_COMPILATION -UPARSER_INCLUDE_NOP -I./vte -I./vte -pthread -I/usr/include/gtk-3.0 -I/usr/include/at-spi2-atk/2.0 -I/usr/include/at-spi-2.0 -I/usr/include/dbus-1.0 -I/usr/lib64/dbus-1.0/include -I/usr/include/gtk-3.0 -I/usr/include/cairo -I/usr/include/pango-1.0 -I/usr/include/harfbuzz -I/usr/include/pango-1.0 -I/usr/include/fribidi -I/usr/include/atk-1.0 -I/usr/include/cairo -I/usr/include/pixman-1 -I/usr/include/freetype2 -I/usr/include/libdrm -I/usr/include/libpng16 -I/usr/include/gdk-pixbuf-2.0 -I/usr/include/gio-unix-2.0/ -I/usr/include/libmount -I/usr/include/blkid -I/usr/include/uuid -I/usr/include/glib-2.0 -I/usr/lib64/glib-2.0/include -I/usr/include/p11-kit-1 -pipe -Wall -Wcast-align -Wendif-labels -Werror=declaration-after-statement -Wformat=2 -Werror=format-nonliteral -Werror=format-security -Werror=implicit-function-declaration -Werror=init-self -Werror=missing-include-dirs -Werror=missing-prototypes -Werror=pointer-arith -Wextra -Wfloat-equal -Wlogical-op -Wmisleading-indentation -Wmissing-declarations -Wmissing-include-dirs -Wmissing-format-attribute -Wmissing-noreturn -Wno-missing-field-initializers -Wno-switch-enum -Wno-unused-parameter -Wno-packed -Wshadow -Wsign-compare -Wstrict-aliasing=2 -Wundef -Wuninitialized -Wunsafe-loop-optimizations -Wwrite-strings -fno-common -fdiagnostics-show-option -fno-strict-aliasing -fstack-protector -fstack-protector-strong -fno-semantic-interposition -Wno-deprecated-declarations -Wstrict-null-sentinel -fno-rtti -fno-exceptions -fvisibility=hidden -fvisibility-inlines-hidden -march=native -O2 -pipe -c -o libvte_2_91_la-vtetypebuiltins.lo `test -f 'vtetypebuiltins.cc' || echo './'`vtetypebuiltins.cc
  543. libtool: compile: x86_64-pc-linux-gnu-g++ -DHAVE_CONFIG_H -I. -I.. -DG_LOG_DOMAIN=\"Vte\" -DVTE_API_VERSION=\"2.91\" -DDATADIR=\"/usr/share\" -DLIBEXECDIR=\"/usr/libexec\" -DLOCALEDIR=\"/usr/share/locale\" -DGLIB_DISABLE_DEPRECATION_WARNINGS -DVTE_COMPILATION -UPARSER_INCLUDE_NOP -I./vte -I./vte -pthread -I/usr/include/gtk-3.0 -I/usr/include/at-spi2-atk/2.0 -I/usr/include/at-spi-2.0 -I/usr/include/dbus-1.0 -I/usr/lib64/dbus-1.0/include -I/usr/include/gtk-3.0 -I/usr/include/cairo -I/usr/include/pango-1.0 -I/usr/include/harfbuzz -I/usr/include/pango-1.0 -I/usr/include/fribidi -I/usr/include/atk-1.0 -I/usr/include/cairo -I/usr/include/pixman-1 -I/usr/include/freetype2 -I/usr/include/libdrm -I/usr/include/libpng16 -I/usr/include/gdk-pixbuf-2.0 -I/usr/include/gio-unix-2.0/ -I/usr/include/libmount -I/usr/include/blkid -I/usr/include/uuid -I/usr/include/glib-2.0 -I/usr/lib64/glib-2.0/include -I/usr/include/p11-kit-1 -pipe -Wall -Wcast-align -Wendif-labels -Werror=declaration-after-statement -Wformat=2 -Werror=format-nonliteral -Werror=format-security -Werror=implicit-function-declaration -Werror=init-self -Werror=missing-include-dirs -Werror=missing-prototypes -Werror=pointer-arith -Wextra -Wfloat-equal -Wlogical-op -Wmisleading-indentation -Wmissing-declarations -Wmissing-include-dirs -Wmissing-format-attribute -Wmissing-noreturn -Wno-missing-field-initializers -Wno-switch-enum -Wno-unused-parameter -Wno-packed -Wshadow -Wsign-compare -Wstrict-aliasing=2 -Wundef -Wuninitialized -Wunsafe-loop-optimizations -Wwrite-strings -fno-common -fdiagnostics-show-option -fno-strict-aliasing -fstack-protector -fstack-protector-strong -fno-semantic-interposition -Wno-deprecated-declarations -Wstrict-null-sentinel -fno-rtti -fno-exceptions -fvisibility=hidden -fvisibility-inlines-hidden -march=native -O2 -pipe -c vteresources.cc -fPIC -DPIC -o .libs/libvte_2_91_la-vteresources.o
  544. libtool: compile: x86_64-pc-linux-gnu-g++ -DHAVE_CONFIG_H -I. -I.. -DG_LOG_DOMAIN=\"Vte\" -DVTE_API_VERSION=\"2.91\" -DDATADIR=\"/usr/share\" -DLIBEXECDIR=\"/usr/libexec\" -DLOCALEDIR=\"/usr/share/locale\" -DGLIB_DISABLE_DEPRECATION_WARNINGS -DVTE_COMPILATION -UPARSER_INCLUDE_NOP -I./vte -I./vte -pthread -I/usr/include/gtk-3.0 -I/usr/include/at-spi2-atk/2.0 -I/usr/include/at-spi-2.0 -I/usr/include/dbus-1.0 -I/usr/lib64/dbus-1.0/include -I/usr/include/gtk-3.0 -I/usr/include/cairo -I/usr/include/pango-1.0 -I/usr/include/harfbuzz -I/usr/include/pango-1.0 -I/usr/include/fribidi -I/usr/include/atk-1.0 -I/usr/include/cairo -I/usr/include/pixman-1 -I/usr/include/freetype2 -I/usr/include/libdrm -I/usr/include/libpng16 -I/usr/include/gdk-pixbuf-2.0 -I/usr/include/gio-unix-2.0/ -I/usr/include/libmount -I/usr/include/blkid -I/usr/include/uuid -I/usr/include/glib-2.0 -I/usr/lib64/glib-2.0/include -I/usr/include/p11-kit-1 -pipe -Wall -Wcast-align -Wendif-labels -Werror=declaration-after-statement -Wformat=2 -Werror=format-nonliteral -Werror=format-security -Werror=implicit-function-declaration -Werror=init-self -Werror=missing-include-dirs -Werror=missing-prototypes -Werror=pointer-arith -Wextra -Wfloat-equal -Wlogical-op -Wmisleading-indentation -Wmissing-declarations -Wmissing-include-dirs -Wmissing-format-attribute -Wmissing-noreturn -Wno-missing-field-initializers -Wno-switch-enum -Wno-unused-parameter -Wno-packed -Wshadow -Wsign-compare -Wstrict-aliasing=2 -Wundef -Wuninitialized -Wunsafe-loop-optimizations -Wwrite-strings -fno-common -fdiagnostics-show-option -fno-strict-aliasing -fstack-protector -fstack-protector-strong -fno-semantic-interposition -Wno-deprecated-declarations -Wstrict-null-sentinel -fno-rtti -fno-exceptions -fvisibility=hidden -fvisibility-inlines-hidden -march=native -O2 -pipe -c vtetypebuiltins.cc -fPIC -DPIC -o .libs/libvte_2_91_la-vtetypebuiltins.o
  545. /bin/sh ../libtool --tag=CXX --mode=link x86_64-pc-linux-gnu-g++ -I/usr/include/glib-2.0 -I/usr/lib64/glib-2.0/include -pipe -Wall -Wcast-align -Wendif-labels -Werror=declaration-after-statement -Wformat=2 -Werror=format-nonliteral -Werror=format-security -Werror=implicit-function-declaration -Werror=init-self -Werror=missing-include-dirs -Werror=missing-prototypes -Werror=pointer-arith -Wextra -Wfloat-equal -Wlogical-op -Wmisleading-indentation -Wmissing-declarations -Wmissing-include-dirs -Wmissing-format-attribute -Wmissing-noreturn -Wno-missing-field-initializers -Wno-switch-enum -Wno-unused-parameter -Wno-packed -Wshadow -Wsign-compare -Wstrict-aliasing=2 -Wundef -Wuninitialized -Wunsafe-loop-optimizations -Wwrite-strings -fno-common -fdiagnostics-show-option -fno-strict-aliasing -fstack-protector -fstack-protector-strong -fno-semantic-interposition -Wno-deprecated-declarations -Wstrict-null-sentinel -fno-rtti -fno-exceptions -fvisibility=hidden -fvisibility-inlines-hidden -march=native -O2 -pipe -Wl,-O1 -Wl,--as-needed -o parser-cat parser_cat-debug.o parser_cat-parser.o parser_cat-parser-cat.o parser_cat-utf8.o -lglib-2.0 -lm
  546. libtool: link: x86_64-pc-linux-gnu-g++ -I/usr/include/glib-2.0 -I/usr/lib64/glib-2.0/include -pipe -Wall -Wcast-align -Wendif-labels -Werror=declaration-after-statement -Wformat=2 -Werror=format-nonliteral -Werror=format-security -Werror=implicit-function-declaration -Werror=init-self -Werror=missing-include-dirs -Werror=missing-prototypes -Werror=pointer-arith -Wextra -Wfloat-equal -Wlogical-op -Wmisleading-indentation -Wmissing-declarations -Wmissing-include-dirs -Wmissing-format-attribute -Wmissing-noreturn -Wno-missing-field-initializers -Wno-switch-enum -Wno-unused-parameter -Wno-packed -Wshadow -Wsign-compare -Wstrict-aliasing=2 -Wundef -Wuninitialized -Wunsafe-loop-optimizations -Wwrite-strings -fno-common -fdiagnostics-show-option -fno-strict-aliasing -fstack-protector -fstack-protector-strong -fno-semantic-interposition -Wno-deprecated-declarations -Wstrict-null-sentinel -fno-rtti -fno-exceptions -fvisibility=hidden -fvisibility-inlines-hidden -march=native -O2 -pipe -Wl,-O1 -o parser-cat parser_cat-debug.o parser_cat-parser.o parser_cat-parser-cat.o parser_cat-utf8.o -Wl,--as-needed /usr/lib/libglib-2.0.so -lpcre -lpthread -lm
  547. /bin/sh ../libtool --tag=CC --mode=link x86_64-pc-linux-gnu-gcc -I/usr/include/glib-2.0 -I/usr/lib64/glib-2.0/include -pipe -Wall -Wcast-align -Wendif-labels -Werror=declaration-after-statement -Wformat=2 -Werror=format-nonliteral -Werror=format-security -Werror=implicit-function-declaration -Werror=init-self -Werror=missing-include-dirs -Werror=missing-prototypes -Werror=pointer-arith -Wextra -Wfloat-equal -Wlogical-op -Wmisleading-indentation -Wmissing-declarations -Wmissing-include-dirs -Wmissing-format-attribute -Wmissing-noreturn -Wno-missing-field-initializers -Wno-switch-enum -Wno-unused-parameter -Wno-packed -Wshadow -Wsign-compare -Wstrict-aliasing=2 -Wundef -Wuninitialized -Wunsafe-loop-optimizations -Wwrite-strings -fno-common -fdiagnostics-show-option -fno-strict-aliasing -fstack-protector -fstack-protector-strong -fno-semantic-interposition -Wno-deprecated-declarations -Waggregate-return -Wimplicit -Wnested-externs -Wold-style-definition -Wstrict-prototypes -march=native -O2 -pipe -Wl,-O1 -Wl,--as-needed -o slowcat slowcat-slowcat.o -lglib-2.0 -lm
  548. /bin/sh ../libtool --tag=CXX --mode=link x86_64-pc-linux-gnu-g++ -I/usr/include/glib-2.0 -I/usr/lib64/glib-2.0/include -pipe -Wall -Wcast-align -Wendif-labels -Werror=declaration-after-statement -Wformat=2 -Werror=format-nonliteral -Werror=format-security -Werror=implicit-function-declaration -Werror=init-self -Werror=missing-include-dirs -Werror=missing-prototypes -Werror=pointer-arith -Wextra -Wfloat-equal -Wlogical-op -Wmisleading-indentation -Wmissing-declarations -Wmissing-include-dirs -Wmissing-format-attribute -Wmissing-noreturn -Wno-missing-field-initializers -Wno-switch-enum -Wno-unused-parameter -Wno-packed -Wshadow -Wsign-compare -Wstrict-aliasing=2 -Wundef -Wuninitialized -Wunsafe-loop-optimizations -Wwrite-strings -fno-common -fdiagnostics-show-option -fno-strict-aliasing -fstack-protector -fstack-protector-strong -fno-semantic-interposition -Wno-deprecated-declarations -Wstrict-null-sentinel -fno-rtti -fno-exceptions -fvisibility=hidden -fvisibility-inlines-hidden -march=native -O2 -pipe -Wl,-O1 -Wl,--as-needed -o test-modes test_modes-modes-test.o -lglib-2.0 -lm
  549. /bin/sh ../libtool --tag=CXX --mode=link x86_64-pc-linux-gnu-g++ -I/usr/include/glib-2.0 -I/usr/lib64/glib-2.0/include -pipe -Wall -Wcast-align -Wendif-labels -Werror=declaration-after-statement -Wformat=2 -Werror=format-nonliteral -Werror=format-security -Werror=implicit-function-declaration -Werror=init-self -Werror=missing-include-dirs -Werror=missing-prototypes -Werror=pointer-arith -Wextra -Wfloat-equal -Wlogical-op -Wmisleading-indentation -Wmissing-declarations -Wmissing-include-dirs -Wmissing-format-attribute -Wmissing-noreturn -Wno-missing-field-initializers -Wno-switch-enum -Wno-unused-parameter -Wno-packed -Wshadow -Wsign-compare -Wstrict-aliasing=2 -Wundef -Wuninitialized -Wunsafe-loop-optimizations -Wwrite-strings -fno-common -fdiagnostics-show-option -fno-strict-aliasing -fstack-protector -fstack-protector-strong -fno-semantic-interposition -Wno-deprecated-declarations -Wstrict-null-sentinel -fno-rtti -fno-exceptions -fvisibility=hidden -fvisibility-inlines-hidden -march=native -O2 -pipe -Wl,-O1 -Wl,--as-needed -o test-tabstops test_tabstops-tabstops-test.o -lglib-2.0 -lm
  550. libtool: link: x86_64-pc-linux-gnu-gcc -I/usr/include/glib-2.0 -I/usr/lib64/glib-2.0/include -pipe -Wall -Wcast-align -Wendif-labels -Werror=declaration-after-statement -Wformat=2 -Werror=format-nonliteral -Werror=format-security -Werror=implicit-function-declaration -Werror=init-self -Werror=missing-include-dirs -Werror=missing-prototypes -Werror=pointer-arith -Wextra -Wfloat-equal -Wlogical-op -Wmisleading-indentation -Wmissing-declarations -Wmissing-include-dirs -Wmissing-format-attribute -Wmissing-noreturn -Wno-missing-field-initializers -Wno-switch-enum -Wno-unused-parameter -Wno-packed -Wshadow -Wsign-compare -Wstrict-aliasing=2 -Wundef -Wuninitialized -Wunsafe-loop-optimizations -Wwrite-strings -fno-common -fdiagnostics-show-option -fno-strict-aliasing -fstack-protector -fstack-protector-strong -fno-semantic-interposition -Wno-deprecated-declarations -Waggregate-return -Wimplicit -Wnested-externs -Wold-style-definition -Wstrict-prototypes -march=native -O2 -pipe -Wl,-O1 -o slowcat slowcat-slowcat.o -Wl,--as-needed /usr/lib/libglib-2.0.so -lpcre -lpthread -lm
  551. /bin/sh ../libtool --tag=CXX --mode=link x86_64-pc-linux-gnu-g++ -pthread -I/usr/include/gtk-3.0 -I/usr/include/at-spi2-atk/2.0 -I/usr/include/at-spi-2.0 -I/usr/include/dbus-1.0 -I/usr/lib64/dbus-1.0/include -I/usr/include/gtk-3.0 -I/usr/include/cairo -I/usr/include/pango-1.0 -I/usr/include/harfbuzz -I/usr/include/pango-1.0 -I/usr/include/fribidi -I/usr/include/atk-1.0 -I/usr/include/cairo -I/usr/include/pixman-1 -I/usr/include/freetype2 -I/usr/include/libdrm -I/usr/include/libpng16 -I/usr/include/gdk-pixbuf-2.0 -I/usr/include/gio-unix-2.0/ -I/usr/include/libmount -I/usr/include/blkid -I/usr/include/uuid -I/usr/include/glib-2.0 -I/usr/lib64/glib-2.0/include -I/usr/include/p11-kit-1 -pipe -Wall -Wcast-align -Wendif-labels -Werror=declaration-after-statement -Wformat=2 -Werror=format-nonliteral -Werror=format-security -Werror=implicit-function-declaration -Werror=init-self -Werror=missing-include-dirs -Werror=missing-prototypes -Werror=pointer-arith -Wextra -Wfloat-equal -Wlogical-op -Wmisleading-indentation -Wmissing-declarations -Wmissing-include-dirs -Wmissing-format-attribute -Wmissing-noreturn -Wno-missing-field-initializers -Wno-switch-enum -Wno-unused-parameter -Wno-packed -Wshadow -Wsign-compare -Wstrict-aliasing=2 -Wundef -Wuninitialized -Wunsafe-loop-optimizations -Wwrite-strings -fno-common -fdiagnostics-show-option -fno-strict-aliasing -fstack-protector -fstack-protector-strong -fno-semantic-interposition -Wno-deprecated-declarations -Wstrict-null-sentinel -fno-rtti -fno-exceptions -fvisibility=hidden -fvisibility-inlines-hidden -march=native -O2 -pipe -Wl,-O1 -Wl,--as-needed -o test-parser test_parser-parser-test.o test_parser-parser.o -lgtk-3 -lgdk-3 -lpangocairo-1.0 -lpango-1.0 -latk-1.0 -lcairo-gobject -lcairo -lgdk_pixbuf-2.0 -lgio-2.0 -lgobject-2.0 -lglib-2.0 -lz -lpcre2-8 -lgnutls -lm
  552. /bin/sh ../libtool --tag=CXX --mode=link x86_64-pc-linux-gnu-g++ -I/usr/include/glib-2.0 -I/usr/lib64/glib-2.0/include -pipe -Wall -Wcast-align -Wendif-labels -Werror=declaration-after-statement -Wformat=2 -Werror=format-nonliteral -Werror=format-security -Werror=implicit-function-declaration -Werror=init-self -Werror=missing-include-dirs -Werror=missing-prototypes -Werror=pointer-arith -Wextra -Wfloat-equal -Wlogical-op -Wmisleading-indentation -Wmissing-declarations -Wmissing-include-dirs -Wmissing-format-attribute -Wmissing-noreturn -Wno-missing-field-initializers -Wno-switch-enum -Wno-unused-parameter -Wno-packed -Wshadow -Wsign-compare -Wstrict-aliasing=2 -Wundef -Wuninitialized -Wunsafe-loop-optimizations -Wwrite-strings -fno-common -fdiagnostics-show-option -fno-strict-aliasing -fstack-protector -fstack-protector-strong -fno-semantic-interposition -Wno-deprecated-declarations -Wstrict-null-sentinel -fno-rtti -fno-exceptions -fvisibility=hidden -fvisibility-inlines-hidden -march=native -O2 -pipe -Wl,-O1 -Wl,--as-needed -o test-refptr test_refptr-refptr-test.o -lgobject-2.0 -lglib-2.0 -lm
  553. libtool: link: x86_64-pc-linux-gnu-g++ -I/usr/include/glib-2.0 -I/usr/lib64/glib-2.0/include -pipe -Wall -Wcast-align -Wendif-labels -Werror=declaration-after-statement -Wformat=2 -Werror=format-nonliteral -Werror=format-security -Werror=implicit-function-declaration -Werror=init-self -Werror=missing-include-dirs -Werror=missing-prototypes -Werror=pointer-arith -Wextra -Wfloat-equal -Wlogical-op -Wmisleading-indentation -Wmissing-declarations -Wmissing-include-dirs -Wmissing-format-attribute -Wmissing-noreturn -Wno-missing-field-initializers -Wno-switch-enum -Wno-unused-parameter -Wno-packed -Wshadow -Wsign-compare -Wstrict-aliasing=2 -Wundef -Wuninitialized -Wunsafe-loop-optimizations -Wwrite-strings -fno-common -fdiagnostics-show-option -fno-strict-aliasing -fstack-protector -fstack-protector-strong -fno-semantic-interposition -Wno-deprecated-declarations -Wstrict-null-sentinel -fno-rtti -fno-exceptions -fvisibility=hidden -fvisibility-inlines-hidden -march=native -O2 -pipe -Wl,-O1 -o test-modes test_modes-modes-test.o -Wl,--as-needed /usr/lib/libglib-2.0.so -lpcre -lpthread -lm
  554. libtool: link: x86_64-pc-linux-gnu-g++ -I/usr/include/glib-2.0 -I/usr/lib64/glib-2.0/include -pipe -Wall -Wcast-align -Wendif-labels -Werror=declaration-after-statement -Wformat=2 -Werror=format-nonliteral -Werror=format-security -Werror=implicit-function-declaration -Werror=init-self -Werror=missing-include-dirs -Werror=missing-prototypes -Werror=pointer-arith -Wextra -Wfloat-equal -Wlogical-op -Wmisleading-indentation -Wmissing-declarations -Wmissing-include-dirs -Wmissing-format-attribute -Wmissing-noreturn -Wno-missing-field-initializers -Wno-switch-enum -Wno-unused-parameter -Wno-packed -Wshadow -Wsign-compare -Wstrict-aliasing=2 -Wundef -Wuninitialized -Wunsafe-loop-optimizations -Wwrite-strings -fno-common -fdiagnostics-show-option -fno-strict-aliasing -fstack-protector -fstack-protector-strong -fno-semantic-interposition -Wno-deprecated-declarations -Wstrict-null-sentinel -fno-rtti -fno-exceptions -fvisibility=hidden -fvisibility-inlines-hidden -march=native -O2 -pipe -Wl,-O1 -o test-tabstops test_tabstops-tabstops-test.o -Wl,--as-needed /usr/lib/libglib-2.0.so -lpcre -lpthread -lm
  555. /bin/sh ../libtool --tag=CXX --mode=link x86_64-pc-linux-gnu-g++ -I/usr/include/glib-2.0 -I/usr/lib64/glib-2.0/include -pipe -Wall -Wcast-align -Wendif-labels -Werror=declaration-after-statement -Wformat=2 -Werror=format-nonliteral -Werror=format-security -Werror=implicit-function-declaration -Werror=init-self -Werror=missing-include-dirs -Werror=missing-prototypes -Werror=pointer-arith -Wextra -Wfloat-equal -Wlogical-op -Wmisleading-indentation -Wmissing-declarations -Wmissing-include-dirs -Wmissing-format-attribute -Wmissing-noreturn -Wno-missing-field-initializers -Wno-switch-enum -Wno-unused-parameter -Wno-packed -Wshadow -Wsign-compare -Wstrict-aliasing=2 -Wundef -Wuninitialized -Wunsafe-loop-optimizations -Wwrite-strings -fno-common -fdiagnostics-show-option -fno-strict-aliasing -fstack-protector -fstack-protector-strong -fno-semantic-interposition -Wno-deprecated-declarations -Wstrict-null-sentinel -fno-rtti -fno-exceptions -fvisibility=hidden -fvisibility-inlines-hidden -march=native -O2 -pipe -Wl,-O1 -Wl,--as-needed -o test-utf8 test_utf8-utf8-test.o test_utf8-utf8.o -lglib-2.0 -lm
  556. /bin/sh ../libtool --tag=CXX --mode=link x86_64-pc-linux-gnu-g++ -pthread -I/usr/include/gtk-3.0 -I/usr/include/at-spi2-atk/2.0 -I/usr/include/at-spi-2.0 -I/usr/include/dbus-1.0 -I/usr/lib64/dbus-1.0/include -I/usr/include/gtk-3.0 -I/usr/include/cairo -I/usr/include/pango-1.0 -I/usr/include/harfbuzz -I/usr/include/pango-1.0 -I/usr/include/fribidi -I/usr/include/atk-1.0 -I/usr/include/cairo -I/usr/include/pixman-1 -I/usr/include/freetype2 -I/usr/include/libdrm -I/usr/include/libpng16 -I/usr/include/gdk-pixbuf-2.0 -I/usr/include/gio-unix-2.0/ -I/usr/include/libmount -I/usr/include/blkid -I/usr/include/uuid -I/usr/include/glib-2.0 -I/usr/lib64/glib-2.0/include -I/usr/include/p11-kit-1 -pipe -Wall -Wcast-align -Wendif-labels -Werror=declaration-after-statement -Wformat=2 -Werror=format-nonliteral -Werror=format-security -Werror=implicit-function-declaration -Werror=init-self -Werror=missing-include-dirs -Werror=missing-prototypes -Werror=pointer-arith -Wextra -Wfloat-equal -Wlogical-op -Wmisleading-indentation -Wmissing-declarations -Wmissing-include-dirs -Wmissing-format-attribute -Wmissing-noreturn -Wno-missing-field-initializers -Wno-switch-enum -Wno-unused-parameter -Wno-packed -Wshadow -Wsign-compare -Wstrict-aliasing=2 -Wundef -Wuninitialized -Wunsafe-loop-optimizations -Wwrite-strings -fno-common -fdiagnostics-show-option -fno-strict-aliasing -fstack-protector -fstack-protector-strong -fno-semantic-interposition -Wno-deprecated-declarations -Wstrict-null-sentinel -fno-rtti -fno-exceptions -fvisibility=hidden -fvisibility-inlines-hidden -march=native -O2 -pipe -Wl,-Bsymbolic-functions -version-info 5400:4:5400 -Wl,-O1 -Wl,--as-needed -o libvte-2.91.la -rpath /usr/lib64 libvte_2_91_la-chunk.lo libvte_2_91_la-debug.lo libvte_2_91_la-keymap.lo libvte_2_91_la-parser.lo libvte_2_91_la-pty.lo libvte_2_91_la-reaper.lo libvte_2_91_la-ring.lo libvte_2_91_la-utf8.lo libvte_2_91_la-vte.lo libvte_2_91_la-vteaccess.lo libvte_2_91_la-vtedraw.lo libvte_2_91_la-vtegtk.lo libvte_2_91_la-vteregex.lo libvte_2_91_la-vterowdata.lo libvte_2_91_la-vtespawn.lo libvte_2_91_la-vteseq.lo libvte_2_91_la-vtestream.lo libvte_2_91_la-vtetypes.lo libvte_2_91_la-vteunistr.lo libvte_2_91_la-vteutils.lo libvte_2_91_la-widget.lo libvte_2_91_la-marshal.lo libvte_2_91_la-vteresources.lo libvte_2_91_la-vtetypebuiltins.lo -lgtk-3 -lgdk-3 -lpangocairo-1.0 -lpango-1.0 -latk-1.0 -lcairo-gobject -lcairo -lgdk_pixbuf-2.0 -lgio-2.0 -lgobject-2.0 -lglib-2.0 -lz -lpcre2-8 -lgnutls -lm
  557. libtool: link: x86_64-pc-linux-gnu-g++ -I/usr/include/glib-2.0 -I/usr/lib64/glib-2.0/include -pipe -Wall -Wcast-align -Wendif-labels -Werror=declaration-after-statement -Wformat=2 -Werror=format-nonliteral -Werror=format-security -Werror=implicit-function-declaration -Werror=init-self -Werror=missing-include-dirs -Werror=missing-prototypes -Werror=pointer-arith -Wextra -Wfloat-equal -Wlogical-op -Wmisleading-indentation -Wmissing-declarations -Wmissing-include-dirs -Wmissing-format-attribute -Wmissing-noreturn -Wno-missing-field-initializers -Wno-switch-enum -Wno-unused-parameter -Wno-packed -Wshadow -Wsign-compare -Wstrict-aliasing=2 -Wundef -Wuninitialized -Wunsafe-loop-optimizations -Wwrite-strings -fno-common -fdiagnostics-show-option -fno-strict-aliasing -fstack-protector -fstack-protector-strong -fno-semantic-interposition -Wno-deprecated-declarations -Wstrict-null-sentinel -fno-rtti -fno-exceptions -fvisibility=hidden -fvisibility-inlines-hidden -march=native -O2 -pipe -Wl,-O1 -o test-refptr test_refptr-refptr-test.o -Wl,--as-needed /usr/lib/libgobject-2.0.so -L/usr/lib64/../lib64 -lffi /usr/lib/libglib-2.0.so -lpcre -lpthread -lm
  558. libtool: link: x86_64-pc-linux-gnu-g++ -pthread -I/usr/include/gtk-3.0 -I/usr/include/at-spi2-atk/2.0 -I/usr/include/at-spi-2.0 -I/usr/include/dbus-1.0 -I/usr/lib64/dbus-1.0/include -I/usr/include/gtk-3.0 -I/usr/include/cairo -I/usr/include/pango-1.0 -I/usr/include/harfbuzz -I/usr/include/pango-1.0 -I/usr/include/fribidi -I/usr/include/atk-1.0 -I/usr/include/cairo -I/usr/include/pixman-1 -I/usr/include/freetype2 -I/usr/include/libdrm -I/usr/include/libpng16 -I/usr/include/gdk-pixbuf-2.0 -I/usr/include/gio-unix-2.0/ -I/usr/include/libmount -I/usr/include/blkid -I/usr/include/uuid -I/usr/include/glib-2.0 -I/usr/lib64/glib-2.0/include -I/usr/include/p11-kit-1 -pipe -Wall -Wcast-align -Wendif-labels -Werror=declaration-after-statement -Wformat=2 -Werror=format-nonliteral -Werror=format-security -Werror=implicit-function-declaration -Werror=init-self -Werror=missing-include-dirs -Werror=missing-prototypes -Werror=pointer-arith -Wextra -Wfloat-equal -Wlogical-op -Wmisleading-indentation -Wmissing-declarations -Wmissing-include-dirs -Wmissing-format-attribute -Wmissing-noreturn -Wno-missing-field-initializers -Wno-switch-enum -Wno-unused-parameter -Wno-packed -Wshadow -Wsign-compare -Wstrict-aliasing=2 -Wundef -Wuninitialized -Wunsafe-loop-optimizations -Wwrite-strings -fno-common -fdiagnostics-show-option -fno-strict-aliasing -fstack-protector -fstack-protector-strong -fno-semantic-interposition -Wno-deprecated-declarations -Wstrict-null-sentinel -fno-rtti -fno-exceptions -fvisibility=hidden -fvisibility-inlines-hidden -march=native -O2 -pipe -Wl,-O1 -o test-parser test_parser-parser-test.o test_parser-parser.o -Wl,--as-needed -lgtk-3 -lgdk-3 -lpangocairo-1.0 -lpango-1.0 -latk-1.0 -lcairo-gobject -lcairo -lgdk_pixbuf-2.0 /usr/lib/libgio-2.0.so -L/usr/lib64/../lib64 /usr/lib/libgmodule-2.0.so -ldl -lresolv -lmount /usr/lib/libgobject-2.0.so -lffi /usr/lib/libglib-2.0.so -lpcre -lpthread -lz -lpcre2-8 -lgnutls -lm -pthread
  559. libtool: link: x86_64-pc-linux-gnu-g++ -I/usr/include/glib-2.0 -I/usr/lib64/glib-2.0/include -pipe -Wall -Wcast-align -Wendif-labels -Werror=declaration-after-statement -Wformat=2 -Werror=format-nonliteral -Werror=format-security -Werror=implicit-function-declaration -Werror=init-self -Werror=missing-include-dirs -Werror=missing-prototypes -Werror=pointer-arith -Wextra -Wfloat-equal -Wlogical-op -Wmisleading-indentation -Wmissing-declarations -Wmissing-include-dirs -Wmissing-format-attribute -Wmissing-noreturn -Wno-missing-field-initializers -Wno-switch-enum -Wno-unused-parameter -Wno-packed -Wshadow -Wsign-compare -Wstrict-aliasing=2 -Wundef -Wuninitialized -Wunsafe-loop-optimizations -Wwrite-strings -fno-common -fdiagnostics-show-option -fno-strict-aliasing -fstack-protector -fstack-protector-strong -fno-semantic-interposition -Wno-deprecated-declarations -Wstrict-null-sentinel -fno-rtti -fno-exceptions -fvisibility=hidden -fvisibility-inlines-hidden -march=native -O2 -pipe -Wl,-O1 -o test-utf8 test_utf8-utf8-test.o test_utf8-utf8.o -Wl,--as-needed /usr/lib/libglib-2.0.so -lpcre -lpthread -lm
  560. libtool: link: x86_64-pc-linux-gnu-g++ -fPIC -DPIC -shared -nostdlib /usr/lib/gcc/x86_64-pc-linux-gnu/8.2.0/../../../../lib64/crti.o /usr/lib/gcc/x86_64-pc-linux-gnu/8.2.0/crtbeginS.o .libs/libvte_2_91_la-chunk.o .libs/libvte_2_91_la-debug.o .libs/libvte_2_91_la-keymap.o .libs/libvte_2_91_la-parser.o .libs/libvte_2_91_la-pty.o .libs/libvte_2_91_la-reaper.o .libs/libvte_2_91_la-ring.o .libs/libvte_2_91_la-utf8.o .libs/libvte_2_91_la-vte.o .libs/libvte_2_91_la-vteaccess.o .libs/libvte_2_91_la-vtedraw.o .libs/libvte_2_91_la-vtegtk.o .libs/libvte_2_91_la-vteregex.o .libs/libvte_2_91_la-vterowdata.o .libs/libvte_2_91_la-vtespawn.o .libs/libvte_2_91_la-vteseq.o .libs/libvte_2_91_la-vtestream.o .libs/libvte_2_91_la-vtetypes.o .libs/libvte_2_91_la-vteunistr.o .libs/libvte_2_91_la-vteutils.o .libs/libvte_2_91_la-widget.o .libs/libvte_2_91_la-marshal.o .libs/libvte_2_91_la-vteresources.o .libs/libvte_2_91_la-vtetypebuiltins.o -Wl,--as-needed -lgtk-3 -lgdk-3 -lpangocairo-1.0 -lpango-1.0 -latk-1.0 -lcairo-gobject -lcairo -lgdk_pixbuf-2.0 /usr/lib/libgio-2.0.so -L/usr/lib64/../lib64 -L/usr/lib /usr/lib/libgmodule-2.0.so -ldl -lresolv -lmount /usr/lib/libgobject-2.0.so -lffi /usr/lib/libglib-2.0.so -lpcre -lpthread -lz -lpcre2-8 -lgnutls -L/usr/lib/gcc/x86_64-pc-linux-gnu/8.2.0 -L/usr/lib/gcc/x86_64-pc-linux-gnu/8.2.0/../../../../lib64 -L/lib/../lib64 -L/usr/lib/../lib64 -L/usr/lib/gcc/x86_64-pc-linux-gnu/8.2.0/../../../../x86_64-pc-linux-gnu/lib -L/usr/lib/gcc/x86_64-pc-linux-gnu/8.2.0/../../.. -lstdc++ -lm -lc -lgcc_s /usr/lib/gcc/x86_64-pc-linux-gnu/8.2.0/crtendS.o /usr/lib/gcc/x86_64-pc-linux-gnu/8.2.0/../../../../lib64/crtn.o -pthread -fstack-protector -fstack-protector-strong -march=native -O2 -Wl,-Bsymbolic-functions -Wl,-O1 -pthread -Wl,-soname -Wl,libvte-2.91.so.0 -o .libs/libvte-2.91.so.0.5400.4
  561. libtool: link: (cd ".libs" && rm -f "libvte-2.91.so.0" && ln -s "libvte-2.91.so.0.5400.4" "libvte-2.91.so.0")
  562. libtool: link: (cd ".libs" && rm -f "libvte-2.91.so" && ln -s "libvte-2.91.so.0.5400.4" "libvte-2.91.so")
  563. libtool: link: ( cd ".libs" && rm -f "libvte-2.91.la" && ln -s "../libvte-2.91.la" "libvte-2.91.la" )
  564. make[4]: Leaving directory '/var/tmp/portage/x11-libs/vte-0.54.4/work/vte-0.54.4/src'
  565. Making all in app
  566. make[4]: Entering directory '/var/tmp/portage/x11-libs/vte-0.54.4/work/vte-0.54.4/src/app'
  567. XMLLINT=/usr/bin/xmllint /usr/bin/glib-compile-resources --target resources.cc --sourcedir . --generate-source --c-name app app.gresource.xml
  568. make all-am
  569. make[5]: Entering directory '/var/tmp/portage/x11-libs/vte-0.54.4/work/vte-0.54.4/src/app'
  570. x86_64-pc-linux-gnu-g++ -DHAVE_CONFIG_H -I. -I../.. -DG_LOG_DOMAIN=\"Vte\" -DLOCALEDIR='"/usr/share/locale"' -I../../src -I../../src/vte -I../../src/vte -pthread -I/usr/include/gtk-3.0 -I/usr/include/at-spi2-atk/2.0 -I/usr/include/at-spi-2.0 -I/usr/include/dbus-1.0 -I/usr/lib64/dbus-1.0/include -I/usr/include/gtk-3.0 -I/usr/include/gio-unix-2.0/ -I/usr/include/cairo -I/usr/include/pango-1.0 -I/usr/include/harfbuzz -I/usr/include/pango-1.0 -I/usr/include/fribidi -I/usr/include/atk-1.0 -I/usr/include/cairo -I/usr/include/pixman-1 -I/usr/include/freetype2 -I/usr/include/libdrm -I/usr/include/libpng16 -I/usr/include/gdk-pixbuf-2.0 -I/usr/include/libmount -I/usr/include/blkid -I/usr/include/uuid -I/usr/include/glib-2.0 -I/usr/lib64/glib-2.0/include -pipe -Wall -Wcast-align -Wendif-labels -Werror=declaration-after-statement -Wformat=2 -Werror=format-nonliteral -Werror=format-security -Werror=implicit-function-declaration -Werror=init-self -Werror=missing-include-dirs -Werror=missing-prototypes -Werror=pointer-arith -Wextra -Wfloat-equal -Wlogical-op -Wmisleading-indentation -Wmissing-declarations -Wmissing-include-dirs -Wmissing-format-attribute -Wmissing-noreturn -Wno-missing-field-initializers -Wno-switch-enum -Wno-unused-parameter -Wno-packed -Wshadow -Wsign-compare -Wstrict-aliasing=2 -Wundef -Wuninitialized -Wunsafe-loop-optimizations -Wwrite-strings -fno-common -fdiagnostics-show-option -fno-strict-aliasing -fstack-protector -fstack-protector-strong -fno-semantic-interposition -Wno-deprecated-declarations -Wstrict-null-sentinel -fno-rtti -fno-exceptions -fvisibility=hidden -fvisibility-inlines-hidden -march=native -O2 -pipe -c -o vte_2_91-app.o `test -f 'app.cc' || echo './'`app.cc
  571. x86_64-pc-linux-gnu-g++ -DHAVE_CONFIG_H -I. -I../.. -DG_LOG_DOMAIN=\"Vte\" -DLOCALEDIR='"/usr/share/locale"' -I../../src -I../../src/vte -I../../src/vte -pthread -I/usr/include/gtk-3.0 -I/usr/include/at-spi2-atk/2.0 -I/usr/include/at-spi-2.0 -I/usr/include/dbus-1.0 -I/usr/lib64/dbus-1.0/include -I/usr/include/gtk-3.0 -I/usr/include/gio-unix-2.0/ -I/usr/include/cairo -I/usr/include/pango-1.0 -I/usr/include/harfbuzz -I/usr/include/pango-1.0 -I/usr/include/fribidi -I/usr/include/atk-1.0 -I/usr/include/cairo -I/usr/include/pixman-1 -I/usr/include/freetype2 -I/usr/include/libdrm -I/usr/include/libpng16 -I/usr/include/gdk-pixbuf-2.0 -I/usr/include/libmount -I/usr/include/blkid -I/usr/include/uuid -I/usr/include/glib-2.0 -I/usr/lib64/glib-2.0/include -pipe -Wall -Wcast-align -Wendif-labels -Werror=declaration-after-statement -Wformat=2 -Werror=format-nonliteral -Werror=format-security -Werror=implicit-function-declaration -Werror=init-self -Werror=missing-include-dirs -Werror=missing-prototypes -Werror=pointer-arith -Wextra -Wfloat-equal -Wlogical-op -Wmisleading-indentation -Wmissing-declarations -Wmissing-include-dirs -Wmissing-format-attribute -Wmissing-noreturn -Wno-missing-field-initializers -Wno-switch-enum -Wno-unused-parameter -Wno-packed -Wshadow -Wsign-compare -Wstrict-aliasing=2 -Wundef -Wuninitialized -Wunsafe-loop-optimizations -Wwrite-strings -fno-common -fdiagnostics-show-option -fno-strict-aliasing -fstack-protector -fstack-protector-strong -fno-semantic-interposition -Wno-deprecated-declarations -Wstrict-null-sentinel -fno-rtti -fno-exceptions -fvisibility=hidden -fvisibility-inlines-hidden -march=native -O2 -pipe -c -o vte_2_91-resources.o `test -f 'resources.cc' || echo './'`resources.cc
  572. /bin/sh ../../libtool --tag=CXX --mode=link x86_64-pc-linux-gnu-g++ -pthread -I/usr/include/gtk-3.0 -I/usr/include/at-spi2-atk/2.0 -I/usr/include/at-spi-2.0 -I/usr/include/dbus-1.0 -I/usr/lib64/dbus-1.0/include -I/usr/include/gtk-3.0 -I/usr/include/gio-unix-2.0/ -I/usr/include/cairo -I/usr/include/pango-1.0 -I/usr/include/harfbuzz -I/usr/include/pango-1.0 -I/usr/include/fribidi -I/usr/include/atk-1.0 -I/usr/include/cairo -I/usr/include/pixman-1 -I/usr/include/freetype2 -I/usr/include/libdrm -I/usr/include/libpng16 -I/usr/include/gdk-pixbuf-2.0 -I/usr/include/libmount -I/usr/include/blkid -I/usr/include/uuid -I/usr/include/glib-2.0 -I/usr/lib64/glib-2.0/include -pipe -Wall -Wcast-align -Wendif-labels -Werror=declaration-after-statement -Wformat=2 -Werror=format-nonliteral -Werror=format-security -Werror=implicit-function-declaration -Werror=init-self -Werror=missing-include-dirs -Werror=missing-prototypes -Werror=pointer-arith -Wextra -Wfloat-equal -Wlogical-op -Wmisleading-indentation -Wmissing-declarations -Wmissing-include-dirs -Wmissing-format-attribute -Wmissing-noreturn -Wno-missing-field-initializers -Wno-switch-enum -Wno-unused-parameter -Wno-packed -Wshadow -Wsign-compare -Wstrict-aliasing=2 -Wundef -Wuninitialized -Wunsafe-loop-optimizations -Wwrite-strings -fno-common -fdiagnostics-show-option -fno-strict-aliasing -fstack-protector -fstack-protector-strong -fno-semantic-interposition -Wno-deprecated-declarations -Wstrict-null-sentinel -fno-rtti -fno-exceptions -fvisibility=hidden -fvisibility-inlines-hidden -march=native -O2 -pipe -Wl,-O1 -Wl,--as-needed -o vte-2.91 vte_2_91-app.o vte_2_91-resources.o ../../src/libvte-2.91.la -lgtk-3 -lgdk-3 -lpangocairo-1.0 -lpango-1.0 -latk-1.0 -lcairo-gobject -lcairo -lgdk_pixbuf-2.0 -lgio-2.0 -lgobject-2.0 -lglib-2.0 -lm
  573. libtool: link: x86_64-pc-linux-gnu-g++ -pthread -I/usr/include/gtk-3.0 -I/usr/include/at-spi2-atk/2.0 -I/usr/include/at-spi-2.0 -I/usr/include/dbus-1.0 -I/usr/lib64/dbus-1.0/include -I/usr/include/gtk-3.0 -I/usr/include/gio-unix-2.0/ -I/usr/include/cairo -I/usr/include/pango-1.0 -I/usr/include/harfbuzz -I/usr/include/pango-1.0 -I/usr/include/fribidi -I/usr/include/atk-1.0 -I/usr/include/cairo -I/usr/include/pixman-1 -I/usr/include/freetype2 -I/usr/include/libdrm -I/usr/include/libpng16 -I/usr/include/gdk-pixbuf-2.0 -I/usr/include/libmount -I/usr/include/blkid -I/usr/include/uuid -I/usr/include/glib-2.0 -I/usr/lib64/glib-2.0/include -pipe -Wall -Wcast-align -Wendif-labels -Werror=declaration-after-statement -Wformat=2 -Werror=format-nonliteral -Werror=format-security -Werror=implicit-function-declaration -Werror=init-self -Werror=missing-include-dirs -Werror=missing-prototypes -Werror=pointer-arith -Wextra -Wfloat-equal -Wlogical-op -Wmisleading-indentation -Wmissing-declarations -Wmissing-include-dirs -Wmissing-format-attribute -Wmissing-noreturn -Wno-missing-field-initializers -Wno-switch-enum -Wno-unused-parameter -Wno-packed -Wshadow -Wsign-compare -Wstrict-aliasing=2 -Wundef -Wuninitialized -Wunsafe-loop-optimizations -Wwrite-strings -fno-common -fdiagnostics-show-option -fno-strict-aliasing -fstack-protector -fstack-protector-strong -fno-semantic-interposition -Wno-deprecated-declarations -Wstrict-null-sentinel -fno-rtti -fno-exceptions -fvisibility=hidden -fvisibility-inlines-hidden -march=native -O2 -pipe -Wl,-O1 -o .libs/vte-2.91 vte_2_91-app.o vte_2_91-resources.o -Wl,--as-needed ../../src/.libs/libvte-2.91.so -L/usr/lib64/../lib64 -lpcre2-8 -lgnutls -lgtk-3 -lgdk-3 -lpangocairo-1.0 -lpango-1.0 -latk-1.0 -lcairo-gobject -lcairo -lgdk_pixbuf-2.0 /usr/lib/libgio-2.0.so /usr/lib/libgmodule-2.0.so -ldl -lz -lresolv -lmount /usr/lib/libgobject-2.0.so -lffi /usr/lib/libglib-2.0.so -lpcre -lpthread -lm -pthread
  574. make[5]: Leaving directory '/var/tmp/portage/x11-libs/vte-0.54.4/work/vte-0.54.4/src/app'
  575. make[4]: Leaving directory '/var/tmp/portage/x11-libs/vte-0.54.4/work/vte-0.54.4/src/app'
  576. make[3]: Leaving directory '/var/tmp/portage/x11-libs/vte-0.54.4/work/vte-0.54.4/src'
  577. make[2]: Leaving directory '/var/tmp/portage/x11-libs/vte-0.54.4/work/vte-0.54.4/src'
  578. Making all in bindings
  579. make[2]: Entering directory '/var/tmp/portage/x11-libs/vte-0.54.4/work/vte-0.54.4/bindings'
  580. Making all in gir
  581. make[3]: Entering directory '/var/tmp/portage/x11-libs/vte-0.54.4/work/vte-0.54.4/bindings/gir'
  582. CPPFLAGS="" CFLAGS="-march=native -O2 -pipe" LDFLAGS="-Wl,-O1 -Wl,--as-needed" CC="x86_64-pc-linux-gnu-gcc" PKG_CONFIG="/usr/bin/x86_64-pc-linux-gnu-pkg-config" GI_HOST_OS="" DLLTOOL="false" /usr/bin/g-ir-scanner --add-include-path=. --warn-all --namespace=Vte --nsversion=2.91 --libtool="/bin/sh ../../libtool" --include=Pango-1.0 --include=Gdk-3.0 --include=Gtk-3.0 --pkg-export=vte-2.91 --library=../../src/libvte-2.91.la --c-include "vte/vte.h" --cflags-begin -pthread -I/usr/include/gtk-3.0 -I/usr/include/at-spi2-atk/2.0 -I/usr/include/at-spi-2.0 -I/usr/include/dbus-1.0 -I/usr/lib64/dbus-1.0/include -I/usr/include/gtk-3.0 -I/usr/include/cairo -I/usr/include/pango-1.0 -I/usr/include/harfbuzz -I/usr/include/pango-1.0 -I/usr/include/fribidi -I/usr/include/atk-1.0 -I/usr/include/cairo -I/usr/include/pixman-1 -I/usr/include/freetype2 -I/usr/include/libdrm -I/usr/include/libpng16 -I/usr/include/gdk-pixbuf-2.0 -I/usr/include/gio-unix-2.0/ -I/usr/include/libmount -I/usr/include/blkid -I/usr/include/uuid -I/usr/include/glib-2.0 -I/usr/lib64/glib-2.0/include -I/usr/include/p11-kit-1 -DVTE_COMPILATION -I../../src/vte -I../../src/vte --cflags-end ../../src/vte/vteregex.h ../../src/vte/vteversion.h ../../src/vte/vtemacros.h ../../src/vte/vtedeprecated.h ../../src/vte/vte.h ../../src/vte/vtepty.h ../../src/vte/vteglobals.h ../../src/vte/vtetypebuiltins.h ../../src/vte/vteenums.h ../../src/vte/vteterminal.h ../../src/pty.cc ../../src/vtegtk.cc ../../src/vtetypebuiltins.cc ../../src/libvte-2.91.la --output Vte-2.91.gir
  583. g-ir-scanner: link: /bin/sh ../../libtool --mode=link --tag=CC x86_64-pc-linux-gnu-gcc -o /var/tmp/portage/x11-libs/vte-0.54.4/work/vte-0.54.4/bindings/gir/tmp-introspect7p3d1z3q/Vte-2.91 -export-dynamic -march=native -O2 -pipe /var/tmp/portage/x11-libs/vte-0.54.4/work/vte-0.54.4/bindings/gir/tmp-introspect7p3d1z3q/Vte-2.91.o -L. ../../src/libvte-2.91.la -lgio-2.0 -lgobject-2.0 -Wl,--export-dynamic -lgmodule-2.0 -pthread -lglib-2.0 -Wl,-O1 -Wl,--as-needed
  584. libtool: link: x86_64-pc-linux-gnu-gcc -o /var/tmp/portage/x11-libs/vte-0.54.4/work/vte-0.54.4/bindings/gir/tmp-introspect7p3d1z3q/.libs/Vte-2.91 -march=native -O2 -pipe /var/tmp/portage/x11-libs/vte-0.54.4/work/vte-0.54.4/bindings/gir/tmp-introspect7p3d1z3q/Vte-2.91.o -Wl,--export-dynamic -pthread -Wl,-O1 -Wl,--export-dynamic -L. ../../src/.libs/libvte-2.91.so -L/usr/lib64/../lib64 -lgtk-3 -lgdk-3 -lpangocairo-1.0 -lpango-1.0 -latk-1.0 -lcairo-gobject -lcairo -lgdk_pixbuf-2.0 -lpcre2-8 -lgnutls /usr/lib/libgio-2.0.so -lz -lresolv -lmount /usr/lib/libgobject-2.0.so -lffi /usr/lib/libgmodule-2.0.so -ldl /usr/lib/libglib-2.0.so -lpcre -lpthread -Wl,--as-needed -pthread
  585. src/pty.cc:989: Warning: Vte: invalid "transfer" annotation for gint: only valid for array, struct, union, boxed, object and interface types
  586. src/pty.cc:1020: Warning: Vte: invalid "transfer" annotation for gint: only valid for array, struct, union, boxed, object and interface types
  587. src/vtegtk.cc:2647: Warning: Vte: vte_terminal_spawn_async: argument callback: Missing (scope) annotation for callback without GDestroyNotify (valid: call, async)
  588. /usr/bin/g-ir-compiler --includedir=. --includedir=. Vte-2.91.gir -o Vte-2.91.typelib
  589. make[3]: Leaving directory '/var/tmp/portage/x11-libs/vte-0.54.4/work/vte-0.54.4/bindings/gir'
  590. Making all in vala
  591. make[3]: Entering directory '/var/tmp/portage/x11-libs/vte-0.54.4/work/vte-0.54.4/bindings/vala'
  592. /usr/bin/vapigen-0.44 --library vte-2.91 --metadatadir . --pkg glib-2.0 --pkg gio-2.0 --pkg pango --pkg gdk-3.0 --pkg gtk+-3.0 ../../bindings/gir/Vte-2.91.gir
  593. XMLLINT=/usr/bin/xmllint /usr/bin/glib-compile-resources --target appresources.c --sourcedir . --generate --c-name app app.gresource.xml
  594. x86_64-pc-linux-gnu-gcc -DHAVE_CONFIG_H -I. -I../.. -I../../src -I../../src/vte -I../../src/vte -Wno-unused-variable -Wno-unused-but-set-variable -pthread -I/usr/include/gtk-3.0 -I/usr/include/at-spi2-atk/2.0 -I/usr/include/at-spi-2.0 -I/usr/include/dbus-1.0 -I/usr/lib64/dbus-1.0/include -I/usr/include/gtk-3.0 -I/usr/include/cairo -I/usr/include/pango-1.0 -I/usr/include/harfbuzz -I/usr/include/pango-1.0 -I/usr/include/fribidi -I/usr/include/atk-1.0 -I/usr/include/cairo -I/usr/include/pixman-1 -I/usr/include/freetype2 -I/usr/include/libdrm -I/usr/include/libpng16 -I/usr/include/gdk-pixbuf-2.0 -I/usr/include/gio-unix-2.0/ -I/usr/include/libmount -I/usr/include/blkid -I/usr/include/uuid -I/usr/include/glib-2.0 -I/usr/lib64/glib-2.0/include -I/usr/include/p11-kit-1 -pipe -Wall -Wcast-align -Wendif-labels -Werror=declaration-after-statement -Wformat=2 -Werror=format-nonliteral -Werror=format-security -Werror=implicit-function-declaration -Werror=init-self -Werror=missing-include-dirs -Werror=missing-prototypes -Werror=pointer-arith -Wextra -Wfloat-equal -Wlogical-op -Wmisleading-indentation -Wmissing-declarations -Wmissing-include-dirs -Wmissing-format-attribute -Wmissing-noreturn -Wno-missing-field-initializers -Wno-switch-enum -Wno-unused-parameter -Wno-packed -Wshadow -Wsign-compare -Wstrict-aliasing=2 -Wundef -Wuninitialized -Wunsafe-loop-optimizations -Wwrite-strings -fno-common -fdiagnostics-show-option -fno-strict-aliasing -fstack-protector -fstack-protector-strong -fno-semantic-interposition -Wno-deprecated-declarations -Waggregate-return -Wimplicit -Wnested-externs -Wold-style-definition -Wstrict-prototypes -march=native -O2 -pipe -c -o app-appresources.o `test -f 'appresources.c' || echo './'`appresources.c
  595. Generation succeeded - 0 warning(s)
  596. /usr/bin/valac-0.44 --target-glib=2.38 --pkg=posix --pkg=gio-2.0 --pkg=gtk+-3.0 --gresources ./app.gresource.xml --disable-since-check -D GTK_3_16 -C ./app.vala ./config.vapi vte-2.91.vapi
  597. ./app.vala:984.5-984.45: warning: the modifier `static' is not applicable to constants
  598. public static const OptionEntry[] entries = {
  599. ^^^^^^^^^^^^^^^^^^^^^^^^^^^^^^^^^^^^^^^^^
  600. ./app.vala:793.5-793.33: warning: Gtk.Settings.gtk_enable_mnemonics has been deprecated since 3.10
  601. ./app.vala:796.5-796.31: warning: Gtk.Settings.gtk_menu_bar_accel has been deprecated since 3.10
  602. ./app.vala:820.3-820.23: error: struct `Test.App.Options' cannot be empty
  603. public struct Options
  604. ^^^^^^^^^^^^^^^^^^^^^
  605. ./app.vala:649.5-649.15: warning: Gtk.Menu.popup has been deprecated since 3.22
  606. ./app.vala:562.5-562.42: warning: Vte.Terminal.set_geometry_hints_for_window has been deprecated since 0.52
  607. ./app.vala:417.5-417.22: warning: Gtk.Window.resize_to_geometry has been deprecated since 3.20
  608. ./app.vala:296.5-296.31: warning: Vte.Terminal.icon_title_changed has been deprecated since 0.54
  609. ./app.vala:699.32-699.54: warning: Vte.Terminal.get_icon_title has been deprecated since 0.54
  610. ./app.vala:765.5-765.22: warning: Gtk.Window.resize_to_geometry has been deprecated since 3.20
  611. ./app.vala:314.7-314.34: warning: Gtk.Widget.set_double_buffered has been deprecated since 3.14
  612. ./app.vala:318.9-318.29: warning: Vte.Terminal.set_encoding has been deprecated since 0.54
  613. ./app.vala:399.17-399.41: warning: Vte.Terminal.match_add_gregex has been deprecated since 0.46
  614. ./app.vala:402.9-402.38: warning: Vte.Terminal.match_set_cursor_type has been deprecated since 0.54
  615. ./app.vala:428.11-428.24: warning: Gtk.Window.parse_geometry has been deprecated since 3.20
  616. ./app.vala:435.9-435.26: warning: Gtk.Window.resize_to_geometry has been deprecated since 3.20
  617. ./app.vala:442.7-442.26: warning: Gtk.Window.set_default_geometry has been deprecated since 3.20
  618. ./app.vala:454.11-454.29: warning: Vte.Terminal.spawn_sync has been deprecated since 0.48
  619. ./app.vala:1092.7-1092.34: warning: Gdk.Window.set_debug_updates has been deprecated since 3.22
  620. ./app.vala:156.7-156.32: warning: Vte.Terminal.search_set_gregex has been deprecated since 0.46
  621. Compilation failed: 1 error(s), 19 warning(s)
  622. make[3]: *** [Makefile:847: app.c] Error 1
  623. make[3]: Leaving directory '/var/tmp/portage/x11-libs/vte-0.54.4/work/vte-0.54.4/bindings/vala'
  624. make[2]: *** [Makefile:449: all-recursive] Error 1
  625. make[2]: Leaving directory '/var/tmp/portage/x11-libs/vte-0.54.4/work/vte-0.54.4/bindings'
  626. make[1]: *** [Makefile:577: all-recursive] Error 1
  627. make[1]: Leaving directory '/var/tmp/portage/x11-libs/vte-0.54.4/work/vte-0.54.4'
  628. make: *** [Makefile:484: all] Error 2
  629. * ERROR: x11-libs/vte-0.54.4::dantrell-gnome-3-30 failed (compile phase):
  630. * emake failed
  631. *
  632. * If you need support, post the output of `emerge --info '=x11-libs/vte-0.54.4::dantrell-gnome-3-30'`,
  633. * the complete build log and the output of `emerge -pqv '=x11-libs/vte-0.54.4::dantrell-gnome-3-30'`.
  634. * The complete build log is located at '/var/tmp/portage/x11-libs/vte-0.54.4/temp/build.log'.
  635. * The ebuild environment file is located at '/var/tmp/portage/x11-libs/vte-0.54.4/temp/environment'.
  636. * Working directory: '/var/tmp/portage/x11-libs/vte-0.54.4/work/vte-0.54.4'
  637. * S: '/var/tmp/portage/x11-libs/vte-0.54.4/work/vte-0.54.4'
RAW Paste Data