SHARE
TWEET

llvm37-split check() Bindings/Go/go.test failure

a guest Jul 1st, 2016 103 Never
Not a member of Pastebin yet? Sign Up, it unlocks many cool features!
  1. Scanning dependencies of target UnitTests
  2. [100%] Built target llvm-lto
  3. [100%] Built target LLVMgold
  4. [100%] Built target UnitTests
  5. [100%] Built target llvm-lib
  6. [100%] Built target llvm-ranlib
  7. [100%] Built target BugpointPasses
  8. Scanning dependencies of target check-llvm
  9. [100%] Running the LLVM regression tests
  10. FAIL: LLVM :: Bindings/Go/go.test (3320 of 14117)
  11. ******************** TEST 'LLVM :: Bindings/Go/go.test' FAILED ********************
  12. Script:
  13. --
  14. /tmp/yaourt-tmp-k/aur-llvm37-split/src/llvm-3.7.1.src/build/./bin/llvm-go test llvm.org/llvm/bindings/go/llvm
  15. --
  16. Exit Code: 1
  17.  
  18. Command Output (stdout):
  19. --
  20. FAIL    llvm.org/llvm/bindings/go/llvm [build failed]
  21.  
  22. --
  23. Command Output (stderr):
  24. --
  25. # llvm.org/llvm/bindings/go/llvm
  26. /tmp/yaourt-tmp-k/aur-llvm37-split/src/llvm-3.7.1.src/build/lib/libLLVMInterpreter.a(ExternalFunctions.cpp.o): In function `llvm::Interpreter::callExternalFunction(llvm::Function*, llvm::ArrayRef<llvm::GenericValue>)':
  27. ExternalFunctions.cpp:(.text._ZN4llvm11Interpreter20callExternalFunctionEPNS_8FunctionENS_8ArrayRefINS_12GenericValueEEE+0x334): undefined reference to `ffi_type_pointer'
  28. ExternalFunctions.cpp:(.text._ZN4llvm11Interpreter20callExternalFunctionEPNS_8FunctionENS_8ArrayRefINS_12GenericValueEEE+0x384): undefined reference to `ffi_type_sint64'
  29. ExternalFunctions.cpp:(.text._ZN4llvm11Interpreter20callExternalFunctionEPNS_8FunctionENS_8ArrayRefINS_12GenericValueEEE+0x395): undefined reference to `ffi_type_sint32'
  30. ExternalFunctions.cpp:(.text._ZN4llvm11Interpreter20callExternalFunctionEPNS_8FunctionENS_8ArrayRefINS_12GenericValueEEE+0x3a7): undefined reference to `ffi_type_sint8'
  31. ExternalFunctions.cpp:(.text._ZN4llvm11Interpreter20callExternalFunctionEPNS_8FunctionENS_8ArrayRefINS_12GenericValueEEE+0x3b0): undefined reference to `ffi_type_sint16'
  32. ExternalFunctions.cpp:(.text._ZN4llvm11Interpreter20callExternalFunctionEPNS_8FunctionENS_8ArrayRefINS_12GenericValueEEE+0x740): undefined reference to `ffi_type_pointer'
  33. ExternalFunctions.cpp:(.text._ZN4llvm11Interpreter20callExternalFunctionEPNS_8FunctionENS_8ArrayRefINS_12GenericValueEEE+0x763): undefined reference to `ffi_prep_cif'
  34. ExternalFunctions.cpp:(.text._ZN4llvm11Interpreter20callExternalFunctionEPNS_8FunctionENS_8ArrayRefINS_12GenericValueEEE+0x7ba): undefined reference to `ffi_call'
  35. ExternalFunctions.cpp:(.text._ZN4llvm11Interpreter20callExternalFunctionEPNS_8FunctionENS_8ArrayRefINS_12GenericValueEEE+0xd2e): undefined reference to `ffi_type_sint64'
  36. ExternalFunctions.cpp:(.text._ZN4llvm11Interpreter20callExternalFunctionEPNS_8FunctionENS_8ArrayRefINS_12GenericValueEEE+0xd3a): undefined reference to `ffi_type_double'
  37. ExternalFunctions.cpp:(.text._ZN4llvm11Interpreter20callExternalFunctionEPNS_8FunctionENS_8ArrayRefINS_12GenericValueEEE+0xd46): undefined reference to `ffi_type_sint32'
  38. ExternalFunctions.cpp:(.text._ZN4llvm11Interpreter20callExternalFunctionEPNS_8FunctionENS_8ArrayRefINS_12GenericValueEEE+0xd57): undefined reference to `ffi_type_sint8'
  39. ExternalFunctions.cpp:(.text._ZN4llvm11Interpreter20callExternalFunctionEPNS_8FunctionENS_8ArrayRefINS_12GenericValueEEE+0xd63): undefined reference to `ffi_type_sint16'
  40. ExternalFunctions.cpp:(.text._ZN4llvm11Interpreter20callExternalFunctionEPNS_8FunctionENS_8ArrayRefINS_12GenericValueEEE+0xd6f): undefined reference to `ffi_type_float'
  41. ExternalFunctions.cpp:(.text._ZN4llvm11Interpreter20callExternalFunctionEPNS_8FunctionENS_8ArrayRefINS_12GenericValueEEE+0xd7b): undefined reference to `ffi_type_void'
  42. ExternalFunctions.cpp:(.text._ZN4llvm11Interpreter20callExternalFunctionEPNS_8FunctionENS_8ArrayRefINS_12GenericValueEEE+0x133a): undefined reference to `ffi_type_double'
  43. ExternalFunctions.cpp:(.text._ZN4llvm11Interpreter20callExternalFunctionEPNS_8FunctionENS_8ArrayRefINS_12GenericValueEEE+0x1346): undefined reference to `ffi_type_float'
  44. ExternalFunctions.cpp:(.text._ZN4llvm11Interpreter20callExternalFunctionEPNS_8FunctionENS_8ArrayRefINS_12GenericValueEEE+0x1352): undefined reference to `ffi_type_void'
  45. collect2: error: ld returned 1 exit status
  46.  
  47. --
  48.  
  49. ********************
  50. Testing Time: 107.11s
  51. ********************
  52. Failing Tests (1):
  53.     LLVM :: Bindings/Go/go.test
  54.  
  55.   Expected Passes    : 13831
  56.   Expected Failures  : 97
  57.   Unsupported Tests  : 188
  58.   Unexpected Failures: 1
  59. make[3]: *** [test/CMakeFiles/check-llvm.dir/build.make:58: test/CMakeFiles/check-llvm] Error 1
  60. make[2]: *** [CMakeFiles/Makefile2:48890: test/CMakeFiles/check-llvm.dir/all] Error 2
  61. make[1]: *** [CMakeFiles/Makefile2:41866: test/CMakeFiles/check.dir/rule] Error 2
  62. make: *** [Makefile:9414: check] Error 2
  63. ==> ERROR: A failure occurred in check().
  64.     Aborting...
RAW Paste Data
We use cookies for various purposes including analytics. By continuing to use Pastebin, you agree to our use of cookies as described in the Cookies Policy. OK, I Understand
 
Top