liuk4friends

Netdata 1.33.1 failed build log #1

Feb 27th, 2022 (edited)
160
0
Never
Not a member of Pastebin yet? Sign Up, it unlocks many cool features!
Bash 180.99 KB | None | 0 0
  1. Mac-mini-di-Luca:tmp admin$ curl https://my-netdata.io/kickstart.sh > /tmp/netdata-kickstart.sh && sh /tmp/netdata-kickstart.sh
  2.   % Total    % Received % Xferd  Average Speed   Time    Time     Time  Current
  3.                                  Dload  Upload   Total   Spent    Left  Speed
  4. 100 46309    0 46309    0     0   132k      0 --:--:-- --:--:-- --:--:--  132k
  5.  
  6.  --- Using /var/folders/tm/bh_rhtyj47x8b5nl3dh3cm400000gn/T/netdata-kickstart-XXXXXXXXXX.kV89skIy as a temporary directory. ---
  7.  --- Found an existing netdata install at /usr/local/netdata, with installation type 'kickstart-build'. ---
  8. [/var/folders/tm/bh_rhtyj47x8b5nl3dh3cm400000gn/T/netdata-kickstart-XXXXXXXXXX.kV89skIy]$ sudo /usr/local/netdata/usr/libexec/netdata/netdata-updater.sh --not-running-from-cron
  9. Dom 27 Feb 2022 11:14:27 CET : INFO:  Checking if a newer version of the updater script is available.
  10. usage: date [-jnRu] [-d dst] [-r seconds] [-t west] [-v[+|-]val[ymwdHMS]] ...
  11.             [-f fmt date | [[[mm]dd]HH]MM[[cc]yy][.ss]] [+format]
  12. /usr/local/netdata/usr/libexec/netdata/netdata-updater.sh: line 356: [: : integer expression expected
  13. Dom 27 Feb 2022 11:14:27 CET : INFO:  Running on a terminal - (this script also supports running headless from crontab)
  14. Dom 27 Feb 2022 11:14:28 CET : INFO:  Current Version: 00103300100028
  15. Dom 27 Feb 2022 11:14:28 CET : INFO:  Latest Version: 00103300100078
  16. Dom 27 Feb 2022 11:14:28 CET : INFO:  Update available
  17. ./netdata-latest.tar.gz: OK
  18. /usr/local/netdata/usr/libexec/netdata/netdata-updater.sh: line 493: pidof: command not found
  19. Dom 27 Feb 2022 11:14:34 CET : INFO:  Re-installing netdata...
  20.  
  21.   ^
  22.   |.-.   .-.   .-.   .-.   .-.   .  netdata  .-.   .-.   .-.   .-.   .-.   .-
  23.   |   '-'   '-'   '-'   '-'   '-'               '-'   '-'   '-'   '-'   '-'  
  24.   +----+-----+-----+-----+-----+-----+-----+-----+-----+-----+-----+-----+--->
  25.  
  26.  --- real-time performance monitoring, done right! ---
  27.  
  28.   You are about to build and install netdata to your system.
  29.  
  30.   The build process will use /tmp for
  31.   any temporary files. You can override this by setting $TMPDIR to a
  32.   writable directory where you can execute files.
  33.  
  34.   It will be installed at these locations:
  35.  
  36.    - the daemon     at /usr/local/netdata/usr/sbin/netdata
  37.    - config files   in /usr/local/netdata/etc/netdata
  38.    - web files      in /usr/local/netdata/usr/share/netdata
  39.    - plugins        in /usr/local/netdata/usr/libexec/netdata
  40.    - cache files    in /usr/local/netdata/var/cache/netdata
  41.    - db files       in /usr/local/netdata/var/lib/netdata
  42.    - log files      in /usr/local/netdata/var/log/netdata
  43.    - pid file       at /usr/local/netdata/var/run/netdata.pid
  44.    - logrotate file at /etc/logrotate.d/netdata
  45.  
  46.   This installer allows you to change the installation path.
  47.   Press Control-C and run the same command with --help for help.
  48.  
  49.  
  50.   NOTE:
  51.   Anonymous usage stats will be collected and sent to Netdata.
  52.   To opt-out, pass --disable-telemetry option to the installer or export
  53.   the environment variable DISABLE_TELEMETRY to a non-zero or non-empty value
  54.   (e.g: export DISABLE_TELEMETRY=1).
  55.  
  56. [/var/folders/zz/zyxvpxvq6csfxvn_n0000000000000/T/netdata-updater-XXXXXXXXXX.915Rr8w7/netdata-v1.33.1-78-g9ef13f190]# curl -q -sSL --connect-timeout 10 --retry 3 --output /var/folders/zz/zyxvpxvq6csfxvn_n0000000000000/T/netdata-protobuf-XXXXXX.9ZIE48f3/protobuf-cpp-3.17.3.tar.gz https://github.com/protocolbuffers/protobuf/releases/download/v3.17.3/protobuf-cpp-3.17.3.tar.gz
  57.  OK  
  58.  
  59. protobuf-cpp-3.17.3.tar.gz: OK
  60. [/var/folders/zz/zyxvpxvq6csfxvn_n0000000000000/T/netdata-updater-XXXXXXXXXX.915Rr8w7/netdata-v1.33.1-78-g9ef13f190]# tar --no-same-owner -xf /var/folders/zz/zyxvpxvq6csfxvn_n0000000000000/T/netdata-protobuf-XXXXXX.9ZIE48f3/protobuf-cpp-3.17.3.tar.gz -C /var/folders/zz/zyxvpxvq6csfxvn_n0000000000000/T/netdata-protobuf-XXXXXX.9ZIE48f3
  61.  OK  
  62.  
  63. [/var/folders/zz/zyxvpxvq6csfxvn_n0000000000000/T/netdata-protobuf-XXXXXX.9ZIE48f3/protobuf-3.17.3]# env CFLAGS=-fPIC CXXFLAGS= LDFLAGS= ./configure --disable-shared --without-zlib --disable-dependency-tracking --with-pic
  64. checking whether to enable maintainer-specific portions of Makefiles... yes
  65. checking build system type... x86_64-apple-darwin19.6.0
  66. checking host system type... x86_64-apple-darwin19.6.0
  67. checking target system type... x86_64-apple-darwin19.6.0
  68. checking for a BSD-compatible install... /usr/bin/install -c
  69. checking whether build environment is sane... yes
  70. checking for a thread-safe mkdir -p... ./install-sh -c -d
  71. checking for gawk... no
  72. checking for mawk... no
  73. checking for nawk... no
  74. checking for awk... awk
  75. checking whether make sets $(MAKE)... yes
  76. checking whether make supports nested variables... yes
  77. checking whether UID '0' is supported by ustar format... yes
  78. checking whether GID '0' is supported by ustar format... yes
  79. checking how to create a ustar tar archive... gnutar
  80. checking whether make supports nested variables... (cached) yes
  81. checking for gcc... gcc
  82. checking whether the C compiler works... yes
  83. checking for C compiler default output file name... a.out
  84. checking for suffix of executables...
  85. checking whether we are cross compiling... no
  86. checking for suffix of object files... o
  87. checking whether we are using the GNU C compiler... yes
  88. checking whether gcc accepts -g... yes
  89. checking for gcc option to accept ISO C89... none needed
  90. checking whether gcc understands -c and -o together... yes
  91. checking whether make supports the include directive... yes (GNU style)
  92. checking dependency style of gcc... none
  93. checking for g++... g++
  94. checking whether we are using the GNU C++ compiler... yes
  95. checking whether g++ accepts -g... yes
  96. checking dependency style of g++... none
  97. checking how to run the C preprocessor... gcc -E
  98. checking for gcc... gcc
  99. checking whether we are using the GNU C compiler... (cached) yes
  100. checking whether gcc accepts -g... yes
  101. checking for gcc option to accept ISO C89... (cached) none needed
  102. checking whether gcc understands -c and -o together... (cached) yes
  103. checking dependency style of gcc... (cached) none
  104. checking how to run the C preprocessor... gcc -E
  105. checking how to run the C++ preprocessor... g++ -E
  106. checking for g++... g++
  107. checking whether we are using the GNU C++ compiler... (cached) yes
  108. checking whether g++ accepts -g... yes
  109. checking dependency style of g++... (cached) none
  110. checking how to run the C++ preprocessor... g++ -E
  111. checking for grep that handles long lines and -e... /usr/bin/grep
  112. checking for egrep... /usr/bin/grep -E
  113. checking for ANSI C header files... yes
  114. checking for sys/types.h... yes
  115. checking for sys/stat.h... yes
  116. checking for stdlib.h... yes
  117. checking for string.h... yes
  118. checking for memory.h... yes
  119. checking for strings.h... yes
  120. checking for inttypes.h... yes
  121. checking for stdint.h... yes
  122. checking for unistd.h... yes
  123. checking minix/config.h usability... no
  124. checking minix/config.h presence... no
  125. checking for minix/config.h... no
  126. checking whether it is safe to define __EXTENSIONS__... yes
  127. checking for ar... ar
  128. checking the archiver (ar) interface... ar
  129. checking for gcc... gcc
  130. checking whether we are using the GNU Objective C compiler... yes
  131. checking whether gcc accepts -g... yes
  132. checking dependency style of gcc... none
  133. checking C++ compiler flags...... use user-supplied:
  134. checking whether __SUNPRO_CC is declared... no
  135. checking how to print strings... printf
  136. checking for a sed that does not truncate output... /usr/bin/sed
  137. checking for fgrep... /usr/bin/grep -F
  138. checking for ld used by gcc... /Applications/Xcode.app/Contents/Developer/Toolchains/XcodeDefault.xctoolchain/usr/bin/ld
  139. checking if the linker (/Applications/Xcode.app/Contents/Developer/Toolchains/XcodeDefault.xctoolchain/usr/bin/ld) is GNU ld... no
  140. checking for BSD- or MS-compatible name lister (nm)... /usr/bin/nm -B
  141. checking the name lister (/usr/bin/nm -B) interface... BSD nm
  142. checking whether ln -s works... yes
  143. checking the maximum length of command line arguments... 196608
  144. checking how to convert x86_64-apple-darwin19.6.0 file names to x86_64-apple-darwin19.6.0 format... func_convert_file_noop
  145. checking how to convert x86_64-apple-darwin19.6.0 file names to toolchain format... func_convert_file_noop
  146. checking for /Applications/Xcode.app/Contents/Developer/Toolchains/XcodeDefault.xctoolchain/usr/bin/ld option to reload object files... -r
  147. checking for objdump... objdump
  148. checking how to recognize dependent libraries... pass_all
  149. checking for dlltool... no
  150. checking how to associate runtime and link libraries... printf %s\n
  151. checking for archiver @FILE support... no
  152. checking for strip... strip
  153. checking for ranlib... ranlib
  154. checking command to parse /usr/bin/nm -B output from gcc object... ok
  155. checking for sysroot... no
  156. checking for a working dd... /bin/dd
  157. checking how to truncate binary pipes... /bin/dd bs=4096 count=1
  158. checking for mt... no
  159. checking if : is a manifest tool... no
  160. checking for dsymutil... dsymutil
  161. checking for nmedit... nmedit
  162. checking for lipo... lipo
  163. checking for otool... otool
  164. checking for otool64... no
  165. checking for -single_module linker flag... yes
  166. checking for -exported_symbols_list linker flag... yes
  167. checking for -force_load linker flag... yes
  168. checking for dlfcn.h... yes
  169. checking for objdir... .libs
  170. checking if gcc supports -fno-rtti -fno-exceptions... yes
  171. checking for gcc option to produce PIC... -fno-common -DPIC
  172. checking if gcc PIC flag -fno-common -DPIC works... yes
  173. checking if gcc static flag -static works... no
  174. checking if gcc supports -c -o file.o... yes
  175. checking if gcc supports -c -o file.o... (cached) yes
  176. checking whether the gcc linker (/Applications/Xcode.app/Contents/Developer/Toolchains/XcodeDefault.xctoolchain/usr/bin/ld) supports shared libraries... yes
  177. checking dynamic linker characteristics... darwin19.6.0 dyld
  178. checking how to hardcode library paths into programs... immediate
  179. checking whether stripping libraries is possible... yes
  180. checking if libtool supports shared libraries... yes
  181. checking whether to build shared libraries... no
  182. checking whether to build static libraries... yes
  183. checking how to run the C++ preprocessor... g++ -E
  184. checking for ld used by g++... /Applications/Xcode.app/Contents/Developer/Toolchains/XcodeDefault.xctoolchain/usr/bin/ld
  185. checking if the linker (/Applications/Xcode.app/Contents/Developer/Toolchains/XcodeDefault.xctoolchain/usr/bin/ld) is GNU ld... no
  186. checking whether the g++ linker (/Applications/Xcode.app/Contents/Developer/Toolchains/XcodeDefault.xctoolchain/usr/bin/ld) supports shared libraries... yes
  187. checking for g++ option to produce PIC... -fno-common -DPIC
  188. checking if g++ PIC flag -fno-common -DPIC works... yes
  189. checking if g++ static flag -static works... no
  190. checking if g++ supports -c -o file.o... yes
  191. checking if g++ supports -c -o file.o... (cached) yes
  192. checking whether the g++ linker (/Applications/Xcode.app/Contents/Developer/Toolchains/XcodeDefault.xctoolchain/usr/bin/ld) supports shared libraries... yes
  193. checking dynamic linker characteristics... darwin19.6.0 dyld
  194. checking how to hardcode library paths into programs... immediate
  195. checking whether the linker supports version scripts... no
  196. checking for ANSI C header files... (cached) yes
  197. checking fcntl.h usability... yes
  198. checking fcntl.h presence... yes
  199. checking for fcntl.h... yes
  200. checking for inttypes.h... (cached) yes
  201. checking limits.h usability... yes
  202. checking limits.h presence... yes
  203. checking for limits.h... yes
  204. checking for stdlib.h... (cached) yes
  205. checking for unistd.h... (cached) yes
  206. checking for working memcmp... yes
  207. checking for working strtod... yes
  208. checking for ftruncate... yes
  209. checking for memset... yes
  210. checking for mkdir... yes
  211. checking for strchr... yes
  212. checking for strerror... yes
  213. checking for strtol... yes
  214. checking whether g++ supports C++11 features by default... no
  215. checking whether g++ supports C++11 features with -std=c++11... yes
  216. checking whether -latomic is needed... no
  217. checking whether gcc is Clang... yes
  218. checking whether pthreads work with "-pthread" and "-lpthread"... yes
  219. checking whether Clang needs flag to prevent "argument unused" warning when linking with -pthread... no
  220. checking for joinable pthread attribute... PTHREAD_CREATE_JOINABLE
  221. checking whether more special flags are required for pthreads... no
  222. checking for PTHREAD_PRIO_INHERIT... yes
  223. checking the location of hash_map... <unordered_map>
  224. checking whether -llog is needed... no
  225. checking that generated files are newer than configure... done
  226. configure: creating ./config.status
  227. config.status: creating Makefile
  228. config.status: creating src/Makefile
  229. config.status: creating benchmarks/Makefile
  230. config.status: creating conformance/Makefile
  231. config.status: creating protobuf.pc
  232. config.status: creating protobuf-lite.pc
  233. config.status: creating config.h
  234. config.status: executing depfiles commands
  235. config.status: executing libtool commands
  236. === configuring in third_party/googletest (/var/folders/zz/zyxvpxvq6csfxvn_n0000000000000/T/netdata-protobuf-XXXXXX.9ZIE48f3/protobuf-3.17.3/third_party/googletest)
  237. configure: running /bin/sh ./configure --disable-option-checking '--prefix=/usr/local'  '--disable-shared' '--without-zlib' '--disable-dependency-tracking' '--with-pic' 'CFLAGS=-fPIC' 'LDFLAGS=' 'CXXFLAGS=' --cache-file=/dev/null --srcdir=.
  238. checking for a BSD-compatible install... /usr/bin/install -c
  239. checking whether build environment is sane... yes
  240. checking for a thread-safe mkdir -p... build-aux/install-sh -c -d
  241. checking for gawk... no
  242. checking for mawk... no
  243. checking for nawk... no
  244. checking for awk... awk
  245. checking whether make sets $(MAKE)... yes
  246. checking whether make supports nested variables... yes
  247. checking that generated files are newer than configure... done
  248. configure: creating ./config.status
  249. config.status: creating Makefile
  250. === configuring in googletest (/var/folders/zz/zyxvpxvq6csfxvn_n0000000000000/T/netdata-protobuf-XXXXXX.9ZIE48f3/protobuf-3.17.3/third_party/googletest/googletest)
  251. configure: running /bin/sh ./configure --disable-option-checking '--prefix=/usr/local'  '--disable-shared' '--without-zlib' '--disable-dependency-tracking' '--with-pic' 'CFLAGS=-fPIC' 'LDFLAGS=' 'CXXFLAGS=' --cache-file=/dev/null --srcdir=.
  252. checking for a BSD-compatible install... /usr/bin/install -c
  253. checking whether build environment is sane... yes
  254. checking for a thread-safe mkdir -p... build-aux/install-sh -c -d
  255. checking for gawk... no
  256. checking for mawk... no
  257. checking for nawk... no
  258. checking for awk... awk
  259. checking whether make sets $(MAKE)... yes
  260. checking whether make supports nested variables... yes
  261. checking for gcc... gcc
  262. checking whether the C compiler works... yes
  263. checking for C compiler default output file name... a.out
  264. checking for suffix of executables...
  265. checking whether we are cross compiling... no
  266. checking for suffix of object files... o
  267. checking whether we are using the GNU C compiler... yes
  268. checking whether gcc accepts -g... yes
  269. checking for gcc option to accept ISO C89... none needed
  270. checking whether gcc understands -c and -o together... yes
  271. checking whether make supports the include directive... yes (GNU style)
  272. checking dependency style of gcc... none
  273. checking for g++... g++
  274. checking whether we are using the GNU C++ compiler... yes
  275. checking whether g++ accepts -g... yes
  276. checking dependency style of g++... none
  277. checking build system type... x86_64-apple-darwin19.6.0
  278. checking host system type... x86_64-apple-darwin19.6.0
  279. checking how to print strings... printf
  280. checking for a sed that does not truncate output... /usr/bin/sed
  281. checking for grep that handles long lines and -e... /usr/bin/grep
  282. checking for egrep... /usr/bin/grep -E
  283. checking for fgrep... /usr/bin/grep -F
  284. checking for ld used by gcc... /Applications/Xcode.app/Contents/Developer/Toolchains/XcodeDefault.xctoolchain/usr/bin/ld
  285. checking if the linker (/Applications/Xcode.app/Contents/Developer/Toolchains/XcodeDefault.xctoolchain/usr/bin/ld) is GNU ld... no
  286. checking for BSD- or MS-compatible name lister (nm)... /usr/bin/nm -B
  287. checking the name lister (/usr/bin/nm -B) interface... BSD nm
  288. checking whether ln -s works... yes
  289. checking the maximum length of command line arguments... 196608
  290. checking how to convert x86_64-apple-darwin19.6.0 file names to x86_64-apple-darwin19.6.0 format... func_convert_file_noop
  291. checking how to convert x86_64-apple-darwin19.6.0 file names to toolchain format... func_convert_file_noop
  292. checking for /Applications/Xcode.app/Contents/Developer/Toolchains/XcodeDefault.xctoolchain/usr/bin/ld option to reload object files... -r
  293. checking for objdump... objdump
  294. checking how to recognize dependent libraries... pass_all
  295. checking for dlltool... no
  296. checking how to associate runtime and link libraries... printf %s\n
  297. checking for ar... ar
  298. checking for archiver @FILE support... no
  299. checking for strip... strip
  300. checking for ranlib... ranlib
  301. checking command to parse /usr/bin/nm -B output from gcc object... ok
  302. checking for sysroot... no
  303. checking for a working dd... /bin/dd
  304. checking how to truncate binary pipes... /bin/dd bs=4096 count=1
  305. checking for mt... no
  306. checking if : is a manifest tool... no
  307. checking for dsymutil... dsymutil
  308. checking for nmedit... nmedit
  309. checking for lipo... lipo
  310. checking for otool... otool
  311. checking for otool64... no
  312. checking for -single_module linker flag... yes
  313. checking for -exported_symbols_list linker flag... yes
  314. checking for -force_load linker flag... yes
  315. checking how to run the C preprocessor... gcc -E
  316. checking for ANSI C header files... yes
  317. checking for sys/types.h... yes
  318. checking for sys/stat.h... yes
  319. checking for stdlib.h... yes
  320. checking for string.h... yes
  321. checking for memory.h... yes
  322. checking for strings.h... yes
  323. checking for inttypes.h... yes
  324. checking for stdint.h... yes
  325. checking for unistd.h... yes
  326. checking for dlfcn.h... yes
  327. checking for objdir... .libs
  328. checking if gcc supports -fno-rtti -fno-exceptions... yes
  329. checking for gcc option to produce PIC... -fno-common -DPIC
  330. checking if gcc PIC flag -fno-common -DPIC works... yes
  331. checking if gcc static flag -static works... no
  332. checking if gcc supports -c -o file.o... yes
  333. checking if gcc supports -c -o file.o... (cached) yes
  334. checking whether the gcc linker (/Applications/Xcode.app/Contents/Developer/Toolchains/XcodeDefault.xctoolchain/usr/bin/ld) supports shared libraries... yes
  335. checking dynamic linker characteristics... darwin19.6.0 dyld
  336. checking how to hardcode library paths into programs... immediate
  337. checking whether stripping libraries is possible... yes
  338. checking if libtool supports shared libraries... yes
  339. checking whether to build shared libraries... no
  340. checking whether to build static libraries... yes
  341. checking how to run the C++ preprocessor... g++ -E
  342. checking for ld used by g++... /Applications/Xcode.app/Contents/Developer/Toolchains/XcodeDefault.xctoolchain/usr/bin/ld
  343. checking if the linker (/Applications/Xcode.app/Contents/Developer/Toolchains/XcodeDefault.xctoolchain/usr/bin/ld) is GNU ld... no
  344. checking whether the g++ linker (/Applications/Xcode.app/Contents/Developer/Toolchains/XcodeDefault.xctoolchain/usr/bin/ld) supports shared libraries... yes
  345. checking for g++ option to produce PIC... -fno-common -DPIC
  346. checking if g++ PIC flag -fno-common -DPIC works... yes
  347. checking if g++ static flag -static works... no
  348. checking if g++ supports -c -o file.o... yes
  349. checking if g++ supports -c -o file.o... (cached) yes
  350. checking whether the g++ linker (/Applications/Xcode.app/Contents/Developer/Toolchains/XcodeDefault.xctoolchain/usr/bin/ld) supports shared libraries... yes
  351. checking dynamic linker characteristics... darwin19.6.0 dyld
  352. checking how to hardcode library paths into programs... immediate
  353. checking for python... /usr/bin/python
  354. checking for the pthreads library -lpthreads... no
  355. checking whether pthreads work without any flags... yes
  356. checking for joinable pthread attribute... PTHREAD_CREATE_JOINABLE
  357. checking if more special flags are required for pthreads... -D_THREAD_SAFE
  358. checking whether to check for GCC pthread/shared inconsistencies... no
  359. checking that generated files are newer than configure... done
  360. configure: creating ./config.status
  361. config.status: creating Makefile
  362. config.status: creating scripts/gtest-config
  363. config.status: creating build-aux/config.h
  364. config.status: executing depfiles commands
  365. config.status: executing libtool commands
  366. === configuring in googlemock (/var/folders/zz/zyxvpxvq6csfxvn_n0000000000000/T/netdata-protobuf-XXXXXX.9ZIE48f3/protobuf-3.17.3/third_party/googletest/googlemock)
  367. configure: running /bin/sh ./configure --disable-option-checking '--prefix=/usr/local'  '--disable-shared' '--without-zlib' '--disable-dependency-tracking' '--with-pic' 'CFLAGS=-fPIC' 'LDFLAGS=' 'CXXFLAGS=' --cache-file=/dev/null --srcdir=.
  368. checking for a BSD-compatible install... /usr/bin/install -c
  369. checking whether build environment is sane... yes
  370. checking for a thread-safe mkdir -p... build-aux/install-sh -c -d
  371. checking for gawk... no
  372. checking for mawk... no
  373. checking for nawk... no
  374. checking for awk... awk
  375. checking whether make sets $(MAKE)... yes
  376. checking whether make supports nested variables... yes
  377. checking for gcc... gcc
  378. checking whether the C compiler works... yes
  379. checking for C compiler default output file name... a.out
  380. checking for suffix of executables...
  381. checking whether we are cross compiling... no
  382. checking for suffix of object files... o
  383. checking whether we are using the GNU C compiler... yes
  384. checking whether gcc accepts -g... yes
  385. checking for gcc option to accept ISO C89... none needed
  386. checking whether gcc understands -c and -o together... yes
  387. checking whether make supports the include directive... yes (GNU style)
  388. checking dependency style of gcc... none
  389. checking for g++... g++
  390. checking whether we are using the GNU C++ compiler... yes
  391. checking whether g++ accepts -g... yes
  392. checking dependency style of g++... none
  393. checking build system type... x86_64-apple-darwin19.6.0
  394. checking host system type... x86_64-apple-darwin19.6.0
  395. checking how to print strings... printf
  396. checking for a sed that does not truncate output... /usr/bin/sed
  397. checking for grep that handles long lines and -e... /usr/bin/grep
  398. checking for egrep... /usr/bin/grep -E
  399. checking for fgrep... /usr/bin/grep -F
  400. checking for ld used by gcc... /Applications/Xcode.app/Contents/Developer/Toolchains/XcodeDefault.xctoolchain/usr/bin/ld
  401. checking if the linker (/Applications/Xcode.app/Contents/Developer/Toolchains/XcodeDefault.xctoolchain/usr/bin/ld) is GNU ld... no
  402. checking for BSD- or MS-compatible name lister (nm)... /usr/bin/nm -B
  403. checking the name lister (/usr/bin/nm -B) interface... BSD nm
  404. checking whether ln -s works... yes
  405. checking the maximum length of command line arguments... 196608
  406. checking how to convert x86_64-apple-darwin19.6.0 file names to x86_64-apple-darwin19.6.0 format... func_convert_file_noop
  407. checking how to convert x86_64-apple-darwin19.6.0 file names to toolchain format... func_convert_file_noop
  408. checking for /Applications/Xcode.app/Contents/Developer/Toolchains/XcodeDefault.xctoolchain/usr/bin/ld option to reload object files... -r
  409. checking for objdump... objdump
  410. checking how to recognize dependent libraries... pass_all
  411. checking for dlltool... no
  412. checking how to associate runtime and link libraries... printf %s\n
  413. checking for ar... ar
  414. checking for archiver @FILE support... no
  415. checking for strip... strip
  416. checking for ranlib... ranlib
  417. checking command to parse /usr/bin/nm -B output from gcc object... ok
  418. checking for sysroot... no
  419. checking for a working dd... /bin/dd
  420. checking how to truncate binary pipes... /bin/dd bs=4096 count=1
  421. checking for mt... no
  422. checking if : is a manifest tool... no
  423. checking for dsymutil... dsymutil
  424. checking for nmedit... nmedit
  425. checking for lipo... lipo
  426. checking for otool... otool
  427. checking for otool64... no
  428. checking for -single_module linker flag... yes
  429. checking for -exported_symbols_list linker flag... yes
  430. checking for -force_load linker flag... yes
  431. checking how to run the C preprocessor... gcc -E
  432. checking for ANSI C header files... yes
  433. checking for sys/types.h... yes
  434. checking for sys/stat.h... yes
  435. checking for stdlib.h... yes
  436. checking for string.h... yes
  437. checking for memory.h... yes
  438. checking for strings.h... yes
  439. checking for inttypes.h... yes
  440. checking for stdint.h... yes
  441. checking for unistd.h... yes
  442. checking for dlfcn.h... yes
  443. checking for objdir... .libs
  444. checking if gcc supports -fno-rtti -fno-exceptions... yes
  445. checking for gcc option to produce PIC... -fno-common -DPIC
  446. checking if gcc PIC flag -fno-common -DPIC works... yes
  447. checking if gcc static flag -static works... no
  448. checking if gcc supports -c -o file.o... yes
  449. checking if gcc supports -c -o file.o... (cached) yes
  450. checking whether the gcc linker (/Applications/Xcode.app/Contents/Developer/Toolchains/XcodeDefault.xctoolchain/usr/bin/ld) supports shared libraries... yes
  451. checking dynamic linker characteristics... darwin19.6.0 dyld
  452. checking how to hardcode library paths into programs... immediate
  453. checking whether stripping libraries is possible... yes
  454. checking if libtool supports shared libraries... yes
  455. checking whether to build shared libraries... no
  456. checking whether to build static libraries... yes
  457. checking how to run the C++ preprocessor... g++ -E
  458. checking for ld used by g++... /Applications/Xcode.app/Contents/Developer/Toolchains/XcodeDefault.xctoolchain/usr/bin/ld
  459. checking if the linker (/Applications/Xcode.app/Contents/Developer/Toolchains/XcodeDefault.xctoolchain/usr/bin/ld) is GNU ld... no
  460. checking whether the g++ linker (/Applications/Xcode.app/Contents/Developer/Toolchains/XcodeDefault.xctoolchain/usr/bin/ld) supports shared libraries... yes
  461. checking for g++ option to produce PIC... -fno-common -DPIC
  462. checking if g++ PIC flag -fno-common -DPIC works... yes
  463. checking if g++ static flag -static works... no
  464. checking if g++ supports -c -o file.o... yes
  465. checking if g++ supports -c -o file.o... (cached) yes
  466. checking whether the g++ linker (/Applications/Xcode.app/Contents/Developer/Toolchains/XcodeDefault.xctoolchain/usr/bin/ld) supports shared libraries... yes
  467. checking dynamic linker characteristics... darwin19.6.0 dyld
  468. checking how to hardcode library paths into programs... immediate
  469. checking for python... /usr/bin/python
  470. checking for the pthreads library -lpthreads... no
  471. checking whether pthreads work without any flags... yes
  472. checking for joinable pthread attribute... PTHREAD_CREATE_JOINABLE
  473. checking if more special flags are required for pthreads... -D_THREAD_SAFE
  474. checking whether to check for GCC pthread/shared inconsistencies... no
  475. checking for gtest-config... no
  476. checking that generated files are newer than configure... done
  477. configure: creating ./config.status
  478. config.status: creating Makefile
  479. config.status: creating scripts/gmock-config
  480. config.status: creating build-aux/config.h
  481. config.status: executing depfiles commands
  482. config.status: executing libtool commands
  483.  OK  
  484.  
  485. [/var/folders/zz/zyxvpxvq6csfxvn_n0000000000000/T/netdata-protobuf-XXXXXX.9ZIE48f3/protobuf-3.17.3]# env CFLAGS=-fPIC CXXFLAGS= LDFLAGS= make -j4
  486. /Applications/Xcode.app/Contents/Developer/usr/bin/make  all-recursive
  487. Making all in .
  488. make[2]: Nothing to be done for `all-am'.
  489. Making all in src
  490.  CXX      google/protobuf/compiler/code_generator.lo
  491.  CXX      google/protobuf/compiler/command_line_interface.lo
  492.  CXX      google/protobuf/compiler/plugin.lo
  493.  CXX      google/protobuf/compiler/plugin.pb.lo
  494.  CXX      google/protobuf/compiler/subprocess.lo
  495.  CXX      google/protobuf/compiler/zip_writer.lo
  496.  CXX      google/protobuf/compiler/main.o
  497.  CXX      google/protobuf/stubs/bytestream.lo
  498.  CXX      google/protobuf/stubs/common.lo
  499.  CXX      google/protobuf/stubs/int128.lo
  500.  CXX      google/protobuf/io/io_win32.lo
  501.  CXX      google/protobuf/stubs/status.lo
  502.  CXX      google/protobuf/stubs/statusor.lo
  503.  CXX      google/protobuf/stubs/stringpiece.lo
  504.  CXX      google/protobuf/stubs/stringprintf.lo
  505.  CXX      google/protobuf/stubs/structurally_valid.lo
  506.  CXX      google/protobuf/stubs/strutil.lo
  507.  CXX      google/protobuf/stubs/time.lo
  508.  CXX      google/protobuf/any_lite.lo
  509.  CXX      google/protobuf/arena.lo
  510.  CXX      google/protobuf/arenastring.lo
  511.  CXX      google/protobuf/extension_set.lo
  512.  CXX      google/protobuf/field_access_listener.lo
  513.  CXX      google/protobuf/generated_enum_util.lo
  514.  CXX      google/protobuf/generated_message_util.lo
  515.  CXX      google/protobuf/generated_message_table_driven_lite.lo
  516.  CXX      google/protobuf/implicit_weak_message.lo
  517.  CXX      google/protobuf/map.lo
  518.  CXX      google/protobuf/message_lite.lo
  519.  CXX      google/protobuf/parse_context.lo
  520.  CXX      google/protobuf/repeated_field.lo
  521.  CXX      google/protobuf/wire_format_lite.lo
  522.  CXX      google/protobuf/io/coded_stream.lo
  523.  CXX      google/protobuf/io/strtod.lo
  524.  CXX      google/protobuf/io/zero_copy_stream.lo
  525.  CXX      google/protobuf/io/zero_copy_stream_impl.lo
  526.  CXX      google/protobuf/io/zero_copy_stream_impl_lite.lo
  527.  CXX      google/protobuf/any.pb.lo
  528.  CXX      google/protobuf/api.pb.lo
  529.  CXX      google/protobuf/any.lo
  530.  CXX      google/protobuf/descriptor.lo
  531.  CXX      google/protobuf/descriptor_database.lo
  532.  CXX      google/protobuf/descriptor.pb.lo
  533.  CXX      google/protobuf/duration.pb.lo
  534.  CXX      google/protobuf/dynamic_message.lo
  535.  CXX      google/protobuf/empty.pb.lo
  536.  CXX      google/protobuf/extension_set_heavy.lo
  537.  CXX      google/protobuf/field_mask.pb.lo
  538.  CXX      google/protobuf/generated_message_reflection.lo
  539.  CXX      google/protobuf/generated_message_table_driven.lo
  540.  CXX      google/protobuf/map_field.lo
  541.  CXX      google/protobuf/message.lo
  542.  CXX      google/protobuf/reflection_ops.lo
  543.  CXX      google/protobuf/service.lo
  544.  CXX      google/protobuf/source_context.pb.lo
  545.  CXX      google/protobuf/struct.pb.lo
  546.  CXX      google/protobuf/stubs/substitute.lo
  547.  CXX      google/protobuf/text_format.lo
  548.  CXX      google/protobuf/timestamp.pb.lo
  549.  CXX      google/protobuf/type.pb.lo
  550.  CXX      google/protobuf/unknown_field_set.lo
  551.  CXX      google/protobuf/wire_format.lo
  552.  CXX      google/protobuf/wrappers.pb.lo
  553.  CXX      google/protobuf/io/gzip_stream.lo
  554.  CXX      google/protobuf/io/printer.lo
  555.  CXX      google/protobuf/io/tokenizer.lo
  556.  CXX      google/protobuf/compiler/importer.lo
  557.  CXX      google/protobuf/compiler/parser.lo
  558.  CXX      google/protobuf/util/delimited_message_util.lo
  559.  CXX      google/protobuf/util/field_comparator.lo
  560.  CXX      google/protobuf/util/field_mask_util.lo
  561.  CXX      google/protobuf/util/internal/datapiece.lo
  562.  CXX      google/protobuf/util/internal/default_value_objectwriter.lo
  563.  CXX      google/protobuf/util/internal/error_listener.lo
  564.  CXX      google/protobuf/util/internal/field_mask_utility.lo
  565.  CXX      google/protobuf/util/internal/json_escaping.lo
  566.  CXX      google/protobuf/util/internal/json_objectwriter.lo
  567.  CXX      google/protobuf/util/internal/json_stream_parser.lo
  568.  CXX      google/protobuf/util/internal/object_writer.lo
  569.  CXX      google/protobuf/util/internal/protostream_objectsource.lo
  570.  CXX      google/protobuf/util/internal/protostream_objectwriter.lo
  571.  CXX      google/protobuf/util/internal/proto_writer.lo
  572.  CXX      google/protobuf/util/internal/type_info.lo
  573.  CXX      google/protobuf/util/internal/type_info_test_helper.lo
  574.  CXX      google/protobuf/util/internal/utility.lo
  575.  CXX      google/protobuf/util/json_util.lo
  576.  CXX      google/protobuf/util/message_differencer.lo
  577.  CXX      google/protobuf/util/time_util.lo
  578.  CXX      google/protobuf/util/type_resolver_util.lo
  579.  CXX      google/protobuf/compiler/cpp/cpp_enum.lo
  580.  CXX      google/protobuf/compiler/cpp/cpp_enum_field.lo
  581.  CXX      google/protobuf/compiler/cpp/cpp_extension.lo
  582.  CXX      google/protobuf/compiler/cpp/cpp_field.lo
  583.  CXX      google/protobuf/compiler/cpp/cpp_file.lo
  584.  CXX      google/protobuf/compiler/cpp/cpp_generator.lo
  585.  CXX      google/protobuf/compiler/cpp/cpp_helpers.lo
  586.  CXX      google/protobuf/compiler/cpp/cpp_map_field.lo
  587.  CXX      google/protobuf/compiler/cpp/cpp_message.lo
  588.  CXX      google/protobuf/compiler/cpp/cpp_message_field.lo
  589. google/protobuf/compiler/cpp/cpp_helpers.cc:173:6: warning: function 'Base63Char' is not needed and will not be emitted
  590.      [-Wunneeded-internal-declaration]
  591. char Base63Char(int value) {
  592.     ^
  593.  CXX      google/protobuf/compiler/cpp/cpp_padding_optimizer.lo
  594. 1 warning generated.
  595.  CXX      google/protobuf/compiler/cpp/cpp_parse_function_generator.lo
  596.  CXX      google/protobuf/compiler/cpp/cpp_primitive_field.lo
  597.  CXX      google/protobuf/compiler/cpp/cpp_service.lo
  598.  CXX      google/protobuf/compiler/cpp/cpp_string_field.lo
  599.  CXX      google/protobuf/compiler/java/java_context.lo
  600.  CXX      google/protobuf/compiler/java/java_enum.lo
  601.  CXX      google/protobuf/compiler/java/java_enum_lite.lo
  602.  CXX      google/protobuf/compiler/java/java_enum_field.lo
  603.  CXX      google/protobuf/compiler/java/java_enum_field_lite.lo
  604.  CXX      google/protobuf/compiler/java/java_extension.lo
  605.  CXX      google/protobuf/compiler/java/java_extension_lite.lo
  606.  CXX      google/protobuf/compiler/java/java_field.lo
  607.  CXX      google/protobuf/compiler/java/java_file.lo
  608.  CXX      google/protobuf/compiler/java/java_generator.lo
  609. In file included from google/protobuf/compiler/java/java_field.cc:45:
  610. ./google/protobuf/compiler/java/java_map_field.h:68:15: warning: 'GetBoxedType' overrides a member function but is not
  611.      marked 'override' [-Winconsistent-missing-override]
  612.  std::string GetBoxedType() const;
  613.              ^
  614. ./google/protobuf/compiler/java/java_field.h:92:23: note: overridden virtual function is here
  615.  virtual std::string GetBoxedType() const = 0;
  616.                      ^
  617.  CXX      google/protobuf/compiler/java/java_generator_factory.lo
  618. 1 warning generated.
  619.  CXX      google/protobuf/compiler/java/java_helpers.lo
  620. In file included from google/protobuf/compiler/java/java_generator_factory.cc:42:
  621. ./google/protobuf/compiler/java/java_message_lite.h:53:16: warning: 'Generate' overrides a member function but is not
  622.      marked 'override' [-Winconsistent-missing-override]
  623.  virtual void Generate(io::Printer* printer);
  624.               ^
  625. ./google/protobuf/compiler/java/java_message.h:79:16: note: overridden virtual function is here
  626.  virtual void Generate(io::Printer* printer) = 0;
  627.               ^
  628. In file included from google/protobuf/compiler/java/java_generator_factory.cc:42:
  629. ./google/protobuf/compiler/java/java_message_lite.h:54:16: warning: 'GenerateInterface' overrides a member function but is
  630.      not marked 'override' [-Winconsistent-missing-override]
  631.  virtual void GenerateInterface(io::Printer* printer);
  632.               ^
  633. ./google/protobuf/compiler/java/java_message.h:83:16: note: overridden virtual function is here
  634.  virtual void GenerateInterface(io::Printer* printer) = 0;
  635.               ^
  636. In file included from google/protobuf/compiler/java/java_generator_factory.cc:42:
  637. ./google/protobuf/compiler/java/java_message_lite.h:55:16: warning: 'GenerateExtensionRegistrationCode' overrides a member
  638.      function but is not marked 'override' [-Winconsistent-missing-override]
  639.  virtual void GenerateExtensionRegistrationCode(io::Printer* printer);
  640.               ^
  641. ./google/protobuf/compiler/java/java_message.h:87:16: note: overridden virtual function is here
  642.  virtual void GenerateExtensionRegistrationCode(io::Printer* printer) = 0;
  643.               ^
  644. In file included from google/protobuf/compiler/java/java_generator_factory.cc:42:
  645. ./google/protobuf/compiler/java/java_message_lite.h:56:16: warning: 'GenerateStaticVariables' overrides a member function
  646.      but is not marked 'override' [-Winconsistent-missing-override]
  647.  virtual void GenerateStaticVariables(io::Printer* printer,
  648.               ^
  649. ./google/protobuf/compiler/java/java_message.h:71:16: note: overridden virtual function is here
  650.  virtual void GenerateStaticVariables(io::Printer* printer,
  651.               ^
  652. In file included from google/protobuf/compiler/java/java_generator_factory.cc:42:
  653. ./google/protobuf/compiler/java/java_message_lite.h:58:15: warning: 'GenerateStaticVariableInitializers' overrides a member
  654.      function but is not marked 'override' [-Winconsistent-missing-override]
  655.  virtual int GenerateStaticVariableInitializers(io::Printer* printer);
  656.              ^
  657. ./google/protobuf/compiler/java/java_message.h:76:15: note: overridden virtual function is here
  658.  virtual int GenerateStaticVariableInitializers(io::Printer* printer) = 0;
  659.              ^
  660.  CXX      google/protobuf/compiler/java/java_kotlin_generator.lo
  661. 5 warnings generated.
  662.  CXX      google/protobuf/compiler/java/java_map_field.lo
  663.  CXX      google/protobuf/compiler/java/java_map_field_lite.lo
  664. In file included from google/protobuf/compiler/java/java_map_field.cc:31:
  665. ./google/protobuf/compiler/java/java_map_field.h:68:15: warning: 'GetBoxedType' overrides a member function but is not
  666.      marked 'override' [-Winconsistent-missing-override]
  667.  std::string GetBoxedType() const;
  668.              ^
  669. ./google/protobuf/compiler/java/java_field.h:92:23: note: overridden virtual function is here
  670.  virtual std::string GetBoxedType() const = 0;
  671.                      ^
  672.  CXX      google/protobuf/compiler/java/java_message.lo
  673.  CXX      google/protobuf/compiler/java/java_message_lite.lo
  674. 1 warning generated.
  675.  CXX      google/protobuf/compiler/java/java_message_builder.lo
  676.  CXX      google/protobuf/compiler/java/java_message_builder_lite.lo
  677. In file included from google/protobuf/compiler/java/java_message_lite.cc:35:
  678. ./google/protobuf/compiler/java/java_message_lite.h:53:16: warning: 'Generate' overrides a member function but is not
  679.      marked 'override' [-Winconsistent-missing-override]
  680.  virtual void Generate(io::Printer* printer);
  681.               ^
  682. ./google/protobuf/compiler/java/java_message.h:79:16: note: overridden virtual function is here
  683.  virtual void Generate(io::Printer* printer) = 0;
  684.               ^
  685. In file included from google/protobuf/compiler/java/java_message_lite.cc:35:
  686. ./google/protobuf/compiler/java/java_message_lite.h:54:16: warning: 'GenerateInterface' overrides a member function but is
  687.      not marked 'override' [-Winconsistent-missing-override]
  688.  virtual void GenerateInterface(io::Printer* printer);
  689.               ^
  690. ./google/protobuf/compiler/java/java_message.h:83:16: note: overridden virtual function is here
  691.  virtual void GenerateInterface(io::Printer* printer) = 0;
  692.               ^
  693. In file included from google/protobuf/compiler/java/java_message_lite.cc:35:
  694. ./google/protobuf/compiler/java/java_message_lite.h:55:16: warning: 'GenerateExtensionRegistrationCode' overrides a member
  695.      function but is not marked 'override' [-Winconsistent-missing-override]
  696.  virtual void GenerateExtensionRegistrationCode(io::Printer* printer);
  697.               ^
  698. ./google/protobuf/compiler/java/java_message.h:87:16: note: overridden virtual function is here
  699.  virtual void GenerateExtensionRegistrationCode(io::Printer* printer) = 0;
  700.               ^
  701. In file included from google/protobuf/compiler/java/java_message_lite.cc:35:
  702. ./google/protobuf/compiler/java/java_message_lite.h:56:16: warning: 'GenerateStaticVariables' overrides a member function
  703.      but is not marked 'override' [-Winconsistent-missing-override]
  704.  virtual void GenerateStaticVariables(io::Printer* printer,
  705.               ^
  706. ./google/protobuf/compiler/java/java_message.h:71:16: note: overridden virtual function is here
  707.  virtual void GenerateStaticVariables(io::Printer* printer,
  708.               ^
  709. In file included from google/protobuf/compiler/java/java_message_lite.cc:35:
  710. ./google/protobuf/compiler/java/java_message_lite.h:58:15: warning: 'GenerateStaticVariableInitializers' overrides a member
  711.      function but is not marked 'override' [-Winconsistent-missing-override]
  712.  virtual int GenerateStaticVariableInitializers(io::Printer* printer);
  713.              ^
  714. ./google/protobuf/compiler/java/java_message.h:76:15: note: overridden virtual function is here
  715.  virtual int GenerateStaticVariableInitializers(io::Printer* printer) = 0;
  716.              ^
  717.  CXX      google/protobuf/compiler/java/java_message_field.lo
  718. 5 warnings generated.
  719.  CXX      google/protobuf/compiler/java/java_message_field_lite.lo
  720.  CXX      google/protobuf/compiler/java/java_name_resolver.lo
  721.  CXX      google/protobuf/compiler/java/java_primitive_field.lo
  722.  CXX      google/protobuf/compiler/java/java_primitive_field_lite.lo
  723.  CXX      google/protobuf/compiler/java/java_shared_code_generator.lo
  724.  CXX      google/protobuf/compiler/java/java_service.lo
  725.  CXX      google/protobuf/compiler/java/java_string_field.lo
  726.  CXX      google/protobuf/compiler/java/java_string_field_lite.lo
  727.  CXX      google/protobuf/compiler/java/java_doc_comment.lo
  728.  CXX      google/protobuf/compiler/js/js_generator.lo
  729.  CXX      google/protobuf/compiler/js/well_known_types_embed.lo
  730.  CXX      google/protobuf/compiler/objectivec/objectivec_enum.lo
  731.  CXX      google/protobuf/compiler/objectivec/objectivec_enum_field.lo
  732.  CXX      google/protobuf/compiler/objectivec/objectivec_extension.lo
  733.  CXX      google/protobuf/compiler/objectivec/objectivec_field.lo
  734. google/protobuf/compiler/js/js_generator.cc:97:6: warning: unused function 'StrEndsWith' [-Wunused-function]
  735. bool StrEndsWith(StringPiece sp, StringPiece x) {
  736.     ^
  737.  CXX      google/protobuf/compiler/objectivec/objectivec_file.lo
  738.  CXX      google/protobuf/compiler/objectivec/objectivec_generator.lo
  739. 1 warning generated.
  740.  CXX      google/protobuf/compiler/objectivec/objectivec_helpers.lo
  741.  CXX      google/protobuf/compiler/objectivec/objectivec_map_field.lo
  742.  CXX      google/protobuf/compiler/objectivec/objectivec_message.lo
  743.  CXX      google/protobuf/compiler/objectivec/objectivec_message_field.lo
  744.  CXX      google/protobuf/compiler/objectivec/objectivec_oneof.lo
  745.  CXX      google/protobuf/compiler/objectivec/objectivec_primitive_field.lo
  746.  CXX      google/protobuf/compiler/php/php_generator.lo
  747.  CXX      google/protobuf/compiler/python/python_generator.lo
  748.  CXX      google/protobuf/compiler/ruby/ruby_generator.lo
  749.  CXX      google/protobuf/compiler/csharp/csharp_doc_comment.lo
  750.  CXX      google/protobuf/compiler/csharp/csharp_enum.lo
  751.  CXX      google/protobuf/compiler/csharp/csharp_enum_field.lo
  752.  CXX      google/protobuf/compiler/csharp/csharp_field_base.lo
  753.  CXX      google/protobuf/compiler/csharp/csharp_generator.lo
  754.  CXX      google/protobuf/compiler/csharp/csharp_helpers.lo
  755.  CXX      google/protobuf/compiler/csharp/csharp_map_field.lo
  756.  CXX      google/protobuf/compiler/csharp/csharp_message.lo
  757.  CXX      google/protobuf/compiler/csharp/csharp_message_field.lo
  758.  CXX      google/protobuf/compiler/csharp/csharp_primitive_field.lo
  759.  CXX      google/protobuf/compiler/csharp/csharp_reflection_class.lo
  760.  CXX      google/protobuf/compiler/csharp/csharp_repeated_enum_field.lo
  761.  CXX      google/protobuf/compiler/csharp/csharp_repeated_message_field.lo
  762.  CXX      google/protobuf/compiler/csharp/csharp_repeated_primitive_field.lo
  763.  CXX      google/protobuf/compiler/csharp/csharp_source_generator_base.lo
  764.  CXX      google/protobuf/compiler/csharp/csharp_wrapper_field.lo
  765.  CXXLD    libprotobuf-lite.la
  766. /Applications/Xcode.app/Contents/Developer/Toolchains/XcodeDefault.xctoolchain/usr/bin/ranlib: file: .libs/libprotobuf-lite.a(io_win32.o) has no symbols
  767. /Applications/Xcode.app/Contents/Developer/Toolchains/XcodeDefault.xctoolchain/usr/bin/ranlib: file: .libs/libprotobuf-lite.a(io_win32.o) has no symbols
  768.  CXXLD    libprotobuf.la
  769. /Applications/Xcode.app/Contents/Developer/Toolchains/XcodeDefault.xctoolchain/usr/bin/ranlib: file: .libs/libprotobuf.a(io_win32.o) has no symbols
  770. /Applications/Xcode.app/Contents/Developer/Toolchains/XcodeDefault.xctoolchain/usr/bin/ranlib: file: .libs/libprotobuf.a(gzip_stream.o) has no symbols
  771. /Applications/Xcode.app/Contents/Developer/Toolchains/XcodeDefault.xctoolchain/usr/bin/ranlib: file: .libs/libprotobuf.a(error_listener.o) has no symbols
  772. /Applications/Xcode.app/Contents/Developer/Toolchains/XcodeDefault.xctoolchain/usr/bin/ranlib: file: .libs/libprotobuf.a(io_win32.o) has no symbols
  773. /Applications/Xcode.app/Contents/Developer/Toolchains/XcodeDefault.xctoolchain/usr/bin/ranlib: file: .libs/libprotobuf.a(gzip_stream.o) has no symbols
  774. /Applications/Xcode.app/Contents/Developer/Toolchains/XcodeDefault.xctoolchain/usr/bin/ranlib: file: .libs/libprotobuf.a(error_listener.o) has no symbols
  775. In file included from google/protobuf/compiler/csharp/csharp_source_generator_base.cc:39:
  776. ./google/protobuf/compiler/csharp/csharp_source_generator_base.h:62:25: warning: private field 'descriptor_' is not used
  777.      [-Wunused-private-field]
  778.  const FileDescriptor* descriptor_;
  779.                        ^
  780. 1 warning generated.
  781.  CXXLD    libprotoc.la
  782.  CXXLD    protoc
  783. OK  
  784.  
  785. [/var/folders/zz/zyxvpxvq6csfxvn_n0000000000000/T/netdata-updater-XXXXXXXXXX.915Rr8w7/netdata-v1.33.1-78-g9ef13f190]# mkdir -p /var/folders/zz/zyxvpxvq6csfxvn_n0000000000000/T/netdata-updater-XXXXXXXXXX.915Rr8w7/netdata-v1.33.1-78-g9ef13f190/externaldeps/protobuf
  786. OK  
  787.  
  788. [/var/folders/zz/zyxvpxvq6csfxvn_n0000000000000/T/netdata-updater-XXXXXXXXXX.915Rr8w7/netdata-v1.33.1-78-g9ef13f190]# cp -a /var/folders/zz/zyxvpxvq6csfxvn_n0000000000000/T/netdata-protobuf-XXXXXX.9ZIE48f3/protobuf-3.17.3/src /var/folders/zz/zyxvpxvq6csfxvn_n0000000000000/T/netdata-updater-XXXXXXXXXX.915Rr8w7/netdata-v1.33.1-78-g9ef13f190/externaldeps/protobuf
  789. OK  
  790.  
  791. OK  protobuf built and prepared.
  792.  
  793. --- /usr/include/Judy.h does not exist, but we need libJudy, building our own copy ---
  794. --- Prepare libJudy ---
  795. [/var/folders/zz/zyxvpxvq6csfxvn_n0000000000000/T/netdata-updater-XXXXXXXXXX.915Rr8w7/netdata-v1.33.1-78-g9ef13f190]# curl -q -sSL --connect-timeout 10 --retry 3 --output /var/folders/zz/zyxvpxvq6csfxvn_n0000000000000/T/netdata-judy-XXXXXX.ePVsID3c/v1.0.5-netdata2.tar.gz https://github.com/netdata/libjudy/archive/v1.0.5-netdata2.tar.gz
  796. OK  
  797.  
  798. v1.0.5-netdata2.tar.gz: OK
  799. [/var/folders/zz/zyxvpxvq6csfxvn_n0000000000000/T/netdata-updater-XXXXXXXXXX.915Rr8w7/netdata-v1.33.1-78-g9ef13f190]# tar --no-same-owner -xf /var/folders/zz/zyxvpxvq6csfxvn_n0000000000000/T/netdata-judy-XXXXXX.ePVsID3c/v1.0.5-netdata2.tar.gz -C /var/folders/zz/zyxvpxvq6csfxvn_n0000000000000/T/netdata-judy-XXXXXX.ePVsID3c
  800. OK  
  801.  
  802. [/var/folders/zz/zyxvpxvq6csfxvn_n0000000000000/T/netdata-judy-XXXXXX.ePVsID3c/libjudy-1.0.5-netdata2]# env CFLAGS=-fPIC CXXFLAGS= LDFLAGS= glibtoolize --force --copy
  803. glibtoolize: putting auxiliary files in '.'.
  804. glibtoolize: copying file './ltmain.sh'
  805. glibtoolize: You should add the contents of the following files to 'aclocal.m4':
  806. glibtoolize:   '/usr/local/Cellar/libtool/2.4.6_4/share/aclocal/libtool.m4'
  807. glibtoolize:   '/usr/local/Cellar/libtool/2.4.6_4/share/aclocal/ltoptions.m4'
  808. glibtoolize:   '/usr/local/Cellar/libtool/2.4.6_4/share/aclocal/ltsugar.m4'
  809. glibtoolize:   '/usr/local/Cellar/libtool/2.4.6_4/share/aclocal/ltversion.m4'
  810. glibtoolize:   '/usr/local/Cellar/libtool/2.4.6_4/share/aclocal/lt~obsolete.m4'
  811. glibtoolize: Consider adding 'AC_CONFIG_MACRO_DIRS([m4])' to configure.ac,
  812. glibtoolize: and rerunning glibtoolize and aclocal.
  813. glibtoolize: Consider adding '-I m4' to ACLOCAL_AMFLAGS in Makefile.am.
  814. OK  
  815.  
  816. [/var/folders/zz/zyxvpxvq6csfxvn_n0000000000000/T/netdata-judy-XXXXXX.ePVsID3c/libjudy-1.0.5-netdata2]# env CFLAGS=-fPIC CXXFLAGS= LDFLAGS= aclocal
  817. OK  
  818.  
  819. [/var/folders/zz/zyxvpxvq6csfxvn_n0000000000000/T/netdata-judy-XXXXXX.ePVsID3c/libjudy-1.0.5-netdata2]# env CFLAGS=-fPIC CXXFLAGS= LDFLAGS= autoheader
  820. OK  
  821.  
  822. [/var/folders/zz/zyxvpxvq6csfxvn_n0000000000000/T/netdata-judy-XXXXXX.ePVsID3c/libjudy-1.0.5-netdata2]# env CFLAGS=-fPIC CXXFLAGS= LDFLAGS= automake --add-missing --force --copy --include-deps
  823. configure.ac:7: warning: AM_INIT_AUTOMAKE: two- and three-arguments forms are deprecated.  For more info, see:
  824. configure.ac:7: https://www.gnu.org/software/automake/manual/automake.html#Modernize-AM_005fINIT_005fAUTOMAKE-invocation
  825. configure.ac:147: installing './compile'
  826. configure.ac:223: installing './config.guess'
  827. configure.ac:223: installing './config.sub'
  828. configure.ac:7: installing './install-sh'
  829. configure.ac:7: installing './missing'
  830. src/Judy1/Makefile.am:1: warning: 'INCLUDES' is the old name for 'AM_CPPFLAGS' (or '*_CPPFLAGS')
  831. src/Judy1/Makefile.am: installing './depcomp'
  832. src/JudyCommon/Makefile.am:1: warning: 'INCLUDES' is the old name for 'AM_CPPFLAGS' (or '*_CPPFLAGS')
  833. src/JudyHS/Makefile.am:1: warning: 'INCLUDES' is the old name for 'AM_CPPFLAGS' (or '*_CPPFLAGS')
  834. src/JudyL/Makefile.am:1: warning: 'INCLUDES' is the old name for 'AM_CPPFLAGS' (or '*_CPPFLAGS')
  835. src/JudySL/Makefile.am:1: warning: 'INCLUDES' is the old name for 'AM_CPPFLAGS' (or '*_CPPFLAGS')
  836. src/Makefile.am:1: warning: naming a subdirectory 'obj' causes troubles with BSD make
  837. parallel-tests: installing './test-driver'
  838. tool/Makefile.am:1: warning: 'INCLUDES' is the old name for 'AM_CPPFLAGS' (or '*_CPPFLAGS')
  839. OK  
  840.  
  841. [/var/folders/zz/zyxvpxvq6csfxvn_n0000000000000/T/netdata-judy-XXXXXX.ePVsID3c/libjudy-1.0.5-netdata2]# env CFLAGS=-fPIC CXXFLAGS= LDFLAGS= autoconf
  842. configure.ac:7: warning: AM_INIT_AUTOMAKE: two- and three-arguments forms are deprecated.
  843. ./lib/autoconf/general.m4:2434: AC_DIAGNOSE is expanded from...
  844. aclocal.m4:9453: AM_INIT_AUTOMAKE is expanded from...
  845. configure.ac:7: the top level
  846. configure.ac:12: warning: 'AM_CONFIG_HEADER': this macro is obsolete.
  847. configure.ac:12: You should use the 'AC_CONFIG_HEADERS' macro instead.
  848. ./lib/autoconf/general.m4:2434: AC_DIAGNOSE is expanded from...
  849. aclocal.m4:9805: AM_CONFIG_HEADER is expanded from...
  850. configure.ac:12: the top level
  851. configure.ac:110: warning: The macro `AC_HELP_STRING' is obsolete.
  852. configure.ac:110: You should run autoupdate.
  853. ./lib/autoconf/general.m4:204: AC_HELP_STRING is expanded from...
  854. configure.ac:110: the top level
  855. configure.ac:119: warning: The macro `AC_HELP_STRING' is obsolete.
  856. configure.ac:119: You should run autoupdate.
  857. ./lib/autoconf/general.m4:204: AC_HELP_STRING is expanded from...
  858. configure.ac:119: the top level
  859. configure.ac:156: warning: The macro `AC_HEADER_STDC' is obsolete.
  860. configure.ac:156: You should run autoupdate.
  861. ./lib/autoconf/headers.m4:704: AC_HEADER_STDC is expanded from...
  862. configure.ac:156: the top level
  863. configure.ac:168: warning: The macro `AC_HEADER_TIME' is obsolete.
  864. configure.ac:168: You should run autoupdate.
  865. ./lib/autoconf/headers.m4:743: AC_HEADER_TIME is expanded from...
  866. configure.ac:168: the top level
  867. configure.ac:238: warning: The macro `AM_PROG_LIBTOOL' is obsolete.
  868. configure.ac:238: You should run autoupdate.
  869. aclocal.m4:122: AM_PROG_LIBTOOL is expanded from...
  870. configure.ac:238: the top level
  871.  OK  
  872.  
  873. [/var/folders/zz/zyxvpxvq6csfxvn_n0000000000000/T/netdata-judy-XXXXXX.ePVsID3c/libjudy-1.0.5-netdata2]# env CFLAGS=-fPIC CXXFLAGS= LDFLAGS= ./configure
  874. checking whether to enable maintainer-specific portions of Makefiles... no
  875. checking for a BSD-compatible install... /usr/bin/install -c
  876. checking whether build environment is sane... yes
  877. checking for a race-free mkdir -p... ./install-sh -c -d
  878. checking for gawk... no
  879. checking for mawk... no
  880. checking for nawk... no
  881. checking for awk... awk
  882. checking whether make sets $(MAKE)... yes
  883. checking whether make supports nested variables... yes
  884. checking which flavor to build... product
  885. checking for gcc... gcc
  886. checking whether the C compiler works... yes
  887. checking for C compiler default output file name... a.out
  888. checking for suffix of executables...
  889. checking whether we are cross compiling... no
  890. checking for suffix of object files... o
  891. checking whether the compiler supports GNU C... yes
  892. checking whether gcc accepts -g... yes
  893. checking for gcc option to enable C11 features... none needed
  894. checking whether gcc understands -c and -o together... yes
  895. checking whether make supports the include directive... yes (GNU style)
  896. checking dependency style of gcc... gcc3
  897. checking how to run the C preprocessor... gcc -E
  898. checking whether ln -s works... yes
  899. checking whether make sets $(MAKE)... (cached) yes
  900. checking for stdio.h... yes
  901. checking for stdlib.h... yes
  902. checking for string.h... yes
  903. checking for inttypes.h... yes
  904. checking for stdint.h... yes
  905. checking for strings.h... yes
  906. checking for sys/stat.h... yes
  907. checking for sys/types.h... yes
  908. checking for unistd.h... yes
  909. checking for sys/time.h... yes
  910. checking for sys/param.h... yes
  911. checking for grep that handles long lines and -e... /usr/bin/grep
  912. checking for egrep... /usr/bin/grep -E
  913. checking for fcntl.h... yes
  914. checking for inttypes.h... (cached) yes
  915. checking for limits.h... yes
  916. checking for malloc.h... no
  917. checking for stddef.h... yes
  918. checking for stdint.h... (cached) yes
  919. checking for stdlib.h... (cached) yes
  920. checking for string.h... (cached) yes
  921. checking for strings.h... (cached) yes
  922. checking for sys/param.h... (cached) yes
  923. checking for sys/time.h... (cached) yes
  924. checking for unistd.h... (cached) yes
  925. checking for _Bool... yes
  926. checking for stdbool.h that conforms to C99... yes
  927. checking for an ANSI C-conforming const... yes
  928. checking for inline... inline
  929. checking for size_t... yes
  930. checking whether struct tm is in sys/time.h or time.h... time.h
  931. checking for working volatile... yes
  932. checking for ptrdiff_t... yes
  933. checking whether byte ordering is bigendian... no
  934. checking size of void *... 8
  935. Detected 64-bit Build Environment
  936. checking for error_at_line... no
  937. checking build system type... x86_64-apple-darwin19.6.0
  938. checking host system type... x86_64-apple-darwin19.6.0
  939. checking for GNU libc compatible malloc... yes
  940. checking for working memcmp... yes
  941. checking for getpagesize... yes
  942. checking for vprintf... yes
  943. checking for working mmap... yes
  944. checking whether lstat correctly handles trailing slash... no
  945. checking whether stat accepts an empty string... no
  946. checking for getpagesize... (cached) yes
  947. checking for gettimeofday... yes
  948. checking for memset... yes
  949. checking for munmap... yes
  950. checking for pow... yes
  951. checking for strchr... yes
  952. checking for strcspn... yes
  953. checking for strerror... yes
  954. checking for strstr... yes
  955. checking for strtoul... yes
  956. checking for uname... yes
  957. checking for ar... ar
  958. checking for ld... ld
  959. checking for ranlib... ranlib
  960. checking how to print strings... printf
  961. checking for a sed that does not truncate output... /usr/bin/sed
  962. checking for fgrep... /usr/bin/grep -F
  963. checking for ld used by gcc... ld
  964. checking if the linker (ld) is GNU ld... no
  965. checking for BSD- or MS-compatible name lister (nm)... /usr/bin/nm -B
  966. checking the name lister (/usr/bin/nm -B) interface... BSD nm
  967. checking the maximum length of command line arguments... 196608
  968. checking how to convert x86_64-apple-darwin19.6.0 file names to x86_64-apple-darwin19.6.0 format... func_convert_file_noop
  969. checking how to convert x86_64-apple-darwin19.6.0 file names to toolchain format... func_convert_file_noop
  970. checking for ld option to reload object files... -r
  971. checking for objdump... objdump
  972. checking how to recognize dependent libraries... pass_all
  973. checking for dlltool... no
  974. checking how to associate runtime and link libraries... printf %s\n
  975. checking for archiver @FILE support... no
  976. checking for strip... strip
  977. checking for ranlib... (cached) ranlib
  978. checking command to parse /usr/bin/nm -B output from gcc object... ok
  979. checking for sysroot... no
  980. checking for a working dd... /bin/dd
  981. checking how to truncate binary pipes... /bin/dd bs=4096 count=1
  982. checking for mt... no
  983. checking if : is a manifest tool... no
  984. checking for dsymutil... dsymutil
  985. checking for nmedit... nmedit
  986. checking for lipo... lipo
  987. checking for otool... otool
  988. checking for otool64... no
  989. checking for -single_module linker flag... yes
  990. checking for -exported_symbols_list linker flag... yes
  991. checking for -force_load linker flag... yes
  992. checking for dlfcn.h... yes
  993. checking for objdir... .libs
  994. checking if gcc supports -fno-rtti -fno-exceptions... yes
  995. checking for gcc option to produce PIC... -fno-common -DPIC
  996. checking if gcc PIC flag -fno-common -DPIC works... yes
  997. checking if gcc static flag -static works... no
  998. checking if gcc supports -c -o file.o... yes
  999. checking if gcc supports -c -o file.o... (cached) yes
  1000. checking whether the gcc linker (ld) supports shared libraries... yes
  1001. checking dynamic linker characteristics... darwin19.6.0 dyld
  1002. checking how to hardcode library paths into programs... immediate
  1003. checking whether stripping libraries is possible... yes
  1004. checking if libtool supports shared libraries... yes
  1005. checking whether to build shared libraries... yes
  1006. checking whether to build static libraries... yes
  1007. checking that generated files are newer than configure... done
  1008. configure: creating ./config.status
  1009. config.status: creating Makefile
  1010. config.status: creating src/Judy1/Makefile
  1011. config.status: creating src/JudyCommon/Makefile
  1012. config.status: creating src/JudyHS/Makefile
  1013. config.status: creating src/JudyL/Makefile
  1014. config.status: creating src/JudySL/Makefile
  1015. config.status: creating src/Makefile
  1016. config.status: creating src/obj/Makefile
  1017. config.status: creating tool/Makefile
  1018. config.status: creating doc/Makefile
  1019. config.status: creating test/Makefile
  1020. config.status: creating config.h
  1021. config.status: executing depfiles commands
  1022. config.status: executing libtool commands
  1023.  OK  
  1024.  
  1025. [/var/folders/zz/zyxvpxvq6csfxvn_n0000000000000/T/netdata-judy-XXXXXX.ePVsID3c/libjudy-1.0.5-netdata2]# env CFLAGS=-fPIC CXXFLAGS= LDFLAGS= make -j4 -C src
  1026. Making all in .
  1027. make[1]: Nothing to be done for `all-am'.
  1028. Making all in JudyCommon
  1029. /bin/sh ../../libtool  --tag=CC   --mode=compile gcc -DHAVE_CONFIG_H -I. -I../.. -I. -I..   -fPIC -DJU_64BIT   -fPIC -DJU_64BIT -MT JudyMalloc.lo -MD -MP -MF .deps/JudyMalloc.Tpo -c -o JudyMalloc.lo JudyMalloc.c
  1030. libtool: compile:  gcc -DHAVE_CONFIG_H -I. -I../.. -I. -I.. -fPIC -DJU_64BIT -fPIC -DJU_64BIT -MT JudyMalloc.lo -MD -MP -MF .deps/JudyMalloc.Tpo -c JudyMalloc.c  -fno-common -DPIC -o .libs/JudyMalloc.o
  1031. libtool: compile:  gcc -DHAVE_CONFIG_H -I. -I../.. -I. -I.. -fPIC -DJU_64BIT -fPIC -DJU_64BIT -MT JudyMalloc.lo -MD -MP -MF .deps/JudyMalloc.Tpo -c JudyMalloc.c -o JudyMalloc.o >/dev/null 2>&1
  1032. mv -f .deps/JudyMalloc.Tpo .deps/JudyMalloc.Plo
  1033. /bin/sh ../../libtool  --tag=CC   --mode=link gcc -fPIC -DJU_64BIT   -fPIC -DJU_64BIT   -o libJudyMalloc.la  JudyMalloc.lo  
  1034. libtool: link: ar cru .libs/libJudyMalloc.a .libs/JudyMalloc.o
  1035. libtool: link: ranlib .libs/libJudyMalloc.a
  1036. libtool: link: ( cd ".libs" && rm -f "libJudyMalloc.la" && ln -s "../libJudyMalloc.la" "libJudyMalloc.la" )
  1037. Making all in JudyL
  1038. cp -f ../JudyCommon/JudyCascade.c           JudyLCascade.c
  1039. cp -f ../JudyCommon/JudyTables.c            JudyLTablesGen.c
  1040. cp -f ../JudyCommon/JudyCount.c             JudyLCount.c
  1041. cp -f ../JudyCommon/JudyCreateBranch.c      JudyLCreateBranch.c
  1042. cp -f ../JudyCommon/JudyDecascade.c         JudyLDecascade.c
  1043. cp -f ../JudyCommon/JudyDel.c               JudyLDel.c
  1044. cp -f ../JudyCommon/JudyFirst.c             JudyLFirst.c
  1045. cp -f ../JudyCommon/JudyFreeArray.c         JudyLFreeArray.c
  1046. cp -f ../JudyCommon/JudyGet.c               JudyLGet.c
  1047. cp -f ../JudyCommon/JudyInsArray.c          JudyLInsArray.c
  1048. cp -f ../JudyCommon/JudyIns.c               JudyLIns.c
  1049. cp -f ../JudyCommon/JudyInsertBranch.c      JudyLInsertBranch.c
  1050. cp -f ../JudyCommon/JudyMallocIF.c          JudyLMallocIF.c
  1051. cp -f ../JudyCommon/JudyMemActive.c         JudyLMemActive.c
  1052. cp -f ../JudyCommon/JudyMemUsed.c           JudyLMemUsed.c
  1053. cp -f ../JudyCommon/JudyPrevNext.c          JudyLNext.c
  1054. cp -f ../JudyCommon/JudyPrevNextEmpty.c     JudyLNextEmpty.c
  1055. cp -f ../JudyCommon/JudyPrevNext.c          JudyLPrev.c
  1056. cp -f ../JudyCommon/JudyPrevNextEmpty.c     JudyLPrevEmpty.c
  1057. cp -f ../JudyCommon/JudyByCount.c           JudyLByCount.c  
  1058. cp -f ../JudyCommon/JudyGet.c               j__udyLGet.c
  1059. /bin/sh ../../libtool  --tag=CC   --mode=compile gcc -DHAVE_CONFIG_H -I. -I../.. -I. -I.. -I../JudyCommon/    -DJUDYL   -fPIC -DJU_64BIT -MT JudyLCascade.lo -MD -MP -MF .deps/JudyLCascade.Tpo -c -o JudyLCascade.lo JudyLCascade.c
  1060. gcc -I. -I.. -I../JudyCommon/  -DJUDYL   -fPIC -DJU_64BIT -o JudyLTablesGen JudyLTablesGen.c; ./JudyLTablesGen
  1061. /bin/sh ../../libtool  --tag=CC   --mode=compile gcc -DHAVE_CONFIG_H -I. -I../.. -I. -I.. -I../JudyCommon/    -DJUDYL   -fPIC -DJU_64BIT -MT JudyLCount.lo -MD -MP -MF .deps/JudyLCount.Tpo -c -o JudyLCount.lo JudyLCount.c
  1062. /bin/sh ../../libtool  --tag=CC   --mode=compile gcc -DHAVE_CONFIG_H -I. -I../.. -I. -I.. -I../JudyCommon/    -DJUDYL   -fPIC -DJU_64BIT -MT JudyLCreateBranch.lo -MD -MP -MF .deps/JudyLCreateBranch.Tpo -c -o JudyLCreateBranch.lo JudyLCreateBranch.c
  1063. libtool: compile:  gcc -DHAVE_CONFIG_H -I. -I../.. -I. -I.. -I../JudyCommon/ -DJUDYL -fPIC -DJU_64BIT -MT JudyLCascade.lo -MD -MP -MF .deps/JudyLCascade.Tpo -c JudyLCascade.c  -fno-common -DPIC -o .libs/JudyLCascade.o
  1064. libtool: compile:  gcc -DHAVE_CONFIG_H -I. -I../.. -I. -I.. -I../JudyCommon/ -DJUDYL -fPIC -DJU_64BIT -MT JudyLCount.lo -MD -MP -MF .deps/JudyLCount.Tpo -c JudyLCount.c  -fno-common -DPIC -o .libs/JudyLCount.o
  1065. libtool: compile:  gcc -DHAVE_CONFIG_H -I. -I../.. -I. -I.. -I../JudyCommon/ -DJUDYL -fPIC -DJU_64BIT -MT JudyLCreateBranch.lo -MD -MP -MF .deps/JudyLCreateBranch.Tpo -c JudyLCreateBranch.c  -fno-common -DPIC -o .libs/JudyLCreateBranch.o
  1066. libtool: compile:  gcc -DHAVE_CONFIG_H -I. -I../.. -I. -I.. -I../JudyCommon/ -DJUDYL -fPIC -DJU_64BIT -MT JudyLCreateBranch.lo -MD -MP -MF .deps/JudyLCreateBranch.Tpo -c JudyLCreateBranch.c -o JudyLCreateBranch.o >/dev/null 2>&1
  1067. libtool: compile:  gcc -DHAVE_CONFIG_H -I. -I../.. -I. -I.. -I../JudyCommon/ -DJUDYL -fPIC -DJU_64BIT -MT JudyLCount.lo -MD -MP -MF .deps/JudyLCount.Tpo -c JudyLCount.c -o JudyLCount.o >/dev/null 2>&1
  1068. libtool: compile:  gcc -DHAVE_CONFIG_H -I. -I../.. -I. -I.. -I../JudyCommon/ -DJUDYL -fPIC -DJU_64BIT -MT JudyLCascade.lo -MD -MP -MF .deps/JudyLCascade.Tpo -c JudyLCascade.c -o JudyLCascade.o >/dev/null 2>&1
  1069. /bin/sh ../../libtool  --tag=CC   --mode=compile gcc -DHAVE_CONFIG_H -I. -I../.. -I. -I.. -I../JudyCommon/    -DJUDYL   -fPIC -DJU_64BIT -MT JudyLDecascade.lo -MD -MP -MF .deps/JudyLDecascade.Tpo -c -o JudyLDecascade.lo JudyLDecascade.c
  1070. mv -f .deps/JudyLCreateBranch.Tpo .deps/JudyLCreateBranch.Plo
  1071. /bin/sh ../../libtool  --tag=CC   --mode=compile gcc -DHAVE_CONFIG_H -I. -I../.. -I. -I.. -I../JudyCommon/    -DJUDYL   -fPIC -DJU_64BIT -MT JudyLDel.lo -MD -MP -MF .deps/JudyLDel.Tpo -c -o JudyLDel.lo JudyLDel.c
  1072. mv -f .deps/JudyLCount.Tpo .deps/JudyLCount.Plo
  1073. /bin/sh ../../libtool  --tag=CC   --mode=compile gcc -DHAVE_CONFIG_H -I. -I../.. -I. -I.. -I../JudyCommon/    -DJUDYL   -fPIC -DJU_64BIT -MT JudyLFirst.lo -MD -MP -MF .deps/JudyLFirst.Tpo -c -o JudyLFirst.lo JudyLFirst.c
  1074. libtool: compile:  gcc -DHAVE_CONFIG_H -I. -I../.. -I. -I.. -I../JudyCommon/ -DJUDYL -fPIC -DJU_64BIT -MT JudyLDecascade.lo -MD -MP -MF .deps/JudyLDecascade.Tpo -c JudyLDecascade.c  -fno-common -DPIC -o .libs/JudyLDecascade.o
  1075. mv -f .deps/JudyLCascade.Tpo .deps/JudyLCascade.Plo
  1076. /bin/sh ../../libtool  --tag=CC   --mode=compile gcc -DHAVE_CONFIG_H -I. -I../.. -I. -I.. -I../JudyCommon/    -DJUDYL   -fPIC -DJU_64BIT -MT JudyLFreeArray.lo -MD -MP -MF .deps/JudyLFreeArray.Tpo -c -o JudyLFreeArray.lo JudyLFreeArray.c
  1077. libtool: compile:  gcc -DHAVE_CONFIG_H -I. -I../.. -I. -I.. -I../JudyCommon/ -DJUDYL -fPIC -DJU_64BIT -MT JudyLDel.lo -MD -MP -MF .deps/JudyLDel.Tpo -c JudyLDel.c  -fno-common -DPIC -o .libs/JudyLDel.o
  1078. libtool: compile:  gcc -DHAVE_CONFIG_H -I. -I../.. -I. -I.. -I../JudyCommon/ -DJUDYL -fPIC -DJU_64BIT -MT JudyLFirst.lo -MD -MP -MF .deps/JudyLFirst.Tpo -c JudyLFirst.c  -fno-common -DPIC -o .libs/JudyLFirst.o
  1079. libtool: compile:  gcc -DHAVE_CONFIG_H -I. -I../.. -I. -I.. -I../JudyCommon/ -DJUDYL -fPIC -DJU_64BIT -MT JudyLDecascade.lo -MD -MP -MF .deps/JudyLDecascade.Tpo -c JudyLDecascade.c -o JudyLDecascade.o >/dev/null 2>&1
  1080. libtool: compile:  gcc -DHAVE_CONFIG_H -I. -I../.. -I. -I.. -I../JudyCommon/ -DJUDYL -fPIC -DJU_64BIT -MT JudyLFreeArray.lo -MD -MP -MF .deps/JudyLFreeArray.Tpo -c JudyLFreeArray.c  -fno-common -DPIC -o .libs/JudyLFreeArray.o
  1081. libtool: compile:  gcc -DHAVE_CONFIG_H -I. -I../.. -I. -I.. -I../JudyCommon/ -DJUDYL -fPIC -DJU_64BIT -MT JudyLFirst.lo -MD -MP -MF .deps/JudyLFirst.Tpo -c JudyLFirst.c -o JudyLFirst.o >/dev/null 2>&1
  1082. mv -f .deps/JudyLDecascade.Tpo .deps/JudyLDecascade.Plo
  1083. libtool: compile:  gcc -DHAVE_CONFIG_H -I. -I../.. -I. -I.. -I../JudyCommon/ -DJUDYL -fPIC -DJU_64BIT -MT JudyLFreeArray.lo -MD -MP -MF .deps/JudyLFreeArray.Tpo -c JudyLFreeArray.c -o JudyLFreeArray.o >/dev/null 2>&1
  1084. /bin/sh ../../libtool  --tag=CC   --mode=compile gcc -DHAVE_CONFIG_H -I. -I../.. -I. -I.. -I../JudyCommon/    -DJUDYL   -fPIC -DJU_64BIT -MT JudyLGet.lo -MD -MP -MF .deps/JudyLGet.Tpo -c -o JudyLGet.lo JudyLGet.c
  1085. mv -f .deps/JudyLFirst.Tpo .deps/JudyLFirst.Plo
  1086. /bin/sh ../../libtool  --tag=CC   --mode=compile gcc -DHAVE_CONFIG_H -I. -I../.. -I. -I.. -I../JudyCommon/    -DJUDYL   -fPIC -DJU_64BIT -MT JudyLInsArray.lo -MD -MP -MF .deps/JudyLInsArray.Tpo -c -o JudyLInsArray.lo JudyLInsArray.c
  1087. libtool: compile:  gcc -DHAVE_CONFIG_H -I. -I../.. -I. -I.. -I../JudyCommon/ -DJUDYL -fPIC -DJU_64BIT -MT JudyLDel.lo -MD -MP -MF .deps/JudyLDel.Tpo -c JudyLDel.c -o JudyLDel.o >/dev/null 2>&1
  1088. mv -f .deps/JudyLFreeArray.Tpo .deps/JudyLFreeArray.Plo
  1089. /bin/sh ../../libtool  --tag=CC   --mode=compile gcc -DHAVE_CONFIG_H -I. -I../.. -I. -I.. -I../JudyCommon/    -DJUDYL   -fPIC -DJU_64BIT -MT JudyLIns.lo -MD -MP -MF .deps/JudyLIns.Tpo -c -o JudyLIns.lo JudyLIns.c
  1090. libtool: compile:  gcc -DHAVE_CONFIG_H -I. -I../.. -I. -I.. -I../JudyCommon/ -DJUDYL -fPIC -DJU_64BIT -MT JudyLGet.lo -MD -MP -MF .deps/JudyLGet.Tpo -c JudyLGet.c  -fno-common -DPIC -o .libs/JudyLGet.o
  1091. libtool: compile:  gcc -DHAVE_CONFIG_H -I. -I../.. -I. -I.. -I../JudyCommon/ -DJUDYL -fPIC -DJU_64BIT -MT JudyLInsArray.lo -MD -MP -MF .deps/JudyLInsArray.Tpo -c JudyLInsArray.c  -fno-common -DPIC -o .libs/JudyLInsArray.o
  1092. libtool: compile:  gcc -DHAVE_CONFIG_H -I. -I../.. -I. -I.. -I../JudyCommon/ -DJUDYL -fPIC -DJU_64BIT -MT JudyLGet.lo -MD -MP -MF .deps/JudyLGet.Tpo -c JudyLGet.c -o JudyLGet.o >/dev/null 2>&1
  1093. libtool: compile:  gcc -DHAVE_CONFIG_H -I. -I../.. -I. -I.. -I../JudyCommon/ -DJUDYL -fPIC -DJU_64BIT -MT JudyLIns.lo -MD -MP -MF .deps/JudyLIns.Tpo -c JudyLIns.c  -fno-common -DPIC -o .libs/JudyLIns.o
  1094. libtool: compile:  gcc -DHAVE_CONFIG_H -I. -I../.. -I. -I.. -I../JudyCommon/ -DJUDYL -fPIC -DJU_64BIT -MT JudyLInsArray.lo -MD -MP -MF .deps/JudyLInsArray.Tpo -c JudyLInsArray.c -o JudyLInsArray.o >/dev/null 2>&1
  1095. mv -f .deps/JudyLGet.Tpo .deps/JudyLGet.Plo
  1096. /bin/sh ../../libtool  --tag=CC   --mode=compile gcc -DHAVE_CONFIG_H -I. -I../.. -I. -I.. -I../JudyCommon/    -DJUDYL   -fPIC -DJU_64BIT -MT JudyLInsertBranch.lo -MD -MP -MF .deps/JudyLInsertBranch.Tpo -c -o JudyLInsertBranch.lo JudyLInsertBranch.c
  1097. mv -f .deps/JudyLDel.Tpo .deps/JudyLDel.Plo
  1098. /bin/sh ../../libtool  --tag=CC   --mode=compile gcc -DHAVE_CONFIG_H -I. -I../.. -I. -I.. -I../JudyCommon/    -DJUDYL   -fPIC -DJU_64BIT -MT JudyLMallocIF.lo -MD -MP -MF .deps/JudyLMallocIF.Tpo -c -o JudyLMallocIF.lo JudyLMallocIF.c
  1099. libtool: compile:  gcc -DHAVE_CONFIG_H -I. -I../.. -I. -I.. -I../JudyCommon/ -DJUDYL -fPIC -DJU_64BIT -MT JudyLIns.lo -MD -MP -MF .deps/JudyLIns.Tpo -c JudyLIns.c -o JudyLIns.o >/dev/null 2>&1
  1100. mv -f .deps/JudyLInsArray.Tpo .deps/JudyLInsArray.Plo
  1101. /bin/sh ../../libtool  --tag=CC   --mode=compile gcc -DHAVE_CONFIG_H -I. -I../.. -I. -I.. -I../JudyCommon/    -DJUDYL   -fPIC -DJU_64BIT -MT JudyLMemActive.lo -MD -MP -MF .deps/JudyLMemActive.Tpo -c -o JudyLMemActive.lo JudyLMemActive.c
  1102. libtool: compile:  gcc -DHAVE_CONFIG_H -I. -I../.. -I. -I.. -I../JudyCommon/ -DJUDYL -fPIC -DJU_64BIT -MT JudyLInsertBranch.lo -MD -MP -MF .deps/JudyLInsertBranch.Tpo -c JudyLInsertBranch.c  -fno-common -DPIC -o .libs/JudyLInsertBranch.o
  1103. libtool: compile:  gcc -DHAVE_CONFIG_H -I. -I../.. -I. -I.. -I../JudyCommon/ -DJUDYL -fPIC -DJU_64BIT -MT JudyLMallocIF.lo -MD -MP -MF .deps/JudyLMallocIF.Tpo -c JudyLMallocIF.c  -fno-common -DPIC -o .libs/JudyLMallocIF.o
  1104. libtool: compile:  gcc -DHAVE_CONFIG_H -I. -I../.. -I. -I.. -I../JudyCommon/ -DJUDYL -fPIC -DJU_64BIT -MT JudyLInsertBranch.lo -MD -MP -MF .deps/JudyLInsertBranch.Tpo -c JudyLInsertBranch.c -o JudyLInsertBranch.o >/dev/null 2>&1
  1105. libtool: compile:  gcc -DHAVE_CONFIG_H -I. -I../.. -I. -I.. -I../JudyCommon/ -DJUDYL -fPIC -DJU_64BIT -MT JudyLMemActive.lo -MD -MP -MF .deps/JudyLMemActive.Tpo -c JudyLMemActive.c  -fno-common -DPIC -o .libs/JudyLMemActive.o
  1106. libtool: compile:  gcc -DHAVE_CONFIG_H -I. -I../.. -I. -I.. -I../JudyCommon/ -DJUDYL -fPIC -DJU_64BIT -MT JudyLMallocIF.lo -MD -MP -MF .deps/JudyLMallocIF.Tpo -c JudyLMallocIF.c -o JudyLMallocIF.o >/dev/null 2>&1
  1107. mv -f .deps/JudyLIns.Tpo .deps/JudyLIns.Plo
  1108. /bin/sh ../../libtool  --tag=CC   --mode=compile gcc -DHAVE_CONFIG_H -I. -I../.. -I. -I.. -I../JudyCommon/    -DJUDYL   -fPIC -DJU_64BIT -MT JudyLMemUsed.lo -MD -MP -MF .deps/JudyLMemUsed.Tpo -c -o JudyLMemUsed.lo JudyLMemUsed.c
  1109. mv -f .deps/JudyLInsertBranch.Tpo .deps/JudyLInsertBranch.Plo
  1110. /bin/sh ../../libtool  --tag=CC   --mode=compile gcc -DHAVE_CONFIG_H -I. -I../.. -I. -I.. -I../JudyCommon/    -DJUDYL   -DJUDYNEXT -fPIC -DJU_64BIT -MT libnext_la-JudyLNext.lo -MD -MP -MF .deps/libnext_la-JudyLNext.Tpo -c -o libnext_la-JudyLNext.lo `test -f 'JudyLNext.c' || echo './'`JudyLNext.c
  1111. libtool: compile:  gcc -DHAVE_CONFIG_H -I. -I../.. -I. -I.. -I../JudyCommon/ -DJUDYL -fPIC -DJU_64BIT -MT JudyLMemActive.lo -MD -MP -MF .deps/JudyLMemActive.Tpo -c JudyLMemActive.c -o JudyLMemActive.o >/dev/null 2>&1
  1112. mv -f .deps/JudyLMallocIF.Tpo .deps/JudyLMallocIF.Plo
  1113. /bin/sh ../../libtool  --tag=CC   --mode=compile gcc -DHAVE_CONFIG_H -I. -I../.. -I. -I.. -I../JudyCommon/    -DJUDYL   -DJUDYNEXT -fPIC -DJU_64BIT -MT libnext_la-JudyLNextEmpty.lo -MD -MP -MF .deps/libnext_la-JudyLNextEmpty.Tpo -c -o libnext_la-JudyLNextEmpty.lo `test -f 'JudyLNextEmpty.c' || echo './'`JudyLNextEmpty.c
  1114. libtool: compile:  gcc -DHAVE_CONFIG_H -I. -I../.. -I. -I.. -I../JudyCommon/ -DJUDYL -fPIC -DJU_64BIT -MT JudyLMemUsed.lo -MD -MP -MF .deps/JudyLMemUsed.Tpo -c JudyLMemUsed.c  -fno-common -DPIC -o .libs/JudyLMemUsed.o
  1115. mv -f .deps/JudyLMemActive.Tpo .deps/JudyLMemActive.Plo
  1116. /bin/sh ../../libtool  --tag=CC   --mode=compile gcc -DHAVE_CONFIG_H -I. -I../.. -I. -I.. -I../JudyCommon/    -DJUDYL   -DJUDYPREV -fPIC -DJU_64BIT -MT libprev_la-JudyLPrev.lo -MD -MP -MF .deps/libprev_la-JudyLPrev.Tpo -c -o libprev_la-JudyLPrev.lo `test -f 'JudyLPrev.c' || echo './'`JudyLPrev.c
  1117. libtool: compile:  gcc -DHAVE_CONFIG_H -I. -I../.. -I. -I.. -I../JudyCommon/ -DJUDYL -DJUDYNEXT -fPIC -DJU_64BIT -MT libnext_la-JudyLNext.lo -MD -MP -MF .deps/libnext_la-JudyLNext.Tpo -c JudyLNext.c  -fno-common -DPIC -o .libs/libnext_la-JudyLNext.o
  1118. libtool: compile:  gcc -DHAVE_CONFIG_H -I. -I../.. -I. -I.. -I../JudyCommon/ -DJUDYL -fPIC -DJU_64BIT -MT JudyLMemUsed.lo -MD -MP -MF .deps/JudyLMemUsed.Tpo -c JudyLMemUsed.c -o JudyLMemUsed.o >/dev/null 2>&1
  1119. libtool: compile:  gcc -DHAVE_CONFIG_H -I. -I../.. -I. -I.. -I../JudyCommon/ -DJUDYL -DJUDYNEXT -fPIC -DJU_64BIT -MT libnext_la-JudyLNextEmpty.lo -MD -MP -MF .deps/libnext_la-JudyLNextEmpty.Tpo -c JudyLNextEmpty.c  -fno-common -DPIC -o .libs/libnext_la-JudyLNextEmpty.o
  1120. mv -f .deps/JudyLMemUsed.Tpo .deps/JudyLMemUsed.Plo
  1121. /bin/sh ../../libtool  --tag=CC   --mode=compile gcc -DHAVE_CONFIG_H -I. -I../.. -I. -I.. -I../JudyCommon/    -DJUDYL   -DJUDYPREV -fPIC -DJU_64BIT -MT libprev_la-JudyLPrevEmpty.lo -MD -MP -MF .deps/libprev_la-JudyLPrevEmpty.Tpo -c -o libprev_la-JudyLPrevEmpty.lo `test -f 'JudyLPrevEmpty.c' || echo './'`JudyLPrevEmpty.c
  1122. libtool: compile:  gcc -DHAVE_CONFIG_H -I. -I../.. -I. -I.. -I../JudyCommon/ -DJUDYL -DJUDYPREV -fPIC -DJU_64BIT -MT libprev_la-JudyLPrev.lo -MD -MP -MF .deps/libprev_la-JudyLPrev.Tpo -c JudyLPrev.c  -fno-common -DPIC -o .libs/libprev_la-JudyLPrev.o
  1123. libtool: compile:  gcc -DHAVE_CONFIG_H -I. -I../.. -I. -I.. -I../JudyCommon/ -DJUDYL -DJUDYNEXT -fPIC -DJU_64BIT -MT libnext_la-JudyLNext.lo -MD -MP -MF .deps/libnext_la-JudyLNext.Tpo -c JudyLNext.c -o libnext_la-JudyLNext.o >/dev/null 2>&1
  1124. libtool: compile:  gcc -DHAVE_CONFIG_H -I. -I../.. -I. -I.. -I../JudyCommon/ -DJUDYL -DJUDYNEXT -fPIC -DJU_64BIT -MT libnext_la-JudyLNextEmpty.lo -MD -MP -MF .deps/libnext_la-JudyLNextEmpty.Tpo -c JudyLNextEmpty.c -o libnext_la-JudyLNextEmpty.o >/dev/null 2>&1
  1125. libtool: compile:  gcc -DHAVE_CONFIG_H -I. -I../.. -I. -I.. -I../JudyCommon/ -DJUDYL -DJUDYPREV -fPIC -DJU_64BIT -MT libprev_la-JudyLPrevEmpty.lo -MD -MP -MF .deps/libprev_la-JudyLPrevEmpty.Tpo -c JudyLPrevEmpty.c  -fno-common -DPIC -o .libs/libprev_la-JudyLPrevEmpty.o
  1126. libtool: compile:  gcc -DHAVE_CONFIG_H -I. -I../.. -I. -I.. -I../JudyCommon/ -DJUDYL -DJUDYPREV -fPIC -DJU_64BIT -MT libprev_la-JudyLPrev.lo -MD -MP -MF .deps/libprev_la-JudyLPrev.Tpo -c JudyLPrev.c -o libprev_la-JudyLPrev.o >/dev/null 2>&1
  1127. mv -f .deps/libnext_la-JudyLNextEmpty.Tpo .deps/libnext_la-JudyLNextEmpty.Plo
  1128. /bin/sh ../../libtool  --tag=CC   --mode=compile gcc -DHAVE_CONFIG_H -I. -I../.. -I. -I.. -I../JudyCommon/    -DJUDYL   -DNOSMARTJBB -DNOSMARTJBU -DNOSMARTJLB -fPIC -DJU_64BIT -MT libcount_la-JudyLByCount.lo -MD -MP -MF .deps/libcount_la-JudyLByCount.Tpo -c -o libcount_la-JudyLByCount.lo `test -f 'JudyLByCount.c' || echo './'`JudyLByCount.c
  1129. mv -f .deps/libnext_la-JudyLNext.Tpo .deps/libnext_la-JudyLNext.Plo
  1130. /bin/sh ../../libtool  --tag=CC   --mode=compile gcc -DHAVE_CONFIG_H -I. -I../.. -I. -I.. -I../JudyCommon/    -DJUDYL   -DJUDYGETINLINE -fPIC -DJU_64BIT -MT libinline_la-j__udyLGet.lo -MD -MP -MF .deps/libinline_la-j__udyLGet.Tpo -c -o libinline_la-j__udyLGet.lo `test -f 'j__udyLGet.c' || echo './'`j__udyLGet.c
  1131. libtool: compile:  gcc -DHAVE_CONFIG_H -I. -I../.. -I. -I.. -I../JudyCommon/ -DJUDYL -DJUDYPREV -fPIC -DJU_64BIT -MT libprev_la-JudyLPrevEmpty.lo -MD -MP -MF .deps/libprev_la-JudyLPrevEmpty.Tpo -c JudyLPrevEmpty.c -o libprev_la-JudyLPrevEmpty.o >/dev/null 2>&1
  1132. libtool: compile:  gcc -DHAVE_CONFIG_H -I. -I../.. -I. -I.. -I../JudyCommon/ -DJUDYL -DNOSMARTJBB -DNOSMARTJBU -DNOSMARTJLB -fPIC -DJU_64BIT -MT libcount_la-JudyLByCount.lo -MD -MP -MF .deps/libcount_la-JudyLByCount.Tpo -c JudyLByCount.c  -fno-common -DPIC -o .libs/libcount_la-JudyLByCount.o
  1133. mv -f .deps/libprev_la-JudyLPrev.Tpo .deps/libprev_la-JudyLPrev.Plo
  1134. /bin/sh ../../libtool  --tag=CC   --mode=compile gcc -DHAVE_CONFIG_H -I. -I../.. -I. -I.. -I../JudyCommon/    -DJUDYL   -fPIC -DJU_64BIT -MT JudyLTables.lo -MD -MP -MF .deps/JudyLTables.Tpo -c -o JudyLTables.lo JudyLTables.c
  1135. libtool: compile:  gcc -DHAVE_CONFIG_H -I. -I../.. -I. -I.. -I../JudyCommon/ -DJUDYL -DJUDYGETINLINE -fPIC -DJU_64BIT -MT libinline_la-j__udyLGet.lo -MD -MP -MF .deps/libinline_la-j__udyLGet.Tpo -c j__udyLGet.c  -fno-common -DPIC -o .libs/libinline_la-j__udyLGet.o
  1136. mv -f .deps/libprev_la-JudyLPrevEmpty.Tpo .deps/libprev_la-JudyLPrevEmpty.Plo
  1137. /bin/sh ../../libtool  --tag=CC   --mode=link gcc -DJUDYL   -DJUDYNEXT -fPIC -DJU_64BIT   -o libnext.la  libnext_la-JudyLNext.lo libnext_la-JudyLNextEmpty.lo  
  1138. libtool: compile:  gcc -DHAVE_CONFIG_H -I. -I../.. -I. -I.. -I../JudyCommon/ -DJUDYL -DNOSMARTJBB -DNOSMARTJBU -DNOSMARTJLB -fPIC -DJU_64BIT -MT libcount_la-JudyLByCount.lo -MD -MP -MF .deps/libcount_la-JudyLByCount.Tpo -c JudyLByCount.c -o libcount_la-JudyLByCount.o >/dev/null 2>&1
  1139. libtool: compile:  gcc -DHAVE_CONFIG_H -I. -I../.. -I. -I.. -I../JudyCommon/ -DJUDYL -DJUDYGETINLINE -fPIC -DJU_64BIT -MT libinline_la-j__udyLGet.lo -MD -MP -MF .deps/libinline_la-j__udyLGet.Tpo -c j__udyLGet.c -o libinline_la-j__udyLGet.o >/dev/null 2>&1
  1140. libtool: compile:  gcc -DHAVE_CONFIG_H -I. -I../.. -I. -I.. -I../JudyCommon/ -DJUDYL -fPIC -DJU_64BIT -MT JudyLTables.lo -MD -MP -MF .deps/JudyLTables.Tpo -c JudyLTables.c  -fno-common -DPIC -o .libs/JudyLTables.o
  1141. libtool: compile:  gcc -DHAVE_CONFIG_H -I. -I../.. -I. -I.. -I../JudyCommon/ -DJUDYL -fPIC -DJU_64BIT -MT JudyLTables.lo -MD -MP -MF .deps/JudyLTables.Tpo -c JudyLTables.c -o JudyLTables.o >/dev/null 2>&1
  1142. mv -f .deps/libcount_la-JudyLByCount.Tpo .deps/libcount_la-JudyLByCount.Plo
  1143. mv -f .deps/libinline_la-j__udyLGet.Tpo .deps/libinline_la-j__udyLGet.Plo
  1144. /bin/sh ../../libtool  --tag=CC   --mode=link gcc -DJUDYL   -DJUDYPREV -fPIC -DJU_64BIT   -o libprev.la  libprev_la-JudyLPrev.lo libprev_la-JudyLPrevEmpty.lo  
  1145. /bin/sh ../../libtool  --tag=CC   --mode=link gcc -DJUDYL   -DNOSMARTJBB -DNOSMARTJBU -DNOSMARTJLB -fPIC -DJU_64BIT   -o libcount.la  libcount_la-JudyLByCount.lo  
  1146. libtool: link: ar cru .libs/libnext.a .libs/libnext_la-JudyLNext.o .libs/libnext_la-JudyLNextEmpty.o
  1147. libtool: link: ranlib .libs/libnext.a
  1148. mv -f .deps/JudyLTables.Tpo .deps/JudyLTables.Plo
  1149. /bin/sh ../../libtool  --tag=CC   --mode=link gcc -DJUDYL   -DJUDYGETINLINE -fPIC -DJU_64BIT   -o libinline.la  libinline_la-j__udyLGet.lo  
  1150. libtool: link: ( cd ".libs" && rm -f "libnext.la" && ln -s "../libnext.la" "libnext.la" )
  1151. /bin/sh ../../libtool  --tag=CC   --mode=link gcc -DJUDYL   -fPIC -DJU_64BIT   -o libJudyL.la  JudyLCascade.lo JudyLTables.lo JudyLCount.lo JudyLCreateBranch.lo JudyLDecascade.lo JudyLDel.lo JudyLFirst.lo JudyLFreeArray.lo JudyLGet.lo JudyLInsArray.lo JudyLIns.lo JudyLInsertBranch.lo JudyLMallocIF.lo JudyLMemActive.lo JudyLMemUsed.lo  
  1152. libtool: link: ar cru .libs/libprev.a .libs/libprev_la-JudyLPrev.o .libs/libprev_la-JudyLPrevEmpty.o
  1153. libtool: link: ar cru .libs/libcount.a .libs/libcount_la-JudyLByCount.o
  1154. libtool: link: ranlib .libs/libprev.a
  1155. libtool: link: ranlib .libs/libcount.a
  1156. libtool: link: ar cru .libs/libinline.a .libs/libinline_la-j__udyLGet.o
  1157. libtool: link: ( cd ".libs" && rm -f "libcount.la" && ln -s "../libcount.la" "libcount.la" )
  1158. libtool: link: ( cd ".libs" && rm -f "libprev.la" && ln -s "../libprev.la" "libprev.la" )
  1159. libtool: link: ranlib .libs/libinline.a
  1160. libtool: link: ( cd ".libs" && rm -f "libinline.la" && ln -s "../libinline.la" "libinline.la" )
  1161. libtool: link: ar cru .libs/libJudyL.a .libs/JudyLCascade.o .libs/JudyLTables.o .libs/JudyLCount.o .libs/JudyLCreateBranch.o .libs/JudyLDecascade.o .libs/JudyLDel.o .libs/JudyLFirst.o .libs/JudyLFreeArray.o .libs/JudyLGet.o .libs/JudyLInsArray.o .libs/JudyLIns.o .libs/JudyLInsertBranch.o .libs/JudyLMallocIF.o .libs/JudyLMemActive.o .libs/JudyLMemUsed.o
  1162. libtool: link: ranlib .libs/libJudyL.a
  1163. libtool: link: ( cd ".libs" && rm -f "libJudyL.la" && ln -s "../libJudyL.la" "libJudyL.la" )
  1164. Making all in Judy1
  1165. cp -f ../JudyCommon/JudyGet.c               Judy1Test.c
  1166. cp -f ../JudyCommon/JudyTables.c            Judy1TablesGen.c
  1167. cp -f ../JudyCommon/JudyIns.c               Judy1Set.c
  1168. cp -f ../JudyCommon/JudyInsArray.c          Judy1SetArray.c
  1169. cp -f ../JudyCommon/JudyDel.c               Judy1Unset.c
  1170. cp -f ../JudyCommon/JudyCascade.c           Judy1Cascade.c
  1171. cp -f ../JudyCommon/JudyCount.c             Judy1Count.c
  1172. cp -f ../JudyCommon/JudyCreateBranch.c      Judy1CreateBranch.c
  1173. cp -f ../JudyCommon/JudyDecascade.c         Judy1Decascade.c
  1174. cp -f ../JudyCommon/JudyFirst.c             Judy1First.c
  1175. cp -f ../JudyCommon/JudyFreeArray.c         Judy1FreeArray.c
  1176. cp -f ../JudyCommon/JudyInsertBranch.c      Judy1InsertBranch.c
  1177. cp -f ../JudyCommon/JudyMallocIF.c          Judy1MallocIF.c
  1178. cp -f ../JudyCommon/JudyMemActive.c         Judy1MemActive.c
  1179. cp -f ../JudyCommon/JudyMemUsed.c           Judy1MemUsed.c
  1180. cp -f ../JudyCommon/JudyPrevNext.c          Judy1Next.c
  1181. cp -f ../JudyCommon/JudyPrevNextEmpty.c     Judy1NextEmpty.c
  1182. cp -f ../JudyCommon/JudyPrevNext.c          Judy1Prev.c
  1183. cp -f ../JudyCommon/JudyPrevNextEmpty.c     Judy1PrevEmpty.c
  1184. cp -f ../JudyCommon/JudyByCount.c           Judy1ByCount.c  
  1185. cp -f ../JudyCommon/JudyGet.c               j__udy1Test.c
  1186. /bin/sh ../../libtool  --tag=CC   --mode=compile gcc -DHAVE_CONFIG_H -I. -I../.. -I. -I.. -I../JudyCommon/    -DJUDY1   -fPIC -DJU_64BIT -MT Judy1Test.lo -MD -MP -MF .deps/Judy1Test.Tpo -c -o Judy1Test.lo Judy1Test.c
  1187. gcc -I. -I.. -I../JudyCommon/  -DJUDY1   -fPIC -DJU_64BIT -o Judy1TablesGen Judy1TablesGen.c; ./Judy1TablesGen
  1188. /bin/sh ../../libtool  --tag=CC   --mode=compile gcc -DHAVE_CONFIG_H -I. -I../.. -I. -I.. -I../JudyCommon/    -DJUDY1   -fPIC -DJU_64BIT -MT Judy1Set.lo -MD -MP -MF .deps/Judy1Set.Tpo -c -o Judy1Set.lo Judy1Set.c
  1189. /bin/sh ../../libtool  --tag=CC   --mode=compile gcc -DHAVE_CONFIG_H -I. -I../.. -I. -I.. -I../JudyCommon/    -DJUDY1   -fPIC -DJU_64BIT -MT Judy1SetArray.lo -MD -MP -MF .deps/Judy1SetArray.Tpo -c -o Judy1SetArray.lo Judy1SetArray.c
  1190. libtool: compile:  gcc -DHAVE_CONFIG_H -I. -I../.. -I. -I.. -I../JudyCommon/ -DJUDY1 -fPIC -DJU_64BIT -MT Judy1Test.lo -MD -MP -MF .deps/Judy1Test.Tpo -c Judy1Test.c  -fno-common -DPIC -o .libs/Judy1Test.o
  1191. libtool: compile:  gcc -DHAVE_CONFIG_H -I. -I../.. -I. -I.. -I../JudyCommon/ -DJUDY1 -fPIC -DJU_64BIT -MT Judy1Set.lo -MD -MP -MF .deps/Judy1Set.Tpo -c Judy1Set.c  -fno-common -DPIC -o .libs/Judy1Set.o
  1192. libtool: compile:  gcc -DHAVE_CONFIG_H -I. -I../.. -I. -I.. -I../JudyCommon/ -DJUDY1 -fPIC -DJU_64BIT -MT Judy1SetArray.lo -MD -MP -MF .deps/Judy1SetArray.Tpo -c Judy1SetArray.c  -fno-common -DPIC -o .libs/Judy1SetArray.o
  1193. libtool: compile:  gcc -DHAVE_CONFIG_H -I. -I../.. -I. -I.. -I../JudyCommon/ -DJUDY1 -fPIC -DJU_64BIT -MT Judy1Test.lo -MD -MP -MF .deps/Judy1Test.Tpo -c Judy1Test.c -o Judy1Test.o >/dev/null 2>&1
  1194. libtool: compile:  gcc -DHAVE_CONFIG_H -I. -I../.. -I. -I.. -I../JudyCommon/ -DJUDY1 -fPIC -DJU_64BIT -MT Judy1SetArray.lo -MD -MP -MF .deps/Judy1SetArray.Tpo -c Judy1SetArray.c -o Judy1SetArray.o >/dev/null 2>&1
  1195. /bin/sh ../../libtool  --tag=CC   --mode=compile gcc -DHAVE_CONFIG_H -I. -I../.. -I. -I.. -I../JudyCommon/    -DJUDY1   -fPIC -DJU_64BIT -MT Judy1Unset.lo -MD -MP -MF .deps/Judy1Unset.Tpo -c -o Judy1Unset.lo Judy1Unset.c
  1196. libtool: compile:  gcc -DHAVE_CONFIG_H -I. -I../.. -I. -I.. -I../JudyCommon/ -DJUDY1 -fPIC -DJU_64BIT -MT Judy1Set.lo -MD -MP -MF .deps/Judy1Set.Tpo -c Judy1Set.c -o Judy1Set.o >/dev/null 2>&1
  1197. mv -f .deps/Judy1Test.Tpo .deps/Judy1Test.Plo
  1198. /bin/sh ../../libtool  --tag=CC   --mode=compile gcc -DHAVE_CONFIG_H -I. -I../.. -I. -I.. -I../JudyCommon/    -DJUDY1   -fPIC -DJU_64BIT -MT Judy1Cascade.lo -MD -MP -MF .deps/Judy1Cascade.Tpo -c -o Judy1Cascade.lo Judy1Cascade.c
  1199. mv -f .deps/Judy1SetArray.Tpo .deps/Judy1SetArray.Plo
  1200. /bin/sh ../../libtool  --tag=CC   --mode=compile gcc -DHAVE_CONFIG_H -I. -I../.. -I. -I.. -I../JudyCommon/    -DJUDY1   -fPIC -DJU_64BIT -MT Judy1Count.lo -MD -MP -MF .deps/Judy1Count.Tpo -c -o Judy1Count.lo Judy1Count.c
  1201. libtool: compile:  gcc -DHAVE_CONFIG_H -I. -I../.. -I. -I.. -I../JudyCommon/ -DJUDY1 -fPIC -DJU_64BIT -MT Judy1Unset.lo -MD -MP -MF .deps/Judy1Unset.Tpo -c Judy1Unset.c  -fno-common -DPIC -o .libs/Judy1Unset.o
  1202. libtool: compile:  gcc -DHAVE_CONFIG_H -I. -I../.. -I. -I.. -I../JudyCommon/ -DJUDY1 -fPIC -DJU_64BIT -MT Judy1Cascade.lo -MD -MP -MF .deps/Judy1Cascade.Tpo -c Judy1Cascade.c  -fno-common -DPIC -o .libs/Judy1Cascade.o
  1203. libtool: compile:  gcc -DHAVE_CONFIG_H -I. -I../.. -I. -I.. -I../JudyCommon/ -DJUDY1 -fPIC -DJU_64BIT -MT Judy1Count.lo -MD -MP -MF .deps/Judy1Count.Tpo -c Judy1Count.c  -fno-common -DPIC -o .libs/Judy1Count.o
  1204. mv -f .deps/Judy1Set.Tpo .deps/Judy1Set.Plo
  1205. /bin/sh ../../libtool  --tag=CC   --mode=compile gcc -DHAVE_CONFIG_H -I. -I../.. -I. -I.. -I../JudyCommon/    -DJUDY1   -fPIC -DJU_64BIT -MT Judy1CreateBranch.lo -MD -MP -MF .deps/Judy1CreateBranch.Tpo -c -o Judy1CreateBranch.lo Judy1CreateBranch.c
  1206. libtool: compile:  gcc -DHAVE_CONFIG_H -I. -I../.. -I. -I.. -I../JudyCommon/ -DJUDY1 -fPIC -DJU_64BIT -MT Judy1Count.lo -MD -MP -MF .deps/Judy1Count.Tpo -c Judy1Count.c -o Judy1Count.o >/dev/null 2>&1
  1207. libtool: compile:  gcc -DHAVE_CONFIG_H -I. -I../.. -I. -I.. -I../JudyCommon/ -DJUDY1 -fPIC -DJU_64BIT -MT Judy1CreateBranch.lo -MD -MP -MF .deps/Judy1CreateBranch.Tpo -c Judy1CreateBranch.c  -fno-common -DPIC -o .libs/Judy1CreateBranch.o
  1208. libtool: compile:  gcc -DHAVE_CONFIG_H -I. -I../.. -I. -I.. -I../JudyCommon/ -DJUDY1 -fPIC -DJU_64BIT -MT Judy1Cascade.lo -MD -MP -MF .deps/Judy1Cascade.Tpo -c Judy1Cascade.c -o Judy1Cascade.o >/dev/null 2>&1
  1209. libtool: compile:  gcc -DHAVE_CONFIG_H -I. -I../.. -I. -I.. -I../JudyCommon/ -DJUDY1 -fPIC -DJU_64BIT -MT Judy1Unset.lo -MD -MP -MF .deps/Judy1Unset.Tpo -c Judy1Unset.c -o Judy1Unset.o >/dev/null 2>&1
  1210. libtool: compile:  gcc -DHAVE_CONFIG_H -I. -I../.. -I. -I.. -I../JudyCommon/ -DJUDY1 -fPIC -DJU_64BIT -MT Judy1CreateBranch.lo -MD -MP -MF .deps/Judy1CreateBranch.Tpo -c Judy1CreateBranch.c -o Judy1CreateBranch.o >/dev/null 2>&1
  1211. mv -f .deps/Judy1Count.Tpo .deps/Judy1Count.Plo
  1212. /bin/sh ../../libtool  --tag=CC   --mode=compile gcc -DHAVE_CONFIG_H -I. -I../.. -I. -I.. -I../JudyCommon/    -DJUDY1   -fPIC -DJU_64BIT -MT Judy1Decascade.lo -MD -MP -MF .deps/Judy1Decascade.Tpo -c -o Judy1Decascade.lo Judy1Decascade.c
  1213. mv -f .deps/Judy1Cascade.Tpo .deps/Judy1Cascade.Plo
  1214. /bin/sh ../../libtool  --tag=CC   --mode=compile gcc -DHAVE_CONFIG_H -I. -I../.. -I. -I.. -I../JudyCommon/    -DJUDY1   -fPIC -DJU_64BIT -MT Judy1First.lo -MD -MP -MF .deps/Judy1First.Tpo -c -o Judy1First.lo Judy1First.c
  1215. mv -f .deps/Judy1CreateBranch.Tpo .deps/Judy1CreateBranch.Plo
  1216. /bin/sh ../../libtool  --tag=CC   --mode=compile gcc -DHAVE_CONFIG_H -I. -I../.. -I. -I.. -I../JudyCommon/    -DJUDY1   -fPIC -DJU_64BIT -MT Judy1FreeArray.lo -MD -MP -MF .deps/Judy1FreeArray.Tpo -c -o Judy1FreeArray.lo Judy1FreeArray.c
  1217. mv -f .deps/Judy1Unset.Tpo .deps/Judy1Unset.Plo
  1218. /bin/sh ../../libtool  --tag=CC   --mode=compile gcc -DHAVE_CONFIG_H -I. -I../.. -I. -I.. -I../JudyCommon/    -DJUDY1   -fPIC -DJU_64BIT -MT Judy1InsertBranch.lo -MD -MP -MF .deps/Judy1InsertBranch.Tpo -c -o Judy1InsertBranch.lo Judy1InsertBranch.c
  1219. libtool: compile:  gcc -DHAVE_CONFIG_H -I. -I../.. -I. -I.. -I../JudyCommon/ -DJUDY1 -fPIC -DJU_64BIT -MT Judy1Decascade.lo -MD -MP -MF .deps/Judy1Decascade.Tpo -c Judy1Decascade.c  -fno-common -DPIC -o .libs/Judy1Decascade.o
  1220. libtool: compile:  gcc -DHAVE_CONFIG_H -I. -I../.. -I. -I.. -I../JudyCommon/ -DJUDY1 -fPIC -DJU_64BIT -MT Judy1First.lo -MD -MP -MF .deps/Judy1First.Tpo -c Judy1First.c  -fno-common -DPIC -o .libs/Judy1First.o
  1221. libtool: compile:  gcc -DHAVE_CONFIG_H -I. -I../.. -I. -I.. -I../JudyCommon/ -DJUDY1 -fPIC -DJU_64BIT -MT Judy1FreeArray.lo -MD -MP -MF .deps/Judy1FreeArray.Tpo -c Judy1FreeArray.c  -fno-common -DPIC -o .libs/Judy1FreeArray.o
  1222. libtool: compile:  gcc -DHAVE_CONFIG_H -I. -I../.. -I. -I.. -I../JudyCommon/ -DJUDY1 -fPIC -DJU_64BIT -MT Judy1InsertBranch.lo -MD -MP -MF .deps/Judy1InsertBranch.Tpo -c Judy1InsertBranch.c  -fno-common -DPIC -o .libs/Judy1InsertBranch.o
  1223. libtool: compile:  gcc -DHAVE_CONFIG_H -I. -I../.. -I. -I.. -I../JudyCommon/ -DJUDY1 -fPIC -DJU_64BIT -MT Judy1Decascade.lo -MD -MP -MF .deps/Judy1Decascade.Tpo -c Judy1Decascade.c -o Judy1Decascade.o >/dev/null 2>&1
  1224. libtool: compile:  gcc -DHAVE_CONFIG_H -I. -I../.. -I. -I.. -I../JudyCommon/ -DJUDY1 -fPIC -DJU_64BIT -MT Judy1First.lo -MD -MP -MF .deps/Judy1First.Tpo -c Judy1First.c -o Judy1First.o >/dev/null 2>&1
  1225. libtool: compile:  gcc -DHAVE_CONFIG_H -I. -I../.. -I. -I.. -I../JudyCommon/ -DJUDY1 -fPIC -DJU_64BIT -MT Judy1FreeArray.lo -MD -MP -MF .deps/Judy1FreeArray.Tpo -c Judy1FreeArray.c -o Judy1FreeArray.o >/dev/null 2>&1
  1226. libtool: compile:  gcc -DHAVE_CONFIG_H -I. -I../.. -I. -I.. -I../JudyCommon/ -DJUDY1 -fPIC -DJU_64BIT -MT Judy1InsertBranch.lo -MD -MP -MF .deps/Judy1InsertBranch.Tpo -c Judy1InsertBranch.c -o Judy1InsertBranch.o >/dev/null 2>&1
  1227. mv -f .deps/Judy1First.Tpo .deps/Judy1First.Plo
  1228. /bin/sh ../../libtool  --tag=CC   --mode=compile gcc -DHAVE_CONFIG_H -I. -I../.. -I. -I.. -I../JudyCommon/    -DJUDY1   -fPIC -DJU_64BIT -MT Judy1MallocIF.lo -MD -MP -MF .deps/Judy1MallocIF.Tpo -c -o Judy1MallocIF.lo Judy1MallocIF.c
  1229. mv -f .deps/Judy1Decascade.Tpo .deps/Judy1Decascade.Plo
  1230. /bin/sh ../../libtool  --tag=CC   --mode=compile gcc -DHAVE_CONFIG_H -I. -I../.. -I. -I.. -I../JudyCommon/    -DJUDY1   -fPIC -DJU_64BIT -MT Judy1MemActive.lo -MD -MP -MF .deps/Judy1MemActive.Tpo -c -o Judy1MemActive.lo Judy1MemActive.c
  1231. mv -f .deps/Judy1FreeArray.Tpo .deps/Judy1FreeArray.Plo
  1232. /bin/sh ../../libtool  --tag=CC   --mode=compile gcc -DHAVE_CONFIG_H -I. -I../.. -I. -I.. -I../JudyCommon/    -DJUDY1   -fPIC -DJU_64BIT -MT Judy1MemUsed.lo -MD -MP -MF .deps/Judy1MemUsed.Tpo -c -o Judy1MemUsed.lo Judy1MemUsed.c
  1233. mv -f .deps/Judy1InsertBranch.Tpo .deps/Judy1InsertBranch.Plo
  1234. /bin/sh ../../libtool  --tag=CC   --mode=compile gcc -DHAVE_CONFIG_H -I. -I../.. -I. -I.. -I../JudyCommon/    -DJUDY1   -DJUDYNEXT -fPIC -DJU_64BIT -MT libnext_la-Judy1Next.lo -MD -MP -MF .deps/libnext_la-Judy1Next.Tpo -c -o libnext_la-Judy1Next.lo `test -f 'Judy1Next.c' || echo './'`Judy1Next.c
  1235. libtool: compile:  gcc -DHAVE_CONFIG_H -I. -I../.. -I. -I.. -I../JudyCommon/ -DJUDY1 -fPIC -DJU_64BIT -MT Judy1MallocIF.lo -MD -MP -MF .deps/Judy1MallocIF.Tpo -c Judy1MallocIF.c  -fno-common -DPIC -o .libs/Judy1MallocIF.o
  1236. libtool: compile:  gcc -DHAVE_CONFIG_H -I. -I../.. -I. -I.. -I../JudyCommon/ -DJUDY1 -fPIC -DJU_64BIT -MT Judy1MemActive.lo -MD -MP -MF .deps/Judy1MemActive.Tpo -c Judy1MemActive.c  -fno-common -DPIC -o .libs/Judy1MemActive.o
  1237. libtool: compile:  gcc -DHAVE_CONFIG_H -I. -I../.. -I. -I.. -I../JudyCommon/ -DJUDY1 -fPIC -DJU_64BIT -MT Judy1MemUsed.lo -MD -MP -MF .deps/Judy1MemUsed.Tpo -c Judy1MemUsed.c  -fno-common -DPIC -o .libs/Judy1MemUsed.o
  1238. libtool: compile:  gcc -DHAVE_CONFIG_H -I. -I../.. -I. -I.. -I../JudyCommon/ -DJUDY1 -fPIC -DJU_64BIT -MT Judy1MallocIF.lo -MD -MP -MF .deps/Judy1MallocIF.Tpo -c Judy1MallocIF.c -o Judy1MallocIF.o >/dev/null 2>&1
  1239. libtool: compile:  gcc -DHAVE_CONFIG_H -I. -I../.. -I. -I.. -I../JudyCommon/ -DJUDY1 -fPIC -DJU_64BIT -MT Judy1MemActive.lo -MD -MP -MF .deps/Judy1MemActive.Tpo -c Judy1MemActive.c -o Judy1MemActive.o >/dev/null 2>&1
  1240. libtool: compile:  gcc -DHAVE_CONFIG_H -I. -I../.. -I. -I.. -I../JudyCommon/ -DJUDY1 -fPIC -DJU_64BIT -MT Judy1MemUsed.lo -MD -MP -MF .deps/Judy1MemUsed.Tpo -c Judy1MemUsed.c -o Judy1MemUsed.o >/dev/null 2>&1
  1241. libtool: compile:  gcc -DHAVE_CONFIG_H -I. -I../.. -I. -I.. -I../JudyCommon/ -DJUDY1 -DJUDYNEXT -fPIC -DJU_64BIT -MT libnext_la-Judy1Next.lo -MD -MP -MF .deps/libnext_la-Judy1Next.Tpo -c Judy1Next.c  -fno-common -DPIC -o .libs/libnext_la-Judy1Next.o
  1242. mv -f .deps/Judy1MemUsed.Tpo .deps/Judy1MemUsed.Plo
  1243. /bin/sh ../../libtool  --tag=CC   --mode=compile gcc -DHAVE_CONFIG_H -I. -I../.. -I. -I.. -I../JudyCommon/    -DJUDY1   -DJUDYNEXT -fPIC -DJU_64BIT -MT libnext_la-Judy1NextEmpty.lo -MD -MP -MF .deps/libnext_la-Judy1NextEmpty.Tpo -c -o libnext_la-Judy1NextEmpty.lo `test -f 'Judy1NextEmpty.c' || echo './'`Judy1NextEmpty.c
  1244. mv -f .deps/Judy1MemActive.Tpo .deps/Judy1MemActive.Plo
  1245. /bin/sh ../../libtool  --tag=CC   --mode=compile gcc -DHAVE_CONFIG_H -I. -I../.. -I. -I.. -I../JudyCommon/    -DJUDY1   -DJUDYPREV -fPIC -DJU_64BIT -MT libprev_la-Judy1Prev.lo -MD -MP -MF .deps/libprev_la-Judy1Prev.Tpo -c -o libprev_la-Judy1Prev.lo `test -f 'Judy1Prev.c' || echo './'`Judy1Prev.c
  1246. mv -f .deps/Judy1MallocIF.Tpo .deps/Judy1MallocIF.Plo
  1247. /bin/sh ../../libtool  --tag=CC   --mode=compile gcc -DHAVE_CONFIG_H -I. -I../.. -I. -I.. -I../JudyCommon/    -DJUDY1   -DJUDYPREV -fPIC -DJU_64BIT -MT libprev_la-Judy1PrevEmpty.lo -MD -MP -MF .deps/libprev_la-Judy1PrevEmpty.Tpo -c -o libprev_la-Judy1PrevEmpty.lo `test -f 'Judy1PrevEmpty.c' || echo './'`Judy1PrevEmpty.c
  1248. libtool: compile:  gcc -DHAVE_CONFIG_H -I. -I../.. -I. -I.. -I../JudyCommon/ -DJUDY1 -DJUDYNEXT -fPIC -DJU_64BIT -MT libnext_la-Judy1Next.lo -MD -MP -MF .deps/libnext_la-Judy1Next.Tpo -c Judy1Next.c -o libnext_la-Judy1Next.o >/dev/null 2>&1
  1249. libtool: compile:  gcc -DHAVE_CONFIG_H -I. -I../.. -I. -I.. -I../JudyCommon/ -DJUDY1 -DJUDYNEXT -fPIC -DJU_64BIT -MT libnext_la-Judy1NextEmpty.lo -MD -MP -MF .deps/libnext_la-Judy1NextEmpty.Tpo -c Judy1NextEmpty.c  -fno-common -DPIC -o .libs/libnext_la-Judy1NextEmpty.o
  1250. libtool: compile:  gcc -DHAVE_CONFIG_H -I. -I../.. -I. -I.. -I../JudyCommon/ -DJUDY1 -DJUDYPREV -fPIC -DJU_64BIT -MT libprev_la-Judy1Prev.lo -MD -MP -MF .deps/libprev_la-Judy1Prev.Tpo -c Judy1Prev.c  -fno-common -DPIC -o .libs/libprev_la-Judy1Prev.o
  1251. libtool: compile:  gcc -DHAVE_CONFIG_H -I. -I../.. -I. -I.. -I../JudyCommon/ -DJUDY1 -DJUDYPREV -fPIC -DJU_64BIT -MT libprev_la-Judy1PrevEmpty.lo -MD -MP -MF .deps/libprev_la-Judy1PrevEmpty.Tpo -c Judy1PrevEmpty.c  -fno-common -DPIC -o .libs/libprev_la-Judy1PrevEmpty.o
  1252. mv -f .deps/libnext_la-Judy1Next.Tpo .deps/libnext_la-Judy1Next.Plo
  1253. /bin/sh ../../libtool  --tag=CC   --mode=compile gcc -DHAVE_CONFIG_H -I. -I../.. -I. -I.. -I../JudyCommon/    -DJUDY1   -DNOSMARTJBB -DNOSMARTJBU -DNOSMARTJLB -fPIC -DJU_64BIT -MT libcount_la-Judy1ByCount.lo -MD -MP -MF .deps/libcount_la-Judy1ByCount.Tpo -c -o libcount_la-Judy1ByCount.lo `test -f 'Judy1ByCount.c' || echo './'`Judy1ByCount.c
  1254. libtool: compile:  gcc -DHAVE_CONFIG_H -I. -I../.. -I. -I.. -I../JudyCommon/ -DJUDY1 -DJUDYNEXT -fPIC -DJU_64BIT -MT libnext_la-Judy1NextEmpty.lo -MD -MP -MF .deps/libnext_la-Judy1NextEmpty.Tpo -c Judy1NextEmpty.c -o libnext_la-Judy1NextEmpty.o >/dev/null 2>&1
  1255. libtool: compile:  gcc -DHAVE_CONFIG_H -I. -I../.. -I. -I.. -I../JudyCommon/ -DJUDY1 -DJUDYPREV -fPIC -DJU_64BIT -MT libprev_la-Judy1PrevEmpty.lo -MD -MP -MF .deps/libprev_la-Judy1PrevEmpty.Tpo -c Judy1PrevEmpty.c -o libprev_la-Judy1PrevEmpty.o >/dev/null 2>&1
  1256. libtool: compile:  gcc -DHAVE_CONFIG_H -I. -I../.. -I. -I.. -I../JudyCommon/ -DJUDY1 -DJUDYPREV -fPIC -DJU_64BIT -MT libprev_la-Judy1Prev.lo -MD -MP -MF .deps/libprev_la-Judy1Prev.Tpo -c Judy1Prev.c -o libprev_la-Judy1Prev.o >/dev/null 2>&1
  1257. libtool: compile:  gcc -DHAVE_CONFIG_H -I. -I../.. -I. -I.. -I../JudyCommon/ -DJUDY1 -DNOSMARTJBB -DNOSMARTJBU -DNOSMARTJLB -fPIC -DJU_64BIT -MT libcount_la-Judy1ByCount.lo -MD -MP -MF .deps/libcount_la-Judy1ByCount.Tpo -c Judy1ByCount.c  -fno-common -DPIC -o .libs/libcount_la-Judy1ByCount.o
  1258. mv -f .deps/libnext_la-Judy1NextEmpty.Tpo .deps/libnext_la-Judy1NextEmpty.Plo
  1259. /bin/sh ../../libtool  --tag=CC   --mode=compile gcc -DHAVE_CONFIG_H -I. -I../.. -I. -I.. -I../JudyCommon/    -DJUDY1   -DJUDYGETINLINE -fPIC -DJU_64BIT -MT libinline_la-j__udy1Test.lo -MD -MP -MF .deps/libinline_la-j__udy1Test.Tpo -c -o libinline_la-j__udy1Test.lo `test -f 'j__udy1Test.c' || echo './'`j__udy1Test.c
  1260. mv -f .deps/libprev_la-Judy1PrevEmpty.Tpo .deps/libprev_la-Judy1PrevEmpty.Plo
  1261. /bin/sh ../../libtool  --tag=CC   --mode=compile gcc -DHAVE_CONFIG_H -I. -I../.. -I. -I.. -I../JudyCommon/    -DJUDY1   -fPIC -DJU_64BIT -MT Judy1Tables.lo -MD -MP -MF .deps/Judy1Tables.Tpo -c -o Judy1Tables.lo Judy1Tables.c
  1262. mv -f .deps/libprev_la-Judy1Prev.Tpo .deps/libprev_la-Judy1Prev.Plo
  1263. /bin/sh ../../libtool  --tag=CC   --mode=link gcc -DJUDY1   -DJUDYNEXT -fPIC -DJU_64BIT   -o libnext.la  libnext_la-Judy1Next.lo libnext_la-Judy1NextEmpty.lo  
  1264. libtool: compile:  gcc -DHAVE_CONFIG_H -I. -I../.. -I. -I.. -I../JudyCommon/ -DJUDY1 -DNOSMARTJBB -DNOSMARTJBU -DNOSMARTJLB -fPIC -DJU_64BIT -MT libcount_la-Judy1ByCount.lo -MD -MP -MF .deps/libcount_la-Judy1ByCount.Tpo -c Judy1ByCount.c -o libcount_la-Judy1ByCount.o >/dev/null 2>&1
  1265. libtool: compile:  gcc -DHAVE_CONFIG_H -I. -I../.. -I. -I.. -I../JudyCommon/ -DJUDY1 -fPIC -DJU_64BIT -MT Judy1Tables.lo -MD -MP -MF .deps/Judy1Tables.Tpo -c Judy1Tables.c  -fno-common -DPIC -o .libs/Judy1Tables.o
  1266. libtool: compile:  gcc -DHAVE_CONFIG_H -I. -I../.. -I. -I.. -I../JudyCommon/ -DJUDY1 -DJUDYGETINLINE -fPIC -DJU_64BIT -MT libinline_la-j__udy1Test.lo -MD -MP -MF .deps/libinline_la-j__udy1Test.Tpo -c j__udy1Test.c  -fno-common -DPIC -o .libs/libinline_la-j__udy1Test.o
  1267. libtool: compile:  gcc -DHAVE_CONFIG_H -I. -I../.. -I. -I.. -I../JudyCommon/ -DJUDY1 -fPIC -DJU_64BIT -MT Judy1Tables.lo -MD -MP -MF .deps/Judy1Tables.Tpo -c Judy1Tables.c -o Judy1Tables.o >/dev/null 2>&1
  1268. mv -f .deps/libcount_la-Judy1ByCount.Tpo .deps/libcount_la-Judy1ByCount.Plo
  1269. /bin/sh ../../libtool  --tag=CC   --mode=link gcc -DJUDY1   -DJUDYPREV -fPIC -DJU_64BIT   -o libprev.la  libprev_la-Judy1Prev.lo libprev_la-Judy1PrevEmpty.lo  
  1270. libtool: compile:  gcc -DHAVE_CONFIG_H -I. -I../.. -I. -I.. -I../JudyCommon/ -DJUDY1 -DJUDYGETINLINE -fPIC -DJU_64BIT -MT libinline_la-j__udy1Test.lo -MD -MP -MF .deps/libinline_la-j__udy1Test.Tpo -c j__udy1Test.c -o libinline_la-j__udy1Test.o >/dev/null 2>&1
  1271. libtool: link: ar cru .libs/libnext.a .libs/libnext_la-Judy1Next.o .libs/libnext_la-Judy1NextEmpty.o
  1272. libtool: link: ranlib .libs/libnext.a
  1273. mv -f .deps/Judy1Tables.Tpo .deps/Judy1Tables.Plo
  1274. /bin/sh ../../libtool  --tag=CC   --mode=link gcc -DJUDY1   -DNOSMARTJBB -DNOSMARTJBU -DNOSMARTJLB -fPIC -DJU_64BIT   -o libcount.la  libcount_la-Judy1ByCount.lo  
  1275. libtool: link: ( cd ".libs" && rm -f "libnext.la" && ln -s "../libnext.la" "libnext.la" )
  1276. /bin/sh ../../libtool  --tag=CC   --mode=link gcc -DJUDY1   -fPIC -DJU_64BIT   -o libJudy1.la  Judy1Test.lo Judy1Tables.lo Judy1Set.lo Judy1SetArray.lo Judy1Unset.lo Judy1Cascade.lo Judy1Count.lo Judy1CreateBranch.lo Judy1Decascade.lo Judy1First.lo Judy1FreeArray.lo Judy1InsertBranch.lo Judy1MallocIF.lo Judy1MemActive.lo Judy1MemUsed.lo  
  1277. mv -f .deps/libinline_la-j__udy1Test.Tpo .deps/libinline_la-j__udy1Test.Plo
  1278. /bin/sh ../../libtool  --tag=CC   --mode=link gcc -DJUDY1   -DJUDYGETINLINE -fPIC -DJU_64BIT   -o libinline.la  libinline_la-j__udy1Test.lo  
  1279. libtool: link: ar cru .libs/libprev.a .libs/libprev_la-Judy1Prev.o .libs/libprev_la-Judy1PrevEmpty.o
  1280. libtool: link: ranlib .libs/libprev.a
  1281. libtool: link: ( cd ".libs" && rm -f "libprev.la" && ln -s "../libprev.la" "libprev.la" )
  1282. libtool: link: ar cru .libs/libcount.a .libs/libcount_la-Judy1ByCount.o
  1283. libtool: link: ranlib .libs/libcount.a
  1284. libtool: link: ar cru .libs/libinline.a .libs/libinline_la-j__udy1Test.o
  1285. libtool: link: ( cd ".libs" && rm -f "libcount.la" && ln -s "../libcount.la" "libcount.la" )
  1286. libtool: link: ranlib .libs/libinline.a
  1287. libtool: link: ar cru .libs/libJudy1.a .libs/Judy1Test.o .libs/Judy1Tables.o .libs/Judy1Set.o .libs/Judy1SetArray.o .libs/Judy1Unset.o .libs/Judy1Cascade.o .libs/Judy1Count.o .libs/Judy1CreateBranch.o .libs/Judy1Decascade.o .libs/Judy1First.o .libs/Judy1FreeArray.o .libs/Judy1InsertBranch.o .libs/Judy1MallocIF.o .libs/Judy1MemActive.o .libs/Judy1MemUsed.o
  1288. libtool: link: ( cd ".libs" && rm -f "libinline.la" && ln -s "../libinline.la" "libinline.la" )
  1289. libtool: link: ranlib .libs/libJudy1.a
  1290. libtool: link: ( cd ".libs" && rm -f "libJudy1.la" && ln -s "../libJudy1.la" "libJudy1.la" )
  1291. Making all in JudySL
  1292. /bin/sh ../../libtool  --tag=CC   --mode=compile gcc -DHAVE_CONFIG_H -I. -I../.. -I. -I.. -I../JudyCommon/    -fPIC -DJU_64BIT   -fPIC -DJU_64BIT -MT JudySL.lo -MD -MP -MF .deps/JudySL.Tpo -c -o JudySL.lo JudySL.c
  1293. libtool: compile:  gcc -DHAVE_CONFIG_H -I. -I../.. -I. -I.. -I../JudyCommon/ -fPIC -DJU_64BIT -fPIC -DJU_64BIT -MT JudySL.lo -MD -MP -MF .deps/JudySL.Tpo -c JudySL.c  -fno-common -DPIC -o .libs/JudySL.o
  1294. libtool: compile:  gcc -DHAVE_CONFIG_H -I. -I../.. -I. -I.. -I../JudyCommon/ -fPIC -DJU_64BIT -fPIC -DJU_64BIT -MT JudySL.lo -MD -MP -MF .deps/JudySL.Tpo -c JudySL.c -o JudySL.o >/dev/null 2>&1
  1295. mv -f .deps/JudySL.Tpo .deps/JudySL.Plo
  1296. /bin/sh ../../libtool  --tag=CC   --mode=link gcc -fPIC -DJU_64BIT   -fPIC -DJU_64BIT   -o libJudySL.la  JudySL.lo  
  1297. libtool: link: ar cru .libs/libJudySL.a .libs/JudySL.o
  1298. libtool: link: ranlib .libs/libJudySL.a
  1299. libtool: link: ( cd ".libs" && rm -f "libJudySL.la" && ln -s "../libJudySL.la" "libJudySL.la" )
  1300. Making all in JudyHS
  1301. /bin/sh ../../libtool  --tag=CC   --mode=compile gcc -DHAVE_CONFIG_H -I. -I../.. -I. -I.. -I../JudyCommon/    -fPIC -DJU_64BIT   -fPIC -DJU_64BIT -MT JudyHS.lo -MD -MP -MF .deps/JudyHS.Tpo -c -o JudyHS.lo JudyHS.c
  1302. libtool: compile:  gcc -DHAVE_CONFIG_H -I. -I../.. -I. -I.. -I../JudyCommon/ -fPIC -DJU_64BIT -fPIC -DJU_64BIT -MT JudyHS.lo -MD -MP -MF .deps/JudyHS.Tpo -c JudyHS.c  -fno-common -DPIC -o .libs/JudyHS.o
  1303. libtool: compile:  gcc -DHAVE_CONFIG_H -I. -I../.. -I. -I.. -I../JudyCommon/ -fPIC -DJU_64BIT -fPIC -DJU_64BIT -MT JudyHS.lo -MD -MP -MF .deps/JudyHS.Tpo -c JudyHS.c -o JudyHS.o >/dev/null 2>&1
  1304. mv -f .deps/JudyHS.Tpo .deps/JudyHS.Plo
  1305. /bin/sh ../../libtool  --tag=CC   --mode=link gcc -fPIC -DJU_64BIT   -fPIC -DJU_64BIT   -o libJudyHS.la  JudyHS.lo  
  1306. libtool: link: ar cru .libs/libJudyHS.a .libs/JudyHS.o
  1307. libtool: link: ranlib .libs/libJudyHS.a
  1308. libtool: link: ( cd ".libs" && rm -f "libJudyHS.la" && ln -s "../libJudyHS.la" "libJudyHS.la" )
  1309. Making all in obj
  1310. /bin/sh ../../libtool  --tag=CC   --mode=link gcc  -fPIC -DJU_64BIT -version-info 1:3:0  -o libJudy.la -rpath /usr/local/lib  ../JudyCommon/*.lo ../JudyL/*.lo ../Judy1/*.lo ../JudyHS/*.lo ../JudySL/*.lo  
  1311. libtool: link: gcc -dynamiclib -Wl,-undefined -Wl,dynamic_lookup -o .libs/libJudy.1.dylib  ../JudyCommon/.libs/JudyMalloc.o ../JudyL/.libs/JudyLCascade.o ../JudyL/.libs/JudyLCount.o ../JudyL/.libs/JudyLCreateBranch.o ../JudyL/.libs/JudyLDecascade.o ../JudyL/.libs/JudyLDel.o ../JudyL/.libs/JudyLFirst.o ../JudyL/.libs/JudyLFreeArray.o ../JudyL/.libs/JudyLGet.o ../JudyL/.libs/JudyLIns.o ../JudyL/.libs/JudyLInsArray.o ../JudyL/.libs/JudyLInsertBranch.o ../JudyL/.libs/JudyLMallocIF.o ../JudyL/.libs/JudyLMemActive.o ../JudyL/.libs/JudyLMemUsed.o ../JudyL/.libs/JudyLTables.o ../JudyL/.libs/libcount_la-JudyLByCount.o ../JudyL/.libs/libinline_la-j__udyLGet.o ../JudyL/.libs/libnext_la-JudyLNext.o ../JudyL/.libs/libnext_la-JudyLNextEmpty.o ../JudyL/.libs/libprev_la-JudyLPrev.o ../JudyL/.libs/libprev_la-JudyLPrevEmpty.o ../Judy1/.libs/Judy1Cascade.o ../Judy1/.libs/Judy1Count.o ../Judy1/.libs/Judy1CreateBranch.o ../Judy1/.libs/Judy1Decascade.o ../Judy1/.libs/Judy1First.o ../Judy1/.libs/Judy1FreeArray.o ../Judy1/.libs/Judy1InsertBranch.o ../Judy1/.libs/Judy1MallocIF.o ../Judy1/.libs/Judy1MemActive.o ../Judy1/.libs/Judy1MemUsed.o ../Judy1/.libs/Judy1Set.o ../Judy1/.libs/Judy1SetArray.o ../Judy1/.libs/Judy1Tables.o ../Judy1/.libs/Judy1Test.o ../Judy1/.libs/Judy1Unset.o ../Judy1/.libs/libcount_la-Judy1ByCount.o ../Judy1/.libs/libinline_la-j__udy1Test.o ../Judy1/.libs/libnext_la-Judy1Next.o ../Judy1/.libs/libnext_la-Judy1NextEmpty.o ../Judy1/.libs/libprev_la-Judy1Prev.o ../Judy1/.libs/libprev_la-Judy1PrevEmpty.o ../JudyHS/.libs/JudyHS.o ../JudySL/.libs/JudySL.o      -install_name  /usr/local/lib/libJudy.1.dylib -compatibility_version 2 -current_version 2.3 -Wl,-single_module
  1312. libtool: link: (cd ".libs" && rm -f "libJudy.dylib" && ln -s "libJudy.1.dylib" "libJudy.dylib")
  1313. libtool: link: ar cru .libs/libJudy.a  ../JudyCommon/JudyMalloc.o ../JudyL/JudyLCascade.o ../JudyL/JudyLCount.o ../JudyL/JudyLCreateBranch.o ../JudyL/JudyLDecascade.o ../JudyL/JudyLDel.o ../JudyL/JudyLFirst.o ../JudyL/JudyLFreeArray.o ../JudyL/JudyLGet.o ../JudyL/JudyLIns.o ../JudyL/JudyLInsArray.o ../JudyL/JudyLInsertBranch.o ../JudyL/JudyLMallocIF.o ../JudyL/JudyLMemActive.o ../JudyL/JudyLMemUsed.o ../JudyL/JudyLTables.o ../JudyL/libcount_la-JudyLByCount.o ../JudyL/libinline_la-j__udyLGet.o ../JudyL/libnext_la-JudyLNext.o ../JudyL/libnext_la-JudyLNextEmpty.o ../JudyL/libprev_la-JudyLPrev.o ../JudyL/libprev_la-JudyLPrevEmpty.o ../Judy1/Judy1Cascade.o ../Judy1/Judy1Count.o ../Judy1/Judy1CreateBranch.o ../Judy1/Judy1Decascade.o ../Judy1/Judy1First.o ../Judy1/Judy1FreeArray.o ../Judy1/Judy1InsertBranch.o ../Judy1/Judy1MallocIF.o ../Judy1/Judy1MemActive.o ../Judy1/Judy1MemUsed.o ../Judy1/Judy1Set.o ../Judy1/Judy1SetArray.o ../Judy1/Judy1Tables.o ../Judy1/Judy1Test.o ../Judy1/Judy1Unset.o ../Judy1/libcount_la-Judy1ByCount.o ../Judy1/libinline_la-j__udy1Test.o ../Judy1/libnext_la-Judy1Next.o ../Judy1/libnext_la-Judy1NextEmpty.o ../Judy1/libprev_la-Judy1Prev.o ../Judy1/libprev_la-Judy1PrevEmpty.o ../JudyHS/JudyHS.o ../JudySL/JudySL.o
  1314. libtool: link: ranlib .libs/libJudy.a
  1315. libtool: link: ( cd ".libs" && rm -f "libJudy.la" && ln -s "../libJudy.la" "libJudy.la" )
  1316. OK  
  1317.  
  1318. [/var/folders/zz/zyxvpxvq6csfxvn_n0000000000000/T/netdata-judy-XXXXXX.ePVsID3c/libjudy-1.0.5-netdata2]# env CFLAGS=-fPIC CXXFLAGS= LDFLAGS= ar -r src/libJudy.a src/Judy1/Judy1Cascade.o src/Judy1/Judy1Count.o src/Judy1/Judy1CreateBranch.o src/Judy1/Judy1Decascade.o src/Judy1/Judy1First.o src/Judy1/Judy1FreeArray.o src/Judy1/Judy1InsertBranch.o src/Judy1/Judy1MallocIF.o src/Judy1/Judy1MemActive.o src/Judy1/Judy1MemUsed.o src/Judy1/Judy1Set.o src/Judy1/Judy1SetArray.o src/Judy1/Judy1Tables.o src/Judy1/Judy1Test.o src/Judy1/Judy1Unset.o src/Judy1/libcount_la-Judy1ByCount.o src/Judy1/libinline_la-j__udy1Test.o src/Judy1/libnext_la-Judy1Next.o src/Judy1/libnext_la-Judy1NextEmpty.o src/Judy1/libprev_la-Judy1Prev.o src/Judy1/libprev_la-Judy1PrevEmpty.o src/JudyCommon/JudyMalloc.o src/JudyHS/JudyHS.o src/JudyL/JudyLCascade.o src/JudyL/JudyLCount.o src/JudyL/JudyLCreateBranch.o src/JudyL/JudyLDecascade.o src/JudyL/JudyLDel.o src/JudyL/JudyLFirst.o src/JudyL/JudyLFreeArray.o src/JudyL/JudyLGet.o src/JudyL/JudyLIns.o src/JudyL/JudyLInsArray.o src/JudyL/JudyLInsertBranch.o src/JudyL/JudyLMallocIF.o src/JudyL/JudyLMemActive.o src/JudyL/JudyLMemUsed.o src/JudyL/JudyLTables.o src/JudyL/libcount_la-JudyLByCount.o src/JudyL/libinline_la-j__udyLGet.o src/JudyL/libnext_la-JudyLNext.o src/JudyL/libnext_la-JudyLNextEmpty.o src/JudyL/libprev_la-JudyLPrev.o src/JudyL/libprev_la-JudyLPrevEmpty.o src/JudySL/JudySL.o
  1319. ar: creating archive src/libJudy.a
  1320. OK  
  1321.  
  1322. [/var/folders/zz/zyxvpxvq6csfxvn_n0000000000000/T/netdata-updater-XXXXXXXXXX.915Rr8w7/netdata-v1.33.1-78-g9ef13f190]# mkdir -p /var/folders/zz/zyxvpxvq6csfxvn_n0000000000000/T/netdata-updater-XXXXXXXXXX.915Rr8w7/netdata-v1.33.1-78-g9ef13f190/externaldeps/libJudy
  1323. OK  
  1324.  
  1325. [/var/folders/zz/zyxvpxvq6csfxvn_n0000000000000/T/netdata-updater-XXXXXXXXXX.915Rr8w7/netdata-v1.33.1-78-g9ef13f190]# cp /var/folders/zz/zyxvpxvq6csfxvn_n0000000000000/T/netdata-judy-XXXXXX.ePVsID3c/libjudy-1.0.5-netdata2/src/libJudy.a /var/folders/zz/zyxvpxvq6csfxvn_n0000000000000/T/netdata-updater-XXXXXXXXXX.915Rr8w7/netdata-v1.33.1-78-g9ef13f190/externaldeps/libJudy/libJudy.a
  1326. OK  
  1327.  
  1328. [/var/folders/zz/zyxvpxvq6csfxvn_n0000000000000/T/netdata-updater-XXXXXXXXXX.915Rr8w7/netdata-v1.33.1-78-g9ef13f190]# cp /var/folders/zz/zyxvpxvq6csfxvn_n0000000000000/T/netdata-judy-XXXXXX.ePVsID3c/libjudy-1.0.5-netdata2/src/Judy.h /var/folders/zz/zyxvpxvq6csfxvn_n0000000000000/T/netdata-updater-XXXXXXXXXX.915Rr8w7/netdata-v1.33.1-78-g9ef13f190/externaldeps/libJudy/Judy.h
  1329. OK  
  1330.  
  1331. OK  libJudy built and prepared.
  1332.  
  1333.  
  1334. --- Run autotools to configure the build environment ---
  1335. [/var/folders/zz/zyxvpxvq6csfxvn_n0000000000000/T/netdata-updater-XXXXXXXXXX.915Rr8w7/netdata-v1.33.1-78-g9ef13f190]# autoreconf -ivf
  1336. autoreconf: export WARNINGS=
  1337. autoreconf: Entering directory '.'
  1338. autoreconf: configure.ac: not using Gettext
  1339. autoreconf: running: aclocal --force -I build/m4
  1340. autoreconf: configure.ac: tracing
  1341. autoreconf: configure.ac: not using Libtool
  1342. autoreconf: configure.ac: not using Intltool
  1343. autoreconf: configure.ac: not using Gtkdoc
  1344. autoreconf: running: /usr/local/Cellar/autoconf/2.71/bin/autoconf --force
  1345. configure.ac:39: warning: The macro `AC_PROG_CC_C99' is obsolete.
  1346. configure.ac:39: You should run autoupdate.
  1347. ./lib/autoconf/c.m4:1659: AC_PROG_CC_C99 is expanded from...
  1348. configure.ac:39: the top level
  1349. configure.ac:307: warning: The macro `ACX_PTHREAD' is obsolete.
  1350. configure.ac:307: You should run autoupdate.
  1351. build/m4/ax_pthread.m4:63: ACX_PTHREAD is expanded from...
  1352. configure.ac:307: the top level
  1353. configure.ac:534: warning: The macro `AC_TRY_LINK' is obsolete.
  1354. configure.ac:534: You should run autoupdate.
  1355. ./lib/autoconf/general.m4:2920: AC_TRY_LINK is expanded from...
  1356. configure.ac:534: the top level
  1357. configure.ac:1070: warning: The macro `AC_TRY_LINK' is obsolete.
  1358. configure.ac:1070: You should run autoupdate.
  1359. ./lib/autoconf/general.m4:2920: AC_TRY_LINK is expanded from...
  1360. configure.ac:1070: the top level
  1361. configure.ac:1392: warning: The macro `AC_LANG_CPLUSPLUS' is obsolete.
  1362. configure.ac:1392: You should run autoupdate.
  1363. ./lib/autoconf/c.m4:262: AC_LANG_CPLUSPLUS is expanded from...
  1364. configure.ac:1392: the top level
  1365. configure.ac:1398: warning: The macro `AC_TRY_LINK' is obsolete.
  1366. configure.ac:1398: You should run autoupdate.
  1367. ./lib/autoconf/general.m4:2920: AC_TRY_LINK is expanded from...
  1368. configure.ac:1398: the top level
  1369. autoreconf: running: /usr/local/Cellar/autoconf/2.71/bin/autoheader --force
  1370. autoreconf: running: automake --add-missing --copy --force-missing
  1371. autoreconf: Leaving directory '.'
  1372. OK  
  1373.  
  1374. [/var/folders/zz/zyxvpxvq6csfxvn_n0000000000000/T/netdata-updater-XXXXXXXXXX.915Rr8w7/netdata-v1.33.1-78-g9ef13f190]# ./configure --prefix=/usr/local/netdata/usr --sysconfdir=/usr/local/netdata/etc --localstatedir=/usr/local/netdata/var --libexecdir=/usr/local/netdata/usr/libexec --libdir=/usr/local/netdata/usr/lib --with-zlib --with-math --with-user=netdata --enable-cloud --with-bundled-protobuf --with-bundled-libJudy CFLAGS= -I/usr/local/opt/[email protected]/include -I/usr/local/include LDFLAGS= -L/usr/local/opt/[email protected]/lib -L/usr/local/lib
  1375. checking whether to enable maintainer-specific portions of Makefiles... no
  1376. checking for a BSD-compatible install... /usr/bin/install -c
  1377. checking whether build environment is sane... yes
  1378. checking for a race-free mkdir -p... ././install-sh -c -d
  1379. checking for gawk... no
  1380. checking for mawk... no
  1381. checking for nawk... no
  1382. checking for awk... awk
  1383. checking whether make sets $(MAKE)... yes
  1384. checking whether make supports nested variables... yes
  1385. checking how to create a pax tar archive... gnutar
  1386. checking whether make supports nested variables... (cached) yes
  1387. checking build system type... x86_64-apple-darwin19.6.0
  1388. checking host system type... x86_64-apple-darwin19.6.0
  1389. checking for gcc... gcc
  1390. checking whether the C compiler works... yes
  1391. checking for C compiler default output file name... a.out
  1392. checking for suffix of executables...
  1393. checking whether we are cross compiling... no
  1394. checking for suffix of object files... o
  1395. checking whether the compiler supports GNU C... yes
  1396. checking whether gcc accepts -g... yes
  1397. checking for gcc option to enable C11 features... none needed
  1398. checking whether gcc understands -c and -o together... yes
  1399. checking whether make supports the include directive... yes (GNU style)
  1400. checking dependency style of gcc... gcc3
  1401. checking for g++... g++
  1402. checking whether the compiler supports GNU C++... yes
  1403. checking whether g++ accepts -g... yes
  1404. checking for g++ option to enable C++11 features... none needed
  1405. checking dependency style of g++... gcc3
  1406. checking for pkg-config... /usr/local/bin/pkg-config
  1407. checking pkg-config is at least version 0.9.0... yes
  1408. checking for stdio.h... yes
  1409. checking for stdlib.h... yes
  1410. checking for string.h... yes
  1411. checking for inttypes.h... yes
  1412. checking for stdint.h... yes
  1413. checking for strings.h... yes
  1414. checking for sys/stat.h... yes
  1415. checking for sys/types.h... yes
  1416. checking for unistd.h... yes
  1417. checking for wchar.h... yes
  1418. checking for minix/config.h... no
  1419. checking for sys/prctl.h... no
  1420. checking for sys/vfs.h... no
  1421. checking for sys/statfs.h... no
  1422. checking for linux/magic.h... no
  1423. checking for sys/statvfs.h... yes
  1424. checking for sys/mount.h... yes
  1425. checking whether it is safe to define __EXTENSIONS__... yes
  1426. checking whether _XOPEN_SOURCE should be defined... no
  1427. checking for __attribute__((returns_nonnull))... yes
  1428. checking for __attribute__((malloc))... yes
  1429. checking for __attribute__((noreturn))... yes
  1430. checking for __attribute__((noinline))... yes
  1431. checking for __attribute__((format))... yes
  1432. checking for __attribute__((warn_unused_result))... yes
  1433. checking for struct timespec... yes
  1434. checking for clockid_t... yes
  1435. checking for library containing clock_gettime... none required
  1436. checking for clock_gettime... yes
  1437. checking for sched_setscheduler... no
  1438. checking for sched_getscheduler... no
  1439. checking for sched_getparam... no
  1440. checking for sched_get_priority_min... yes
  1441. checking for sched_get_priority_max... yes
  1442. checking for getpriority... yes
  1443. checking for setpriority... yes
  1444. checking for nice... yes
  1445. checking for recvmmsg... no
  1446. checking for int8_t... yes
  1447. checking for int16_t... yes
  1448. checking for int32_t... yes
  1449. checking for int64_t... yes
  1450. checking for uint8_t... yes
  1451. checking for uint16_t... yes
  1452. checking for uint32_t... yes
  1453. checking for uint64_t... yes
  1454. checking for inline... inline
  1455. checking for gcc options needed to detect all undeclared functions... none needed
  1456. checking whether strerror_r is declared... yes
  1457. checking whether strerror_r returns char *... no
  1458. checking for _Generic... yes
  1459. checking for __atomic... yes
  1460. checking for sys/mkdev.h... no
  1461. checking for sys/sysmacros.h... no
  1462. checking for sys/types.h... (cached) yes
  1463. checking for netinet/in.h... yes
  1464. checking for arpa/nameser.h... yes
  1465. checking for netdb.h... yes
  1466. checking for resolv.h... yes
  1467. checking for accept4... no
  1468. checking operating system... Host OS: macos
  1469. checking if compiler needs -Werror to reject unknown flags... yes
  1470. checking whether pthreads work with -pthread... yes
  1471. checking for joinable pthread attribute... PTHREAD_CREATE_JOINABLE
  1472. checking if more special flags are required for pthreads... -D_THREAD_SAFE
  1473. checking for PTHREAD_PRIO_INHERIT... yes
  1474. checking for pthread_getname_np in -lpthread... yes
  1475. checking for sin in -lm... yes
  1476. checking if libm should be used... yes
  1477. checking for uv_fs_scandir_next in -luv... yes
  1478. checking for LZ4_initStream in -llz4... yes
  1479. checking for LZ4_compress_default in -llz4... yes
  1480. checking for zlib... yes
  1481. checking if zlib should be used... yes
  1482. checking for uuid... yes
  1483. checking for SHA256_Init in -lcrypto... yes
  1484. checking for X509_VERIFY_PARAM_set1_host in -lcrypto... yes
  1485. checking for json-c... yes
  1486. checking for json_object_get_type in -ljson-c... yes
  1487. checking for libJudy in yes... yes
  1488. checking if netdata dbengine should be used... yes
  1489. checking if netdata https should be used... yes
  1490. checking if netdata compression should be used... yes
  1491. checking if json-c should be used... yes
  1492. checking for memory allocator... system
  1493. checking for mallopt... no
  1494. checking for mallinfo... no
  1495. checking for libcap... no
  1496. checking if libcap should be used... no
  1497. checking is bundled protobuf available... yes
  1498. configure: using bundled protobuf
  1499. checking for g++... /usr/bin/g++
  1500. checking if Cloud functionality should be enabled... yes
  1501. configure: Checking if ACLK Next Generation can be built
  1502. checking if git submodules present for ACLK Next Generation... yes
  1503. checking if SSL available for ACLK Next Generation... yes
  1504. checking if JSON-C available for ACLK Next Generation... yes
  1505. checking ACLK Next Generation can be built... yes
  1506. checking if protobuf available for New Cloud Protocol... yes
  1507. checking if protoc available for New Cloud Protocol... yes
  1508. checking if C++ compiler available for New Cloud Protocol... yes
  1509. checking ACLK Next Generation can support New Cloud protocol... yes
  1510. checking if apps.plugin should be enabled... no
  1511. checking for libipmimonitoring... no
  1512. checking if freeipmi.plugin should be enabled... no
  1513. checking for httpConnect2 in -lcups... yes
  1514. checking for cups/cups.h... yes
  1515. checking for cups-config... /usr/bin/cups-config
  1516. checking if cups.plugin should be enabled... yes
  1517. checking for linux/netfilter/nfnetlink_conntrack.h... no
  1518. checking for libnetfilter_acct... no
  1519. checking for libmnl... no
  1520. checking if nfacct.plugin should be enabled... no
  1521. checking for yajl... no
  1522. checking for xenstat_init in -lxenstat... no
  1523. checking for xenlight... no
  1524. checking if xenstat.plugin should be enabled... no
  1525. checking for linux/perf_event.h... no
  1526. checking if perf.plugin should be enabled... no
  1527. checking if gtest and gmock can be found... checking for gtest... no
  1528. checking for gmock... no
  1529. checking if git submodules are present for machine learning functionality... yes
  1530. checking whether C++ compiler accepts -std=c++11... yes
  1531. no
  1532. checking if slabinfo.plugin should be enabled... no
  1533. checking for libcrypto... no
  1534. checking for libssl... no
  1535. checking for libcurl... yes
  1536. checking for curl_easy_init in -lcurl... yes
  1537. checking for aws-cpp-sdk-core... no
  1538. checking for aws-cpp-sdk-kinesis... no
  1539. checking if kinesis backend should be enabled... no
  1540. checking for grpc... no
  1541. checking for google_cloud_cpp_pubsub_protos... no
  1542. checking for g++... (cached) /usr/bin/g++
  1543. checking if pubsub exporting connector should be enabled... detect
  1544. checking for snappy::RawCompress in -lsnappy... no
  1545. checking if prometheus remote write backend should be enabled... no
  1546. checking for libmongoc-1.0 >= 1.7... no
  1547. checking if mongodb backend should be enabled... no
  1548. checking for setns... no
  1549. checking if cgroup-network can be enabled... no
  1550. checking if LTO should be enabled... no
  1551. checking whether we can use -latomic... no
  1552. checking for cmocka... no
  1553. configure: CMocka not found on the system. Unit tests disabled
  1554. checking that generated files are newer than configure... done
  1555. configure: creating ./config.status
  1556. config.status: creating Makefile
  1557. config.status: creating netdata.spec
  1558. config.status: creating backends/graphite/Makefile
  1559. config.status: creating backends/json/Makefile
  1560. config.status: creating backends/Makefile
  1561. config.status: creating backends/opentsdb/Makefile
  1562. config.status: creating backends/prometheus/Makefile
  1563. config.status: creating backends/prometheus/remote_write/Makefile
  1564. config.status: creating backends/aws_kinesis/Makefile
  1565. config.status: creating backends/mongodb/Makefile
  1566. config.status: creating collectors/Makefile
  1567. config.status: creating collectors/apps.plugin/Makefile
  1568. config.status: creating collectors/cgroups.plugin/Makefile
  1569. config.status: creating collectors/charts.d.plugin/Makefile
  1570. config.status: creating collectors/checks.plugin/Makefile
  1571. config.status: creating collectors/diskspace.plugin/Makefile
  1572. config.status: creating collectors/timex.plugin/Makefile
  1573. config.status: creating collectors/fping.plugin/Makefile
  1574. config.status: creating collectors/ioping.plugin/Makefile
  1575. config.status: creating collectors/freebsd.plugin/Makefile
  1576. config.status: creating collectors/freeipmi.plugin/Makefile
  1577. config.status: creating collectors/cups.plugin/Makefile
  1578. config.status: creating collectors/idlejitter.plugin/Makefile
  1579. config.status: creating collectors/macos.plugin/Makefile
  1580. config.status: creating collectors/nfacct.plugin/Makefile
  1581. config.status: creating collectors/node.d.plugin/Makefile
  1582. config.status: creating collectors/plugins.d/Makefile
  1583. config.status: creating collectors/proc.plugin/Makefile
  1584. config.status: creating collectors/python.d.plugin/Makefile
  1585. config.status: creating collectors/slabinfo.plugin/Makefile
  1586. config.status: creating collectors/statsd.plugin/Makefile
  1587. config.status: creating collectors/ebpf.plugin/Makefile
  1588. config.status: creating collectors/tc.plugin/Makefile
  1589. config.status: creating collectors/xenstat.plugin/Makefile
  1590. config.status: creating collectors/perf.plugin/Makefile
  1591. config.status: creating daemon/Makefile
  1592. config.status: creating database/Makefile
  1593. config.status: creating database/engine/Makefile
  1594. config.status: creating database/engine/metadata_log/Makefile
  1595. config.status: creating diagrams/Makefile
  1596. config.status: creating exporting/Makefile
  1597. config.status: creating exporting/graphite/Makefile
  1598. config.status: creating exporting/json/Makefile
  1599. config.status: creating exporting/opentsdb/Makefile
  1600. config.status: creating exporting/prometheus/Makefile
  1601. config.status: creating exporting/prometheus/remote_write/Makefile
  1602. config.status: creating exporting/aws_kinesis/Makefile
  1603. config.status: creating exporting/pubsub/Makefile
  1604. config.status: creating exporting/mongodb/Makefile
  1605. config.status: creating exporting/tests/Makefile
  1606. config.status: creating health/Makefile
  1607. config.status: creating health/notifications/Makefile
  1608. config.status: creating ml/Makefile
  1609. config.status: creating ml/kmeans/Makefile
  1610. config.status: creating libnetdata/Makefile
  1611. config.status: creating libnetdata/tests/Makefile
  1612. config.status: creating libnetdata/adaptive_resortable_list/Makefile
  1613. config.status: creating libnetdata/avl/Makefile
  1614. config.status: creating libnetdata/buffer/Makefile
  1615. config.status: creating libnetdata/clocks/Makefile
  1616. config.status: creating libnetdata/completion/Makefile
  1617. config.status: creating libnetdata/config/Makefile
  1618. config.status: creating libnetdata/dictionary/Makefile
  1619. config.status: creating libnetdata/ebpf/Makefile
  1620. config.status: creating libnetdata/eval/Makefile
  1621. config.status: creating libnetdata/locks/Makefile
  1622. config.status: creating libnetdata/log/Makefile
  1623. config.status: creating libnetdata/popen/Makefile
  1624. config.status: creating libnetdata/procfile/Makefile
  1625. config.status: creating libnetdata/simple_pattern/Makefile
  1626. config.status: creating libnetdata/socket/Makefile
  1627. config.status: creating libnetdata/statistical/Makefile
  1628. config.status: creating libnetdata/storage_number/Makefile
  1629. config.status: creating libnetdata/storage_number/tests/Makefile
  1630. config.status: creating libnetdata/threads/Makefile
  1631. config.status: creating libnetdata/url/Makefile
  1632. config.status: creating libnetdata/json/Makefile
  1633. config.status: creating libnetdata/health/Makefile
  1634. config.status: creating registry/Makefile
  1635. config.status: creating streaming/Makefile
  1636. config.status: creating system/Makefile
  1637. config.status: creating tests/Makefile
  1638. config.status: creating web/Makefile
  1639. config.status: creating web/api/Makefile
  1640. config.status: creating web/api/badges/Makefile
  1641. config.status: creating web/api/exporters/Makefile
  1642. config.status: creating web/api/exporters/shell/Makefile
  1643. config.status: creating web/api/exporters/prometheus/Makefile
  1644. config.status: creating web/api/formatters/Makefile
  1645. config.status: creating web/api/formatters/csv/Makefile
  1646. config.status: creating web/api/formatters/json/Makefile
  1647. config.status: creating web/api/formatters/ssv/Makefile
  1648. config.status: creating web/api/formatters/value/Makefile
  1649. config.status: creating web/api/queries/Makefile
  1650. config.status: creating web/api/queries/average/Makefile
  1651. config.status: creating web/api/queries/des/Makefile
  1652. config.status: creating web/api/queries/incremental_sum/Makefile
  1653. config.status: creating web/api/queries/max/Makefile
  1654. config.status: creating web/api/queries/median/Makefile
  1655. config.status: creating web/api/queries/min/Makefile
  1656. config.status: creating web/api/queries/ses/Makefile
  1657. config.status: creating web/api/queries/stddev/Makefile
  1658. config.status: creating web/api/queries/sum/Makefile
  1659. config.status: creating web/api/health/Makefile
  1660. config.status: creating web/gui/Makefile
  1661. config.status: creating web/gui/dashboard/Makefile
  1662. config.status: creating web/server/Makefile
  1663. config.status: creating web/server/static/Makefile
  1664. config.status: creating claim/Makefile
  1665. config.status: creating spawn/Makefile
  1666. config.status: creating parser/Makefile
  1667. config.status: creating config.h
  1668. config.status: executing depfiles commands
  1669. OK  
  1670.  
  1671. --- Cleanup compilation directory ---
  1672. [/var/folders/zz/zyxvpxvq6csfxvn_n0000000000000/T/netdata-updater-XXXXXXXXXX.915Rr8w7/netdata-v1.33.1-78-g9ef13f190]# make clean
  1673. Making clean in diagrams
  1674. make[1]: Nothing to be done for `clean'.
  1675. Making clean in system
  1676. test -z "edit-config netdata-openrc netdata.logrotate netdata.service netdata.service.v235 netdata-init-d netdata-lsb netdata-freebsd netdata.plist netdata.crontab netdata-updater.service " || rm -f edit-config netdata-openrc netdata.logrotate netdata.service netdata.service.v235 netdata-init-d netdata-lsb netdata-freebsd netdata.plist netdata.crontab netdata-updater.service
  1677. Making clean in tests
  1678. test -z "health_mgmtapi/health-cmdapi-test.sh acls/acl.sh urls/request.sh alarm_repetition/alarm.sh template_dimension/template_dim.sh " || rm -f health_mgmtapi/health-cmdapi-test.sh acls/acl.sh urls/request.sh alarm_repetition/alarm.sh template_dimension/template_dim.sh
  1679. Making clean in backends
  1680. Making clean in graphite
  1681. make[2]: Nothing to be done for `clean'.
  1682. Making clean in json
  1683. make[2]: Nothing to be done for `clean'.
  1684. Making clean in opentsdb
  1685. make[2]: Nothing to be done for `clean'.
  1686. Making clean in prometheus
  1687. Making clean in remote_write
  1688. test -z "remote_write.pb.cc remote_write.pb.h " || rm -f remote_write.pb.cc remote_write.pb.h
  1689. make[3]: Nothing to be done for `clean-am'.
  1690. Making clean in aws_kinesis
  1691. make[2]: Nothing to be done for `clean'.
  1692. Making clean in mongodb
  1693. make[2]: Nothing to be done for `clean'.
  1694. make[2]: Nothing to be done for `clean-am'.
  1695. Making clean in collectors
  1696. Making clean in plugins.d
  1697. make[3]: Nothing to be done for `clean-am'.
  1698. Making clean in apps.plugin
  1699. make[2]: Nothing to be done for `clean'.
  1700. Making clean in cgroups.plugin
  1701. test -z "cgroup-name.sh " || rm -f cgroup-name.sh
  1702. Making clean in charts.d.plugin
  1703. test -z "charts.d.plugin " || rm -f charts.d.plugin
  1704. Making clean in checks.plugin
  1705. make[2]: Nothing to be done for `clean'.
  1706. Making clean in cups.plugin
  1707. make[2]: Nothing to be done for `clean'.
  1708. Making clean in diskspace.plugin
  1709. make[2]: Nothing to be done for `clean'.
  1710. Making clean in timex.plugin
  1711. make[2]: Nothing to be done for `clean'.
  1712. Making clean in fping.plugin
  1713. test -z "fping.plugin " || rm -f fping.plugin
  1714. Making clean in ioping.plugin
  1715. test -z "ioping.plugin " || rm -f ioping.plugin
  1716. Making clean in freebsd.plugin
  1717. make[2]: Nothing to be done for `clean'.
  1718. Making clean in freeipmi.plugin
  1719. make[2]: Nothing to be done for `clean'.
  1720. Making clean in idlejitter.plugin
  1721. make[2]: Nothing to be done for `clean'.
  1722. Making clean in macos.plugin
  1723. make[2]: Nothing to be done for `clean'.
  1724. Making clean in nfacct.plugin
  1725. make[2]: Nothing to be done for `clean'.
  1726. Making clean in xenstat.plugin
  1727. make[2]: Nothing to be done for `clean'.
  1728. Making clean in perf.plugin
  1729. make[2]: Nothing to be done for `clean'.
  1730. Making clean in node.d.plugin
  1731. test -z "node.d.plugin " || rm -f node.d.plugin
  1732. Making clean in proc.plugin
  1733. make[2]: Nothing to be done for `clean'.
  1734. Making clean in python.d.plugin
  1735. test -z "python.d.plugin " || rm -f python.d.plugin
  1736. Making clean in slabinfo.plugin
  1737. test -z "slabinfo.plugin " || rm -f slabinfo.plugin
  1738. Making clean in statsd.plugin
  1739. make[2]: Nothing to be done for `clean'.
  1740. Making clean in ebpf.plugin
  1741. make[2]: Nothing to be done for `clean'.
  1742. Making clean in tc.plugin
  1743. test -z "tc-qos-helper.sh " || rm -f tc-qos-helper.sh
  1744. make[2]: Nothing to be done for `clean-am'.
  1745. Making clean in daemon
  1746. test -z "anonymous-statistics.sh " || rm -f anonymous-statistics.sh
  1747. Making clean in database
  1748. Making clean in engine
  1749. Making clean in metadata_log
  1750. make[3]: Nothing to be done for `clean'.
  1751. make[3]: Nothing to be done for `clean-am'.
  1752. make[2]: Nothing to be done for `clean-am'.
  1753. Making clean in exporting
  1754. Making clean in tests
  1755. make[2]: Nothing to be done for `clean'.
  1756. Making clean in graphite
  1757. make[2]: Nothing to be done for `clean'.
  1758. Making clean in json
  1759. make[2]: Nothing to be done for `clean'.
  1760. Making clean in opentsdb
  1761. make[2]: Nothing to be done for `clean'.
  1762. Making clean in prometheus
  1763. Making clean in remote_write
  1764. test -z "remote_write.pb.cc remote_write.pb.h " || rm -f remote_write.pb.cc remote_write.pb.h
  1765. make[3]: Nothing to be done for `clean-am'.
  1766. Making clean in aws_kinesis
  1767. make[2]: Nothing to be done for `clean'.
  1768. Making clean in pubsub
  1769. make[2]: Nothing to be done for `clean'.
  1770. Making clean in mongodb
  1771. make[2]: Nothing to be done for `clean'.
  1772. make[2]: Nothing to be done for `clean-am'.
  1773. Making clean in health
  1774. Making clean in notifications
  1775. test -z "alarm-notify.sh " || rm -f alarm-notify.sh
  1776. test -z "" || rm -f
  1777. Making clean in libnetdata
  1778. Making clean in adaptive_resortable_list
  1779. make[2]: Nothing to be done for `clean'.
  1780. Making clean in avl
  1781. make[2]: Nothing to be done for `clean'.
  1782. Making clean in buffer
  1783. make[2]: Nothing to be done for `clean'.
  1784. Making clean in clocks
  1785. make[2]: Nothing to be done for `clean'.
  1786. Making clean in completion
  1787. make[2]: Nothing to be done for `clean'.
  1788. Making clean in config
  1789. make[2]: Nothing to be done for `clean'.
  1790. Making clean in dictionary
  1791. make[2]: Nothing to be done for `clean'.
  1792. Making clean in ebpf
  1793. make[2]: Nothing to be done for `clean'.
  1794. Making clean in eval
  1795. make[2]: Nothing to be done for `clean'.
  1796. Making clean in json
  1797. make[2]: Nothing to be done for `clean'.
  1798. Making clean in health
  1799. make[2]: Nothing to be done for `clean'.
  1800. Making clean in locks
  1801. make[2]: Nothing to be done for `clean'.
  1802. Making clean in log
  1803. make[2]: Nothing to be done for `clean'.
  1804. Making clean in popen
  1805. make[2]: Nothing to be done for `clean'.
  1806. Making clean in procfile
  1807. make[2]: Nothing to be done for `clean'.
  1808. Making clean in simple_pattern
  1809. make[2]: Nothing to be done for `clean'.
  1810. Making clean in socket
  1811. make[2]: Nothing to be done for `clean'.
  1812. Making clean in statistical
  1813. make[2]: Nothing to be done for `clean'.
  1814. Making clean in storage_number
  1815. Making clean in tests
  1816. make[3]: Nothing to be done for `clean'.
  1817. make[3]: Nothing to be done for `clean-am'.
  1818. Making clean in threads
  1819. make[2]: Nothing to be done for `clean'.
  1820. Making clean in url
  1821. make[2]: Nothing to be done for `clean'.
  1822. Making clean in tests
  1823. make[2]: Nothing to be done for `clean'.
  1824. make[2]: Nothing to be done for `clean-am'.
  1825. Making clean in registry
  1826. make[1]: Nothing to be done for `clean'.
  1827. Making clean in streaming
  1828. make[1]: Nothing to be done for `clean'.
  1829. Making clean in web
  1830. Making clean in api
  1831. Making clean in badges
  1832. make[3]: Nothing to be done for `clean'.
  1833. Making clean in queries
  1834. Making clean in average
  1835. make[4]: Nothing to be done for `clean'.
  1836. Making clean in des
  1837. make[4]: Nothing to be done for `clean'.
  1838. Making clean in incremental_sum
  1839. make[4]: Nothing to be done for `clean'.
  1840. Making clean in max
  1841. make[4]: Nothing to be done for `clean'.
  1842. Making clean in min
  1843. make[4]: Nothing to be done for `clean'.
  1844. Making clean in sum
  1845. make[4]: Nothing to be done for `clean'.
  1846. Making clean in median
  1847. make[4]: Nothing to be done for `clean'.
  1848. Making clean in ses
  1849. make[4]: Nothing to be done for `clean'.
  1850. Making clean in stddev
  1851. make[4]: Nothing to be done for `clean'.
  1852. make[4]: Nothing to be done for `clean-am'.
  1853. Making clean in exporters
  1854. Making clean in shell
  1855. make[4]: Nothing to be done for `clean'.
  1856. Making clean in prometheus
  1857. make[4]: Nothing to be done for `clean'.
  1858. make[4]: Nothing to be done for `clean-am'.
  1859. Making clean in formatters
  1860. Making clean in csv
  1861. make[4]: Nothing to be done for `clean'.
  1862. Making clean in json
  1863. make[4]: Nothing to be done for `clean'.
  1864. Making clean in ssv
  1865. make[4]: Nothing to be done for `clean'.
  1866. Making clean in value
  1867. make[4]: Nothing to be done for `clean'.
  1868. make[4]: Nothing to be done for `clean-am'.
  1869. Making clean in health
  1870. make[3]: Nothing to be done for `clean'.
  1871. make[3]: Nothing to be done for `clean-am'.
  1872. Making clean in gui
  1873. Making clean in dashboard
  1874. make[3]: Nothing to be done for `clean'.
  1875. test -z "version.txt " || rm -f version.txt
  1876. Making clean in server
  1877. Making clean in static
  1878. make[4]: Nothing to be done for `clean-am'.
  1879. make[3]: Nothing to be done for `clean-am'.
  1880. make[2]: Nothing to be done for `clean-am'.
  1881. Making clean in claim
  1882. test -z "netdata-claim.sh " || rm -f netdata-claim.sh
  1883. Making clean in parser
  1884. make[1]: Nothing to be done for `clean'.
  1885. Making clean in spawn
  1886. make[1]: Nothing to be done for `clean'.
  1887. Making clean in ml
  1888. Making clean in kmeans
  1889. make[2]: Nothing to be done for `clean'.
  1890. make[2]: Nothing to be done for `clean-am'.
  1891. test -z "" || rm -f
  1892. test -z "./netdata-v1.33.1-78-nightly.tar.gz aclk/aclk-schemas/proto/agent/v1/connection.pb.cc aclk/aclk-schemas/proto/agent/v1/connection.pb.h aclk/aclk-schemas/proto/nodeinstance/connection/v1/connection.pb.cc aclk/aclk-schemas/proto/nodeinstance/connection/v1/connection.pb.h aclk/aclk-schemas/proto/nodeinstance/create/v1/creation.pb.cc aclk/aclk-schemas/proto/nodeinstance/create/v1/creation.pb.h aclk/aclk-schemas/proto/chart/v1/stream.pb.cc aclk/aclk-schemas/proto/chart/v1/stream.pb.h aclk/aclk-schemas/proto/chart/v1/instance.pb.cc aclk/aclk-schemas/proto/chart/v1/instance.pb.h aclk/aclk-schemas/proto/chart/v1/dimension.pb.cc aclk/aclk-schemas/proto/chart/v1/dimension.pb.h aclk/aclk-schemas/proto/chart/v1/config.pb.cc aclk/aclk-schemas/proto/chart/v1/config.pb.h aclk/aclk-schemas/proto/aclk/v1/lib.pb.cc aclk/aclk-schemas/proto/aclk/v1/lib.pb.h aclk/aclk-schemas/proto/agent/v1/disconnect.pb.cc aclk/aclk-schemas/proto/agent/v1/disconnect.pb.h aclk/aclk-schemas/proto/alarm/v1/config.pb.cc aclk/aclk-schemas/proto/alarm/v1/config.pb.h aclk/aclk-schemas/proto/alarm/v1/stream.pb.cc aclk/aclk-schemas/proto/alarm/v1/stream.pb.h aclk/aclk-schemas/proto/nodeinstance/info/v1/info.pb.cc aclk/aclk-schemas/proto/nodeinstance/info/v1/info.pb.h " || rm -f ./netdata-v1.33.1-78-nightly.tar.gz aclk/aclk-schemas/proto/agent/v1/connection.pb.cc aclk/aclk-schemas/proto/agent/v1/connection.pb.h aclk/aclk-schemas/proto/nodeinstance/connection/v1/connection.pb.cc aclk/aclk-schemas/proto/nodeinstance/connection/v1/connection.pb.h aclk/aclk-schemas/proto/nodeinstance/create/v1/creation.pb.cc aclk/aclk-schemas/proto/nodeinstance/create/v1/creation.pb.h aclk/aclk-schemas/proto/chart/v1/stream.pb.cc aclk/aclk-schemas/proto/chart/v1/stream.pb.h aclk/aclk-schemas/proto/chart/v1/instance.pb.cc aclk/aclk-schemas/proto/chart/v1/instance.pb.h aclk/aclk-schemas/proto/chart/v1/dimension.pb.cc aclk/aclk-schemas/proto/chart/v1/dimension.pb.h aclk/aclk-schemas/proto/chart/v1/config.pb.cc aclk/aclk-schemas/proto/chart/v1/config.pb.h aclk/aclk-schemas/proto/aclk/v1/lib.pb.cc aclk/aclk-schemas/proto/aclk/v1/lib.pb.h aclk/aclk-schemas/proto/agent/v1/disconnect.pb.cc aclk/aclk-schemas/proto/agent/v1/disconnect.pb.h aclk/aclk-schemas/proto/alarm/v1/config.pb.cc aclk/aclk-schemas/proto/alarm/v1/config.pb.h aclk/aclk-schemas/proto/alarm/v1/stream.pb.cc aclk/aclk-schemas/proto/alarm/v1/stream.pb.h aclk/aclk-schemas/proto/nodeinstance/info/v1/info.pb.cc aclk/aclk-schemas/proto/nodeinstance/info/v1/info.pb.h
  1893. test -z "    cups.plugin    " || rm -f     cups.plugin    
  1894. test -z "netdata netdatacli" || rm -f netdata netdatacli
  1895. rm -f *.o
  1896. rm -f aclk/*.o
  1897. rm -f aclk/aclk-schemas/proto/aclk/v1/*.o
  1898. rm -f aclk/aclk-schemas/proto/agent/v1/*.o
  1899. rm -f aclk/aclk-schemas/proto/alarm/v1/*.o
  1900. rm -f aclk/aclk-schemas/proto/chart/v1/*.o
  1901. rm -f aclk/aclk-schemas/proto/nodeinstance/connection/v1/*.o
  1902. rm -f aclk/aclk-schemas/proto/nodeinstance/create/v1/*.o
  1903. rm -f aclk/aclk-schemas/proto/nodeinstance/info/v1/*.o
  1904. rm -f aclk/schema-wrappers/*.o
  1905. rm -f backends/*.o
  1906. rm -f backends/aws_kinesis/*.o
  1907. rm -f backends/graphite/*.o
  1908. rm -f backends/json/*.o
  1909. rm -f backends/mongodb/*.o
  1910. rm -f backends/opentsdb/*.o
  1911. rm -f backends/prometheus/*.o
  1912. rm -f backends/prometheus/remote_write/*.o
  1913. rm -f claim/*.o
  1914. rm -f cli/*.o
  1915. rm -f collectors/apps.plugin/*.o
  1916. rm -f collectors/cgroups.plugin/*.o
  1917. rm -f collectors/cgroups.plugin/tests/*.o
  1918. rm -f collectors/checks.plugin/*.o
  1919. rm -f collectors/cups.plugin/*.o
  1920. rm -f collectors/diskspace.plugin/*.o
  1921. rm -f collectors/ebpf.plugin/*.o
  1922. rm -f collectors/freebsd.plugin/*.o
  1923. rm -f collectors/freeipmi.plugin/*.o
  1924. rm -f collectors/idlejitter.plugin/*.o
  1925. rm -f collectors/macos.plugin/*.o
  1926. rm -f collectors/nfacct.plugin/*.o
  1927. rm -f collectors/perf.plugin/*.o
  1928. rm -f collectors/plugins.d/*.o
  1929. rm -f collectors/proc.plugin/*.o
  1930. rm -f collectors/slabinfo.plugin/*.o
  1931. rm -f collectors/statsd.plugin/*.o
  1932. rm -f collectors/tc.plugin/*.o
  1933. rm -f collectors/timex.plugin/*.o
  1934. rm -f collectors/xenstat.plugin/*.o
  1935. rm -f daemon/*.o
  1936. rm -f database/*.o
  1937. rm -f database/engine/*.o
  1938. rm -f database/engine/metadata_log/*.o
  1939. rm -f database/sqlite/*.o
  1940. rm -f exporting/*.o
  1941. rm -f exporting/aws_kinesis/*.o
  1942. rm -f exporting/graphite/*.o
  1943. rm -f exporting/json/*.o
  1944. rm -f exporting/mongodb/*.o
  1945. rm -f exporting/opentsdb/*.o
  1946. rm -f exporting/prometheus/*.o
  1947. rm -f exporting/prometheus/remote_write/*.o
  1948. rm -f exporting/pubsub/*.o
  1949. rm -f exporting/tests/*.o
  1950. rm -f health/*.o
  1951. rm -f libnetdata/*.o
  1952. rm -f libnetdata/adaptive_resortable_list/*.o
  1953. rm -f libnetdata/avl/*.o
  1954. rm -f libnetdata/buffer/*.o
  1955. rm -f libnetdata/circular_buffer/*.o
  1956. rm -f libnetdata/clocks/*.o
  1957. rm -f libnetdata/completion/*.o
  1958. rm -f libnetdata/config/*.o
  1959. rm -f libnetdata/dictionary/*.o
  1960. rm -f libnetdata/ebpf/*.o
  1961. rm -f libnetdata/eval/*.o
  1962. rm -f libnetdata/health/*.o
  1963. rm -f libnetdata/json/*.o
  1964. rm -f libnetdata/locks/*.o
  1965. rm -f libnetdata/log/*.o
  1966. rm -f libnetdata/popen/*.o
  1967. rm -f libnetdata/procfile/*.o
  1968. rm -f libnetdata/simple_pattern/*.o
  1969. rm -f libnetdata/socket/*.o
  1970. rm -f libnetdata/statistical/*.o
  1971. rm -f libnetdata/storage_number/*.o
  1972. rm -f libnetdata/storage_number/tests/*.o
  1973. rm -f libnetdata/tests/*.o
  1974. rm -f libnetdata/threads/*.o
  1975. rm -f libnetdata/url/*.o
  1976. rm -f ml/*.o
  1977. rm -f ml/kmeans/*.o
  1978. rm -f ml/kmeans/dlib/dlib/all/*.o
  1979. rm -f mqtt_websockets/MQTT-C/src/*.o
  1980. rm -f mqtt_websockets/c-rbuf/src/*.o
  1981. rm -f mqtt_websockets/src/*.o
  1982. rm -f parser/*.o
  1983. rm -f registry/*.o
  1984. rm -f spawn/*.o
  1985. rm -f streaming/*.o
  1986. rm -f web/api/*.o
  1987. rm -f web/api/badges/*.o
  1988. rm -f web/api/exporters/*.o
  1989. rm -f web/api/exporters/shell/*.o
  1990. rm -f web/api/formatters/*.o
  1991. rm -f web/api/formatters/csv/*.o
  1992. rm -f web/api/formatters/json/*.o
  1993. rm -f web/api/formatters/ssv/*.o
  1994. rm -f web/api/formatters/value/*.o
  1995. rm -f web/api/health/*.o
  1996. rm -f web/api/queries/*.o
  1997. rm -f web/api/queries/average/*.o
  1998. rm -f web/api/queries/des/*.o
  1999. rm -f web/api/queries/incremental_sum/*.o
  2000. rm -f web/api/queries/max/*.o
  2001. rm -f web/api/queries/median/*.o
  2002. rm -f web/api/queries/min/*.o
  2003. rm -f web/api/queries/ses/*.o
  2004. rm -f web/api/queries/stddev/*.o
  2005. rm -f web/api/queries/sum/*.o
  2006. rm -f web/api/tests/*.o
  2007. rm -f web/server/*.o
  2008. rm -f web/server/static/*.o
  2009. test -z "" || rm -f
  2010. test -z "" || rm -f
  2011. test -z "test-suite.log" || rm -f test-suite.log
  2012. OK  
  2013.  
  2014. --- Compile netdata ---
  2015. [/var/folders/zz/zyxvpxvq6csfxvn_n0000000000000/T/netdata-updater-XXXXXXXXXX.915Rr8w7/netdata-v1.33.1-78-g9ef13f190]# make -j4
  2016. /var/folders/zz/zyxvpxvq6csfxvn_n0000000000000/T/netdata-updater-XXXXXXXXXX.915Rr8w7/netdata-v1.33.1-78-g9ef13f190/externaldeps/protobuf/src/protoc -I=aclk/aclk-schemas --cpp_out=./aclk/aclk-schemas aclk/aclk-schemas/proto/agent/v1/connection.proto
  2017. /var/folders/zz/zyxvpxvq6csfxvn_n0000000000000/T/netdata-updater-XXXXXXXXXX.915Rr8w7/netdata-v1.33.1-78-g9ef13f190/externaldeps/protobuf/src/protoc -I=aclk/aclk-schemas --cpp_out=./aclk/aclk-schemas aclk/aclk-schemas/proto/agent/v1/connection.proto
  2018. /var/folders/zz/zyxvpxvq6csfxvn_n0000000000000/T/netdata-updater-XXXXXXXXXX.915Rr8w7/netdata-v1.33.1-78-g9ef13f190/externaldeps/protobuf/src/protoc -I=aclk/aclk-schemas --cpp_out=./aclk/aclk-schemas aclk/aclk-schemas/proto/nodeinstance/connection/v1/connection.proto
  2019. /var/folders/zz/zyxvpxvq6csfxvn_n0000000000000/T/netdata-updater-XXXXXXXXXX.915Rr8w7/netdata-v1.33.1-78-g9ef13f190/externaldeps/protobuf/src/protoc -I=aclk/aclk-schemas --cpp_out=./aclk/aclk-schemas aclk/aclk-schemas/proto/nodeinstance/connection/v1/connection.proto
  2020. /var/folders/zz/zyxvpxvq6csfxvn_n0000000000000/T/netdata-updater-XXXXXXXXXX.915Rr8w7/netdata-v1.33.1-78-g9ef13f190/externaldeps/protobuf/src/protoc -I=aclk/aclk-schemas --cpp_out=./aclk/aclk-schemas aclk/aclk-schemas/proto/nodeinstance/create/v1/creation.proto
  2021. /var/folders/zz/zyxvpxvq6csfxvn_n0000000000000/T/netdata-updater-XXXXXXXXXX.915Rr8w7/netdata-v1.33.1-78-g9ef13f190/externaldeps/protobuf/src/protoc -I=aclk/aclk-schemas --cpp_out=./aclk/aclk-schemas aclk/aclk-schemas/proto/nodeinstance/create/v1/creation.proto
  2022. /var/folders/zz/zyxvpxvq6csfxvn_n0000000000000/T/netdata-updater-XXXXXXXXXX.915Rr8w7/netdata-v1.33.1-78-g9ef13f190/externaldeps/protobuf/src/protoc -I=aclk/aclk-schemas --cpp_out=./aclk/aclk-schemas aclk/aclk-schemas/proto/chart/v1/stream.proto
  2023. /var/folders/zz/zyxvpxvq6csfxvn_n0000000000000/T/netdata-updater-XXXXXXXXXX.915Rr8w7/netdata-v1.33.1-78-g9ef13f190/externaldeps/protobuf/src/protoc -I=aclk/aclk-schemas --cpp_out=./aclk/aclk-schemas aclk/aclk-schemas/proto/chart/v1/stream.proto
  2024. /var/folders/zz/zyxvpxvq6csfxvn_n0000000000000/T/netdata-updater-XXXXXXXXXX.915Rr8w7/netdata-v1.33.1-78-g9ef13f190/externaldeps/protobuf/src/protoc -I=aclk/aclk-schemas --cpp_out=./aclk/aclk-schemas aclk/aclk-schemas/proto/chart/v1/instance.proto
  2025. /var/folders/zz/zyxvpxvq6csfxvn_n0000000000000/T/netdata-updater-XXXXXXXXXX.915Rr8w7/netdata-v1.33.1-78-g9ef13f190/externaldeps/protobuf/src/protoc -I=aclk/aclk-schemas --cpp_out=./aclk/aclk-schemas aclk/aclk-schemas/proto/chart/v1/instance.proto
  2026. /var/folders/zz/zyxvpxvq6csfxvn_n0000000000000/T/netdata-updater-XXXXXXXXXX.915Rr8w7/netdata-v1.33.1-78-g9ef13f190/externaldeps/protobuf/src/protoc -I=aclk/aclk-schemas --cpp_out=./aclk/aclk-schemas aclk/aclk-schemas/proto/chart/v1/dimension.proto
  2027. /var/folders/zz/zyxvpxvq6csfxvn_n0000000000000/T/netdata-updater-XXXXXXXXXX.915Rr8w7/netdata-v1.33.1-78-g9ef13f190/externaldeps/protobuf/src/protoc -I=aclk/aclk-schemas --cpp_out=./aclk/aclk-schemas aclk/aclk-schemas/proto/chart/v1/dimension.proto
  2028. /var/folders/zz/zyxvpxvq6csfxvn_n0000000000000/T/netdata-updater-XXXXXXXXXX.915Rr8w7/netdata-v1.33.1-78-g9ef13f190/externaldeps/protobuf/src/protoc -I=aclk/aclk-schemas --cpp_out=./aclk/aclk-schemas aclk/aclk-schemas/proto/chart/v1/config.proto
  2029. /var/folders/zz/zyxvpxvq6csfxvn_n0000000000000/T/netdata-updater-XXXXXXXXXX.915Rr8w7/netdata-v1.33.1-78-g9ef13f190/externaldeps/protobuf/src/protoc -I=aclk/aclk-schemas --cpp_out=./aclk/aclk-schemas aclk/aclk-schemas/proto/chart/v1/config.proto
  2030. /var/folders/zz/zyxvpxvq6csfxvn_n0000000000000/T/netdata-updater-XXXXXXXXXX.915Rr8w7/netdata-v1.33.1-78-g9ef13f190/externaldeps/protobuf/src/protoc -I=aclk/aclk-schemas --cpp_out=./aclk/aclk-schemas aclk/aclk-schemas/proto/aclk/v1/lib.proto
  2031. /var/folders/zz/zyxvpxvq6csfxvn_n0000000000000/T/netdata-updater-XXXXXXXXXX.915Rr8w7/netdata-v1.33.1-78-g9ef13f190/externaldeps/protobuf/src/protoc -I=aclk/aclk-schemas --cpp_out=./aclk/aclk-schemas aclk/aclk-schemas/proto/aclk/v1/lib.proto
  2032. /var/folders/zz/zyxvpxvq6csfxvn_n0000000000000/T/netdata-updater-XXXXXXXXXX.915Rr8w7/netdata-v1.33.1-78-g9ef13f190/externaldeps/protobuf/src/protoc -I=aclk/aclk-schemas --cpp_out=./aclk/aclk-schemas aclk/aclk-schemas/proto/agent/v1/disconnect.proto
  2033. /var/folders/zz/zyxvpxvq6csfxvn_n0000000000000/T/netdata-updater-XXXXXXXXXX.915Rr8w7/netdata-v1.33.1-78-g9ef13f190/externaldeps/protobuf/src/protoc -I=aclk/aclk-schemas --cpp_out=./aclk/aclk-schemas aclk/aclk-schemas/proto/agent/v1/disconnect.proto
  2034. /var/folders/zz/zyxvpxvq6csfxvn_n0000000000000/T/netdata-updater-XXXXXXXXXX.915Rr8w7/netdata-v1.33.1-78-g9ef13f190/externaldeps/protobuf/src/protoc -I=aclk/aclk-schemas --cpp_out=./aclk/aclk-schemas aclk/aclk-schemas/proto/alarm/v1/config.proto
  2035. /var/folders/zz/zyxvpxvq6csfxvn_n0000000000000/T/netdata-updater-XXXXXXXXXX.915Rr8w7/netdata-v1.33.1-78-g9ef13f190/externaldeps/protobuf/src/protoc -I=aclk/aclk-schemas --cpp_out=./aclk/aclk-schemas aclk/aclk-schemas/proto/alarm/v1/config.proto
  2036. /var/folders/zz/zyxvpxvq6csfxvn_n0000000000000/T/netdata-updater-XXXXXXXXXX.915Rr8w7/netdata-v1.33.1-78-g9ef13f190/externaldeps/protobuf/src/protoc -I=aclk/aclk-schemas --cpp_out=./aclk/aclk-schemas aclk/aclk-schemas/proto/alarm/v1/stream.proto
  2037. /var/folders/zz/zyxvpxvq6csfxvn_n0000000000000/T/netdata-updater-XXXXXXXXXX.915Rr8w7/netdata-v1.33.1-78-g9ef13f190/externaldeps/protobuf/src/protoc -I=aclk/aclk-schemas --cpp_out=./aclk/aclk-schemas aclk/aclk-schemas/proto/alarm/v1/stream.proto
  2038. /var/folders/zz/zyxvpxvq6csfxvn_n0000000000000/T/netdata-updater-XXXXXXXXXX.915Rr8w7/netdata-v1.33.1-78-g9ef13f190/externaldeps/protobuf/src/protoc -I=aclk/aclk-schemas --cpp_out=./aclk/aclk-schemas aclk/aclk-schemas/proto/nodeinstance/info/v1/info.proto
  2039. /var/folders/zz/zyxvpxvq6csfxvn_n0000000000000/T/netdata-updater-XXXXXXXXXX.915Rr8w7/netdata-v1.33.1-78-g9ef13f190/externaldeps/protobuf/src/protoc -I=aclk/aclk-schemas --cpp_out=./aclk/aclk-schemas aclk/aclk-schemas/proto/nodeinstance/info/v1/info.proto
  2040. /Applications/Xcode.app/Contents/Developer/usr/bin/make  all-recursive
  2041. Making all in diagrams
  2042. make[2]: Nothing to be done for `all'.
  2043. Making all in system
  2044. if sed \
  2045.         -e 's#[@]localstatedir_POST@#/usr/local/netdata/var#g' \
  2046.         -e 's#[@]sbindir_POST@#/usr/local/netdata/usr/sbin#g' \
  2047.         -e 's#[@]pluginsdir_POST@#/usr/local/netdata/usr/libexec/netdata/plugins.d#g' \
  2048.         -e 's#[@]configdir_POST@#/usr/local/netdata/etc/netdata#g' \
  2049.         -e 's#[@]libconfigdir_POST@#/usr/local/netdata/usr/lib/netdata/conf.d#g' \
  2050.         -e 's#[@]pkglibexecdir_POST@#/usr/local/netdata/usr/libexec/netdata#g' \
  2051.         -e 's#[@]cachedir_POST@#/usr/local/netdata/var/cache/netdata#g' \
  2052.         -e 's#[@]registrydir_POST@#/usr/local/netdata/var/lib/netdata/registry#g' \
  2053.         -e 's#[@]varlibdir_POST@#/usr/local/netdata/var/lib/netdata#g' \
  2054.         -e 's#[@]webdir_POST@#/usr/local/netdata/usr/share/netdata/web#g' \
  2055.         -e 's#[@]enable_aclk_POST@#yes#g' \
  2056.         -e 's#[@]enable_cloud_POST@#yes#g' \
  2057.         edit-config.in > edit-config.tmp; then \
  2058.         mv "edit-config.tmp" "edit-config"; \
  2059.     else \
  2060.         rm -f "edit-config.tmp"; \
  2061.         false; \
  2062.     fi
  2063. if sed \
  2064.         -e 's#[@]localstatedir_POST@#/usr/local/netdata/var#g' \
  2065.         -e 's#[@]sbindir_POST@#/usr/local/netdata/usr/sbin#g' \
  2066.         -e 's#[@]pluginsdir_POST@#/usr/local/netdata/usr/libexec/netdata/plugins.d#g' \
  2067.         -e 's#[@]configdir_POST@#/usr/local/netdata/etc/netdata#g' \
  2068.         -e 's#[@]libconfigdir_POST@#/usr/local/netdata/usr/lib/netdata/conf.d#g' \
  2069.         -e 's#[@]pkglibexecdir_POST@#/usr/local/netdata/usr/libexec/netdata#g' \
  2070.         -e 's#[@]cachedir_POST@#/usr/local/netdata/var/cache/netdata#g' \
  2071.         -e 's#[@]registrydir_POST@#/usr/local/netdata/var/lib/netdata/registry#g' \
  2072.         -e 's#[@]varlibdir_POST@#/usr/local/netdata/var/lib/netdata#g' \
  2073.         -e 's#[@]webdir_POST@#/usr/local/netdata/usr/share/netdata/web#g' \
  2074.         -e 's#[@]enable_aclk_POST@#yes#g' \
  2075.         -e 's#[@]enable_cloud_POST@#yes#g' \
  2076.         netdata-openrc.in > netdata-openrc.tmp; then \
  2077.         mv "netdata-openrc.tmp" "netdata-openrc"; \
  2078.     else \
  2079.         rm -f "netdata-openrc.tmp"; \
  2080.         false; \
  2081.     fi
  2082. if sed \
  2083.         -e 's#[@]localstatedir_POST@#/usr/local/netdata/var#g' \
  2084.         -e 's#[@]sbindir_POST@#/usr/local/netdata/usr/sbin#g' \
  2085.         -e 's#[@]pluginsdir_POST@#/usr/local/netdata/usr/libexec/netdata/plugins.d#g' \
  2086.         -e 's#[@]configdir_POST@#/usr/local/netdata/etc/netdata#g' \
  2087.         -e 's#[@]libconfigdir_POST@#/usr/local/netdata/usr/lib/netdata/conf.d#g' \
  2088.         -e 's#[@]pkglibexecdir_POST@#/usr/local/netdata/usr/libexec/netdata#g' \
  2089.         -e 's#[@]cachedir_POST@#/usr/local/netdata/var/cache/netdata#g' \
  2090.         -e 's#[@]registrydir_POST@#/usr/local/netdata/var/lib/netdata/registry#g' \
  2091.         -e 's#[@]varlibdir_POST@#/usr/local/netdata/var/lib/netdata#g' \
  2092.         -e 's#[@]webdir_POST@#/usr/local/netdata/usr/share/netdata/web#g' \
  2093.         -e 's#[@]enable_aclk_POST@#yes#g' \
  2094.         -e 's#[@]enable_cloud_POST@#yes#g' \
  2095.         netdata.logrotate.in > netdata.logrotate.tmp; then \
  2096.         mv "netdata.logrotate.tmp" "netdata.logrotate"; \
  2097.     else \
  2098.         rm -f "netdata.logrotate.tmp"; \
  2099.         false; \
  2100.     fi
  2101. if sed \
  2102.         -e 's#[@]localstatedir_POST@#/usr/local/netdata/var#g' \
  2103.         -e 's#[@]sbindir_POST@#/usr/local/netdata/usr/sbin#g' \
  2104.         -e 's#[@]pluginsdir_POST@#/usr/local/netdata/usr/libexec/netdata/plugins.d#g' \
  2105.         -e 's#[@]configdir_POST@#/usr/local/netdata/etc/netdata#g' \
  2106.         -e 's#[@]libconfigdir_POST@#/usr/local/netdata/usr/lib/netdata/conf.d#g' \
  2107.         -e 's#[@]pkglibexecdir_POST@#/usr/local/netdata/usr/libexec/netdata#g' \
  2108.         -e 's#[@]cachedir_POST@#/usr/local/netdata/var/cache/netdata#g' \
  2109.         -e 's#[@]registrydir_POST@#/usr/local/netdata/var/lib/netdata/registry#g' \
  2110.         -e 's#[@]varlibdir_POST@#/usr/local/netdata/var/lib/netdata#g' \
  2111.         -e 's#[@]webdir_POST@#/usr/local/netdata/usr/share/netdata/web#g' \
  2112.         -e 's#[@]enable_aclk_POST@#yes#g' \
  2113.         -e 's#[@]enable_cloud_POST@#yes#g' \
  2114.         netdata.service.in > netdata.service.tmp; then \
  2115.         mv "netdata.service.tmp" "netdata.service"; \
  2116.     else \
  2117.         rm -f "netdata.service.tmp"; \
  2118.         false; \
  2119.     fi
  2120. if sed \
  2121.         -e 's#[@]localstatedir_POST@#/usr/local/netdata/var#g' \
  2122.         -e 's#[@]sbindir_POST@#/usr/local/netdata/usr/sbin#g' \
  2123.         -e 's#[@]pluginsdir_POST@#/usr/local/netdata/usr/libexec/netdata/plugins.d#g' \
  2124.         -e 's#[@]configdir_POST@#/usr/local/netdata/etc/netdata#g' \
  2125.         -e 's#[@]libconfigdir_POST@#/usr/local/netdata/usr/lib/netdata/conf.d#g' \
  2126.         -e 's#[@]pkglibexecdir_POST@#/usr/local/netdata/usr/libexec/netdata#g' \
  2127.         -e 's#[@]cachedir_POST@#/usr/local/netdata/var/cache/netdata#g' \
  2128.         -e 's#[@]registrydir_POST@#/usr/local/netdata/var/lib/netdata/registry#g' \
  2129.         -e 's#[@]varlibdir_POST@#/usr/local/netdata/var/lib/netdata#g' \
  2130.         -e 's#[@]webdir_POST@#/usr/local/netdata/usr/share/netdata/web#g' \
  2131.         -e 's#[@]enable_aclk_POST@#yes#g' \
  2132.         -e 's#[@]enable_cloud_POST@#yes#g' \
  2133.         netdata.service.v235.in > netdata.service.v235.tmp; then \
  2134.         mv "netdata.service.v235.tmp" "netdata.service.v235"; \
  2135.     else \
  2136.         rm -f "netdata.service.v235.tmp"; \
  2137.         false; \
  2138.     fi
  2139. if sed \
  2140.         -e 's#[@]localstatedir_POST@#/usr/local/netdata/var#g' \
  2141.         -e 's#[@]sbindir_POST@#/usr/local/netdata/usr/sbin#g' \
  2142.         -e 's#[@]pluginsdir_POST@#/usr/local/netdata/usr/libexec/netdata/plugins.d#g' \
  2143.         -e 's#[@]configdir_POST@#/usr/local/netdata/etc/netdata#g' \
  2144.         -e 's#[@]libconfigdir_POST@#/usr/local/netdata/usr/lib/netdata/conf.d#g' \
  2145.         -e 's#[@]pkglibexecdir_POST@#/usr/local/netdata/usr/libexec/netdata#g' \
  2146.         -e 's#[@]cachedir_POST@#/usr/local/netdata/var/cache/netdata#g' \
  2147.         -e 's#[@]registrydir_POST@#/usr/local/netdata/var/lib/netdata/registry#g' \
  2148.         -e 's#[@]varlibdir_POST@#/usr/local/netdata/var/lib/netdata#g' \
  2149.         -e 's#[@]webdir_POST@#/usr/local/netdata/usr/share/netdata/web#g' \
  2150.         -e 's#[@]enable_aclk_POST@#yes#g' \
  2151.         -e 's#[@]enable_cloud_POST@#yes#g' \
  2152.         netdata-init-d.in > netdata-init-d.tmp; then \
  2153.         mv "netdata-init-d.tmp" "netdata-init-d"; \
  2154.     else \
  2155.         rm -f "netdata-init-d.tmp"; \
  2156.         false; \
  2157.     fi
  2158. if sed \
  2159.         -e 's#[@]localstatedir_POST@#/usr/local/netdata/var#g' \
  2160.         -e 's#[@]sbindir_POST@#/usr/local/netdata/usr/sbin#g' \
  2161.         -e 's#[@]pluginsdir_POST@#/usr/local/netdata/usr/libexec/netdata/plugins.d#g' \
  2162.         -e 's#[@]configdir_POST@#/usr/local/netdata/etc/netdata#g' \
  2163.         -e 's#[@]libconfigdir_POST@#/usr/local/netdata/usr/lib/netdata/conf.d#g' \
  2164.         -e 's#[@]pkglibexecdir_POST@#/usr/local/netdata/usr/libexec/netdata#g' \
  2165.         -e 's#[@]cachedir_POST@#/usr/local/netdata/var/cache/netdata#g' \
  2166.         -e 's#[@]registrydir_POST@#/usr/local/netdata/var/lib/netdata/registry#g' \
  2167.         -e 's#[@]varlibdir_POST@#/usr/local/netdata/var/lib/netdata#g' \
  2168.         -e 's#[@]webdir_POST@#/usr/local/netdata/usr/share/netdata/web#g' \
  2169.         -e 's#[@]enable_aclk_POST@#yes#g' \
  2170.         -e 's#[@]enable_cloud_POST@#yes#g' \
  2171.         netdata-lsb.in > netdata-lsb.tmp; then \
  2172.         mv "netdata-lsb.tmp" "netdata-lsb"; \
  2173.     else \
  2174.         rm -f "netdata-lsb.tmp"; \
  2175.         false; \
  2176.     fi
  2177. if sed \
  2178.         -e 's#[@]localstatedir_POST@#/usr/local/netdata/var#g' \
  2179.         -e 's#[@]sbindir_POST@#/usr/local/netdata/usr/sbin#g' \
  2180.         -e 's#[@]pluginsdir_POST@#/usr/local/netdata/usr/libexec/netdata/plugins.d#g' \
  2181.         -e 's#[@]configdir_POST@#/usr/local/netdata/etc/netdata#g' \
  2182.         -e 's#[@]libconfigdir_POST@#/usr/local/netdata/usr/lib/netdata/conf.d#g' \
  2183.         -e 's#[@]pkglibexecdir_POST@#/usr/local/netdata/usr/libexec/netdata#g' \
  2184.         -e 's#[@]cachedir_POST@#/usr/local/netdata/var/cache/netdata#g' \
  2185.         -e 's#[@]registrydir_POST@#/usr/local/netdata/var/lib/netdata/registry#g' \
  2186.         -e 's#[@]varlibdir_POST@#/usr/local/netdata/var/lib/netdata#g' \
  2187.         -e 's#[@]webdir_POST@#/usr/local/netdata/usr/share/netdata/web#g' \
  2188.         -e 's#[@]enable_aclk_POST@#yes#g' \
  2189.         -e 's#[@]enable_cloud_POST@#yes#g' \
  2190.         netdata-freebsd.in > netdata-freebsd.tmp; then \
  2191.         mv "netdata-freebsd.tmp" "netdata-freebsd"; \
  2192.     else \
  2193.         rm -f "netdata-freebsd.tmp"; \
  2194.         false; \
  2195.     fi
  2196. if sed \
  2197.         -e 's#[@]localstatedir_POST@#/usr/local/netdata/var#g' \
  2198.         -e 's#[@]sbindir_POST@#/usr/local/netdata/usr/sbin#g' \
  2199.         -e 's#[@]pluginsdir_POST@#/usr/local/netdata/usr/libexec/netdata/plugins.d#g' \
  2200.         -e 's#[@]configdir_POST@#/usr/local/netdata/etc/netdata#g' \
  2201.         -e 's#[@]libconfigdir_POST@#/usr/local/netdata/usr/lib/netdata/conf.d#g' \
  2202.         -e 's#[@]pkglibexecdir_POST@#/usr/local/netdata/usr/libexec/netdata#g' \
  2203.         -e 's#[@]cachedir_POST@#/usr/local/netdata/var/cache/netdata#g' \
  2204.         -e 's#[@]registrydir_POST@#/usr/local/netdata/var/lib/netdata/registry#g' \
  2205.         -e 's#[@]varlibdir_POST@#/usr/local/netdata/var/lib/netdata#g' \
  2206.         -e 's#[@]webdir_POST@#/usr/local/netdata/usr/share/netdata/web#g' \
  2207.         -e 's#[@]enable_aclk_POST@#yes#g' \
  2208.         -e 's#[@]enable_cloud_POST@#yes#g' \
  2209.         netdata.plist.in > netdata.plist.tmp; then \
  2210.         mv "netdata.plist.tmp" "netdata.plist"; \
  2211.     else \
  2212.         rm -f "netdata.plist.tmp"; \
  2213.         false; \
  2214.     fi
  2215. if sed \
  2216.         -e 's#[@]localstatedir_POST@#/usr/local/netdata/var#g' \
  2217.         -e 's#[@]sbindir_POST@#/usr/local/netdata/usr/sbin#g' \
  2218.         -e 's#[@]pluginsdir_POST@#/usr/local/netdata/usr/libexec/netdata/plugins.d#g' \
  2219.         -e 's#[@]configdir_POST@#/usr/local/netdata/etc/netdata#g' \
  2220.         -e 's#[@]libconfigdir_POST@#/usr/local/netdata/usr/lib/netdata/conf.d#g' \
  2221.         -e 's#[@]pkglibexecdir_POST@#/usr/local/netdata/usr/libexec/netdata#g' \
  2222.         -e 's#[@]cachedir_POST@#/usr/local/netdata/var/cache/netdata#g' \
  2223.         -e 's#[@]registrydir_POST@#/usr/local/netdata/var/lib/netdata/registry#g' \
  2224.         -e 's#[@]varlibdir_POST@#/usr/local/netdata/var/lib/netdata#g' \
  2225.         -e 's#[@]webdir_POST@#/usr/local/netdata/usr/share/netdata/web#g' \
  2226.         -e 's#[@]enable_aclk_POST@#yes#g' \
  2227.         -e 's#[@]enable_cloud_POST@#yes#g' \
  2228.         netdata.crontab.in > netdata.crontab.tmp; then \
  2229.         mv "netdata.crontab.tmp" "netdata.crontab"; \
  2230.     else \
  2231.         rm -f "netdata.crontab.tmp"; \
  2232.         false; \
  2233.     fi
  2234. if sed \
  2235.         -e 's#[@]localstatedir_POST@#/usr/local/netdata/var#g' \
  2236.         -e 's#[@]sbindir_POST@#/usr/local/netdata/usr/sbin#g' \
  2237.         -e 's#[@]pluginsdir_POST@#/usr/local/netdata/usr/libexec/netdata/plugins.d#g' \
  2238.         -e 's#[@]configdir_POST@#/usr/local/netdata/etc/netdata#g' \
  2239.         -e 's#[@]libconfigdir_POST@#/usr/local/netdata/usr/lib/netdata/conf.d#g' \
  2240.         -e 's#[@]pkglibexecdir_POST@#/usr/local/netdata/usr/libexec/netdata#g' \
  2241.         -e 's#[@]cachedir_POST@#/usr/local/netdata/var/cache/netdata#g' \
  2242.         -e 's#[@]registrydir_POST@#/usr/local/netdata/var/lib/netdata/registry#g' \
  2243.         -e 's#[@]varlibdir_POST@#/usr/local/netdata/var/lib/netdata#g' \
  2244.         -e 's#[@]webdir_POST@#/usr/local/netdata/usr/share/netdata/web#g' \
  2245.         -e 's#[@]enable_aclk_POST@#yes#g' \
  2246.         -e 's#[@]enable_cloud_POST@#yes#g' \
  2247.         netdata-updater.service.in > netdata-updater.service.tmp; then \
  2248.         mv "netdata-updater.service.tmp" "netdata-updater.service"; \
  2249.     else \
  2250.         rm -f "netdata-updater.service.tmp"; \
  2251.         false; \
  2252.     fi
  2253. Making all in tests
  2254. if sed \
  2255.         -e 's#[@]localstatedir_POST@#/usr/local/netdata/var#g' \
  2256.         -e 's#[@]sbindir_POST@#/usr/local/netdata/usr/sbin#g' \
  2257.         -e 's#[@]pluginsdir_POST@#/usr/local/netdata/usr/libexec/netdata/plugins.d#g' \
  2258.         -e 's#[@]configdir_POST@#/usr/local/netdata/etc/netdata#g' \
  2259.         -e 's#[@]libconfigdir_POST@#/usr/local/netdata/usr/lib/netdata/conf.d#g' \
  2260.         -e 's#[@]pkglibexecdir_POST@#/usr/local/netdata/usr/libexec/netdata#g' \
  2261.         -e 's#[@]cachedir_POST@#/usr/local/netdata/var/cache/netdata#g' \
  2262.         -e 's#[@]registrydir_POST@#/usr/local/netdata/var/lib/netdata/registry#g' \
  2263.         -e 's#[@]varlibdir_POST@#/usr/local/netdata/var/lib/netdata#g' \
  2264.         -e 's#[@]webdir_POST@#/usr/local/netdata/usr/share/netdata/web#g' \
  2265.         -e 's#[@]enable_aclk_POST@#yes#g' \
  2266.         -e 's#[@]enable_cloud_POST@#yes#g' \
  2267.         health_mgmtapi/health-cmdapi-test.sh.in > health_mgmtapi/health-cmdapi-test.sh.tmp; then \
  2268.         mv "health_mgmtapi/health-cmdapi-test.sh.tmp" "health_mgmtapi/health-cmdapi-test.sh"; \
  2269.     else \
  2270.         rm -f "health_mgmtapi/health-cmdapi-test.sh.tmp"; \
  2271.         false; \
  2272.     fi
  2273. if sed \
  2274.         -e 's#[@]localstatedir_POST@#/usr/local/netdata/var#g' \
  2275.         -e 's#[@]sbindir_POST@#/usr/local/netdata/usr/sbin#g' \
  2276.         -e 's#[@]pluginsdir_POST@#/usr/local/netdata/usr/libexec/netdata/plugins.d#g' \
  2277.         -e 's#[@]configdir_POST@#/usr/local/netdata/etc/netdata#g' \
  2278.         -e 's#[@]libconfigdir_POST@#/usr/local/netdata/usr/lib/netdata/conf.d#g' \
  2279.         -e 's#[@]pkglibexecdir_POST@#/usr/local/netdata/usr/libexec/netdata#g' \
  2280.         -e 's#[@]cachedir_POST@#/usr/local/netdata/var/cache/netdata#g' \
  2281.         -e 's#[@]registrydir_POST@#/usr/local/netdata/var/lib/netdata/registry#g' \
  2282.         -e 's#[@]varlibdir_POST@#/usr/local/netdata/var/lib/netdata#g' \
  2283.         -e 's#[@]webdir_POST@#/usr/local/netdata/usr/share/netdata/web#g' \
  2284.         -e 's#[@]enable_aclk_POST@#yes#g' \
  2285.         -e 's#[@]enable_cloud_POST@#yes#g' \
  2286.         acls/acl.sh.in > acls/acl.sh.tmp; then \
  2287.         mv "acls/acl.sh.tmp" "acls/acl.sh"; \
  2288.     else \
  2289.         rm -f "acls/acl.sh.tmp"; \
  2290.         false; \
  2291.     fi
  2292. if sed \
  2293.         -e 's#[@]localstatedir_POST@#/usr/local/netdata/var#g' \
  2294.         -e 's#[@]sbindir_POST@#/usr/local/netdata/usr/sbin#g' \
  2295.         -e 's#[@]pluginsdir_POST@#/usr/local/netdata/usr/libexec/netdata/plugins.d#g' \
  2296.         -e 's#[@]configdir_POST@#/usr/local/netdata/etc/netdata#g' \
  2297.         -e 's#[@]libconfigdir_POST@#/usr/local/netdata/usr/lib/netdata/conf.d#g' \
  2298.         -e 's#[@]pkglibexecdir_POST@#/usr/local/netdata/usr/libexec/netdata#g' \
  2299.         -e 's#[@]cachedir_POST@#/usr/local/netdata/var/cache/netdata#g' \
  2300.         -e 's#[@]registrydir_POST@#/usr/local/netdata/var/lib/netdata/registry#g' \
  2301.         -e 's#[@]varlibdir_POST@#/usr/local/netdata/var/lib/netdata#g' \
  2302.         -e 's#[@]webdir_POST@#/usr/local/netdata/usr/share/netdata/web#g' \
  2303.         -e 's#[@]enable_aclk_POST@#yes#g' \
  2304.         -e 's#[@]enable_cloud_POST@#yes#g' \
  2305.         urls/request.sh.in > urls/request.sh.tmp; then \
  2306.         mv "urls/request.sh.tmp" "urls/request.sh"; \
  2307.     else \
  2308.         rm -f "urls/request.sh.tmp"; \
  2309.         false; \
  2310.     fi
  2311. if sed \
  2312.         -e 's#[@]localstatedir_POST@#/usr/local/netdata/var#g' \
  2313.         -e 's#[@]sbindir_POST@#/usr/local/netdata/usr/sbin#g' \
  2314.         -e 's#[@]pluginsdir_POST@#/usr/local/netdata/usr/libexec/netdata/plugins.d#g' \
  2315.         -e 's#[@]configdir_POST@#/usr/local/netdata/etc/netdata#g' \
  2316.         -e 's#[@]libconfigdir_POST@#/usr/local/netdata/usr/lib/netdata/conf.d#g' \
  2317.         -e 's#[@]pkglibexecdir_POST@#/usr/local/netdata/usr/libexec/netdata#g' \
  2318.         -e 's#[@]cachedir_POST@#/usr/local/netdata/var/cache/netdata#g' \
  2319.         -e 's#[@]registrydir_POST@#/usr/local/netdata/var/lib/netdata/registry#g' \
  2320.         -e 's#[@]varlibdir_POST@#/usr/local/netdata/var/lib/netdata#g' \
  2321.         -e 's#[@]webdir_POST@#/usr/local/netdata/usr/share/netdata/web#g' \
  2322.         -e 's#[@]enable_aclk_POST@#yes#g' \
  2323.         -e 's#[@]enable_cloud_POST@#yes#g' \
  2324.         alarm_repetition/alarm.sh.in > alarm_repetition/alarm.sh.tmp; then \
  2325.         mv "alarm_repetition/alarm.sh.tmp" "alarm_repetition/alarm.sh"; \
  2326.     else \
  2327.         rm -f "alarm_repetition/alarm.sh.tmp"; \
  2328.         false; \
  2329.     fi
  2330. if sed \
  2331.         -e 's#[@]localstatedir_POST@#/usr/local/netdata/var#g' \
  2332.         -e 's#[@]sbindir_POST@#/usr/local/netdata/usr/sbin#g' \
  2333.         -e 's#[@]pluginsdir_POST@#/usr/local/netdata/usr/libexec/netdata/plugins.d#g' \
  2334.         -e 's#[@]configdir_POST@#/usr/local/netdata/etc/netdata#g' \
  2335.         -e 's#[@]libconfigdir_POST@#/usr/local/netdata/usr/lib/netdata/conf.d#g' \
  2336.         -e 's#[@]pkglibexecdir_POST@#/usr/local/netdata/usr/libexec/netdata#g' \
  2337.         -e 's#[@]cachedir_POST@#/usr/local/netdata/var/cache/netdata#g' \
  2338.         -e 's#[@]registrydir_POST@#/usr/local/netdata/var/lib/netdata/registry#g' \
  2339.         -e 's#[@]varlibdir_POST@#/usr/local/netdata/var/lib/netdata#g' \
  2340.         -e 's#[@]webdir_POST@#/usr/local/netdata/usr/share/netdata/web#g' \
  2341.         -e 's#[@]enable_aclk_POST@#yes#g' \
  2342.         -e 's#[@]enable_cloud_POST@#yes#g' \
  2343.         template_dimension/template_dim.sh.in > template_dimension/template_dim.sh.tmp; then \
  2344.         mv "template_dimension/template_dim.sh.tmp" "template_dimension/template_dim.sh"; \
  2345.     else \
  2346.         rm -f "template_dimension/template_dim.sh.tmp"; \
  2347.         false; \
  2348.     fi
  2349. Making all in backends
  2350. Making all in graphite
  2351. make[3]: Nothing to be done for `all'.
  2352. Making all in json
  2353. make[3]: Nothing to be done for `all'.
  2354. Making all in opentsdb
  2355. make[3]: Nothing to be done for `all'.
  2356. Making all in prometheus
  2357. Making all in remote_write
  2358. make[4]: Nothing to be done for `all'.
  2359. make[4]: Nothing to be done for `all-am'.
  2360. Making all in aws_kinesis
  2361. make[3]: Nothing to be done for `all'.
  2362. Making all in mongodb
  2363. make[3]: Nothing to be done for `all'.
  2364. make[3]: Nothing to be done for `all-am'.
  2365. Making all in collectors
  2366. Making all in plugins.d
  2367. make[4]: Nothing to be done for `all-am'.
  2368. Making all in apps.plugin
  2369. make[3]: Nothing to be done for `all'.
  2370. Making all in cgroups.plugin
  2371. if sed \
  2372.         -e 's#[@]localstatedir_POST@#/usr/local/netdata/var#g' \
  2373.         -e 's#[@]sbindir_POST@#/usr/local/netdata/usr/sbin#g' \
  2374.         -e 's#[@]pluginsdir_POST@#/usr/local/netdata/usr/libexec/netdata/plugins.d#g' \
  2375.         -e 's#[@]configdir_POST@#/usr/local/netdata/etc/netdata#g' \
  2376.         -e 's#[@]libconfigdir_POST@#/usr/local/netdata/usr/lib/netdata/conf.d#g' \
  2377.         -e 's#[@]pkglibexecdir_POST@#/usr/local/netdata/usr/libexec/netdata#g' \
  2378.         -e 's#[@]cachedir_POST@#/usr/local/netdata/var/cache/netdata#g' \
  2379.         -e 's#[@]registrydir_POST@#/usr/local/netdata/var/lib/netdata/registry#g' \
  2380.         -e 's#[@]varlibdir_POST@#/usr/local/netdata/var/lib/netdata#g' \
  2381.         -e 's#[@]webdir_POST@#/usr/local/netdata/usr/share/netdata/web#g' \
  2382.         -e 's#[@]enable_aclk_POST@#yes#g' \
  2383.         -e 's#[@]enable_cloud_POST@#yes#g' \
  2384.         cgroup-name.sh.in > cgroup-name.sh.tmp; then \
  2385.         mv "cgroup-name.sh.tmp" "cgroup-name.sh"; \
  2386.     else \
  2387.         rm -f "cgroup-name.sh.tmp"; \
  2388.         false; \
  2389.     fi
  2390. Making all in charts.d.plugin
  2391. if sed \
  2392.         -e 's#[@]localstatedir_POST@#/usr/local/netdata/var#g' \
  2393.         -e 's#[@]sbindir_POST@#/usr/local/netdata/usr/sbin#g' \
  2394.         -e 's#[@]pluginsdir_POST@#/usr/local/netdata/usr/libexec/netdata/plugins.d#g' \
  2395.         -e 's#[@]configdir_POST@#/usr/local/netdata/etc/netdata#g' \
  2396.         -e 's#[@]libconfigdir_POST@#/usr/local/netdata/usr/lib/netdata/conf.d#g' \
  2397.         -e 's#[@]pkglibexecdir_POST@#/usr/local/netdata/usr/libexec/netdata#g' \
  2398.         -e 's#[@]cachedir_POST@#/usr/local/netdata/var/cache/netdata#g' \
  2399.         -e 's#[@]registrydir_POST@#/usr/local/netdata/var/lib/netdata/registry#g' \
  2400.         -e 's#[@]varlibdir_POST@#/usr/local/netdata/var/lib/netdata#g' \
  2401.         -e 's#[@]webdir_POST@#/usr/local/netdata/usr/share/netdata/web#g' \
  2402.         -e 's#[@]enable_aclk_POST@#yes#g' \
  2403.         -e 's#[@]enable_cloud_POST@#yes#g' \
  2404.         charts.d.plugin.in > charts.d.plugin.tmp; then \
  2405.         mv "charts.d.plugin.tmp" "charts.d.plugin"; \
  2406.     else \
  2407.         rm -f "charts.d.plugin.tmp"; \
  2408.         false; \
  2409.     fi
  2410. Making all in checks.plugin
  2411. make[3]: Nothing to be done for `all'.
  2412. Making all in cups.plugin
  2413. make[3]: Nothing to be done for `all'.
  2414. Making all in diskspace.plugin
  2415. make[3]: Nothing to be done for `all'.
  2416. Making all in timex.plugin
  2417. make[3]: Nothing to be done for `all'.
  2418. Making all in fping.plugin
  2419. if sed \
  2420.         -e 's#[@]localstatedir_POST@#/usr/local/netdata/var#g' \
  2421.         -e 's#[@]sbindir_POST@#/usr/local/netdata/usr/sbin#g' \
  2422.         -e 's#[@]pluginsdir_POST@#/usr/local/netdata/usr/libexec/netdata/plugins.d#g' \
  2423.         -e 's#[@]configdir_POST@#/usr/local/netdata/etc/netdata#g' \
  2424.         -e 's#[@]libconfigdir_POST@#/usr/local/netdata/usr/lib/netdata/conf.d#g' \
  2425.         -e 's#[@]pkglibexecdir_POST@#/usr/local/netdata/usr/libexec/netdata#g' \
  2426.         -e 's#[@]cachedir_POST@#/usr/local/netdata/var/cache/netdata#g' \
  2427.         -e 's#[@]registrydir_POST@#/usr/local/netdata/var/lib/netdata/registry#g' \
  2428.         -e 's#[@]varlibdir_POST@#/usr/local/netdata/var/lib/netdata#g' \
  2429.         -e 's#[@]webdir_POST@#/usr/local/netdata/usr/share/netdata/web#g' \
  2430.         -e 's#[@]enable_aclk_POST@#yes#g' \
  2431.         -e 's#[@]enable_cloud_POST@#yes#g' \
  2432.         fping.plugin.in > fping.plugin.tmp; then \
  2433.         mv "fping.plugin.tmp" "fping.plugin"; \
  2434.     else \
  2435.         rm -f "fping.plugin.tmp"; \
  2436.         false; \
  2437.     fi
  2438. Making all in ioping.plugin
  2439. if sed \
  2440.         -e 's#[@]localstatedir_POST@#/usr/local/netdata/var#g' \
  2441.         -e 's#[@]sbindir_POST@#/usr/local/netdata/usr/sbin#g' \
  2442.         -e 's#[@]pluginsdir_POST@#/usr/local/netdata/usr/libexec/netdata/plugins.d#g' \
  2443.         -e 's#[@]configdir_POST@#/usr/local/netdata/etc/netdata#g' \
  2444.         -e 's#[@]libconfigdir_POST@#/usr/local/netdata/usr/lib/netdata/conf.d#g' \
  2445.         -e 's#[@]pkglibexecdir_POST@#/usr/local/netdata/usr/libexec/netdata#g' \
  2446.         -e 's#[@]cachedir_POST@#/usr/local/netdata/var/cache/netdata#g' \
  2447.         -e 's#[@]registrydir_POST@#/usr/local/netdata/var/lib/netdata/registry#g' \
  2448.         -e 's#[@]varlibdir_POST@#/usr/local/netdata/var/lib/netdata#g' \
  2449.         -e 's#[@]webdir_POST@#/usr/local/netdata/usr/share/netdata/web#g' \
  2450.         -e 's#[@]enable_aclk_POST@#yes#g' \
  2451.         -e 's#[@]enable_cloud_POST@#yes#g' \
  2452.         ioping.plugin.in > ioping.plugin.tmp; then \
  2453.         mv "ioping.plugin.tmp" "ioping.plugin"; \
  2454.     else \
  2455.         rm -f "ioping.plugin.tmp"; \
  2456.         false; \
  2457.     fi
  2458. Making all in freebsd.plugin
  2459. make[3]: Nothing to be done for `all'.
  2460. Making all in freeipmi.plugin
  2461. make[3]: Nothing to be done for `all'.
  2462. Making all in idlejitter.plugin
  2463. make[3]: Nothing to be done for `all'.
  2464. Making all in macos.plugin
  2465. make[3]: Nothing to be done for `all'.
  2466. Making all in nfacct.plugin
  2467. make[3]: Nothing to be done for `all'.
  2468. Making all in xenstat.plugin
  2469. make[3]: Nothing to be done for `all'.
  2470. Making all in perf.plugin
  2471. make[3]: Nothing to be done for `all'.
  2472. Making all in node.d.plugin
  2473. if sed \
  2474.         -e 's#[@]localstatedir_POST@#/usr/local/netdata/var#g' \
  2475.         -e 's#[@]sbindir_POST@#/usr/local/netdata/usr/sbin#g' \
  2476.         -e 's#[@]pluginsdir_POST@#/usr/local/netdata/usr/libexec/netdata/plugins.d#g' \
  2477.         -e 's#[@]configdir_POST@#/usr/local/netdata/etc/netdata#g' \
  2478.         -e 's#[@]libconfigdir_POST@#/usr/local/netdata/usr/lib/netdata/conf.d#g' \
  2479.         -e 's#[@]pkglibexecdir_POST@#/usr/local/netdata/usr/libexec/netdata#g' \
  2480.         -e 's#[@]cachedir_POST@#/usr/local/netdata/var/cache/netdata#g' \
  2481.         -e 's#[@]registrydir_POST@#/usr/local/netdata/var/lib/netdata/registry#g' \
  2482.         -e 's#[@]varlibdir_POST@#/usr/local/netdata/var/lib/netdata#g' \
  2483.         -e 's#[@]webdir_POST@#/usr/local/netdata/usr/share/netdata/web#g' \
  2484.         -e 's#[@]enable_aclk_POST@#yes#g' \
  2485.         -e 's#[@]enable_cloud_POST@#yes#g' \
  2486.         node.d.plugin.in > node.d.plugin.tmp; then \
  2487.         mv "node.d.plugin.tmp" "node.d.plugin"; \
  2488.     else \
  2489.         rm -f "node.d.plugin.tmp"; \
  2490.         false; \
  2491.     fi
  2492. Making all in proc.plugin
  2493. make[3]: Nothing to be done for `all'.
  2494. Making all in python.d.plugin
  2495. if sed \
  2496.         -e 's#[@]localstatedir_POST@#/usr/local/netdata/var#g' \
  2497.         -e 's#[@]sbindir_POST@#/usr/local/netdata/usr/sbin#g' \
  2498.         -e 's#[@]pluginsdir_POST@#/usr/local/netdata/usr/libexec/netdata/plugins.d#g' \
  2499.         -e 's#[@]configdir_POST@#/usr/local/netdata/etc/netdata#g' \
  2500.         -e 's#[@]libconfigdir_POST@#/usr/local/netdata/usr/lib/netdata/conf.d#g' \
  2501.         -e 's#[@]pkglibexecdir_POST@#/usr/local/netdata/usr/libexec/netdata#g' \
  2502.         -e 's#[@]cachedir_POST@#/usr/local/netdata/var/cache/netdata#g' \
  2503.         -e 's#[@]registrydir_POST@#/usr/local/netdata/var/lib/netdata/registry#g' \
  2504.         -e 's#[@]varlibdir_POST@#/usr/local/netdata/var/lib/netdata#g' \
  2505.         -e 's#[@]webdir_POST@#/usr/local/netdata/usr/share/netdata/web#g' \
  2506.         -e 's#[@]enable_aclk_POST@#yes#g' \
  2507.         -e 's#[@]enable_cloud_POST@#yes#g' \
  2508.         python.d.plugin.in > python.d.plugin.tmp; then \
  2509.         mv "python.d.plugin.tmp" "python.d.plugin"; \
  2510.     else \
  2511.         rm -f "python.d.plugin.tmp"; \
  2512.         false; \
  2513.     fi
  2514. Making all in slabinfo.plugin
  2515. make[3]: Nothing to be done for `all'.
  2516. Making all in statsd.plugin
  2517. make[3]: Nothing to be done for `all'.
  2518. Making all in ebpf.plugin
  2519. make[3]: Nothing to be done for `all'.
  2520. Making all in tc.plugin
  2521. if sed \
  2522.         -e 's#[@]localstatedir_POST@#/usr/local/netdata/var#g' \
  2523.         -e 's#[@]sbindir_POST@#/usr/local/netdata/usr/sbin#g' \
  2524.         -e 's#[@]pluginsdir_POST@#/usr/local/netdata/usr/libexec/netdata/plugins.d#g' \
  2525.         -e 's#[@]configdir_POST@#/usr/local/netdata/etc/netdata#g' \
  2526.         -e 's#[@]libconfigdir_POST@#/usr/local/netdata/usr/lib/netdata/conf.d#g' \
  2527.         -e 's#[@]pkglibexecdir_POST@#/usr/local/netdata/usr/libexec/netdata#g' \
  2528.         -e 's#[@]cachedir_POST@#/usr/local/netdata/var/cache/netdata#g' \
  2529.         -e 's#[@]registrydir_POST@#/usr/local/netdata/var/lib/netdata/registry#g' \
  2530.         -e 's#[@]varlibdir_POST@#/usr/local/netdata/var/lib/netdata#g' \
  2531.         -e 's#[@]webdir_POST@#/usr/local/netdata/usr/share/netdata/web#g' \
  2532.         -e 's#[@]enable_aclk_POST@#yes#g' \
  2533.         -e 's#[@]enable_cloud_POST@#yes#g' \
  2534.         tc-qos-helper.sh.in > tc-qos-helper.sh.tmp; then \
  2535.         mv "tc-qos-helper.sh.tmp" "tc-qos-helper.sh"; \
  2536.     else \
  2537.         rm -f "tc-qos-helper.sh.tmp"; \
  2538.         false; \
  2539.     fi
  2540. make[3]: Nothing to be done for `all-am'.
  2541. Making all in daemon
  2542. if sed \
  2543.         -e 's#[@]localstatedir_POST@#/usr/local/netdata/var#g' \
  2544.         -e 's#[@]sbindir_POST@#/usr/local/netdata/usr/sbin#g' \
  2545.         -e 's#[@]pluginsdir_POST@#/usr/local/netdata/usr/libexec/netdata/plugins.d#g' \
  2546.         -e 's#[@]configdir_POST@#/usr/local/netdata/etc/netdata#g' \
  2547.         -e 's#[@]libconfigdir_POST@#/usr/local/netdata/usr/lib/netdata/conf.d#g' \
  2548.         -e 's#[@]pkglibexecdir_POST@#/usr/local/netdata/usr/libexec/netdata#g' \
  2549.         -e 's#[@]cachedir_POST@#/usr/local/netdata/var/cache/netdata#g' \
  2550.         -e 's#[@]registrydir_POST@#/usr/local/netdata/var/lib/netdata/registry#g' \
  2551.         -e 's#[@]varlibdir_POST@#/usr/local/netdata/var/lib/netdata#g' \
  2552.         -e 's#[@]webdir_POST@#/usr/local/netdata/usr/share/netdata/web#g' \
  2553.         -e 's#[@]enable_aclk_POST@#yes#g' \
  2554.         -e 's#[@]enable_cloud_POST@#yes#g' \
  2555.         anonymous-statistics.sh.in > anonymous-statistics.sh.tmp; then \
  2556.         mv "anonymous-statistics.sh.tmp" "anonymous-statistics.sh"; \
  2557.     else \
  2558.         rm -f "anonymous-statistics.sh.tmp"; \
  2559.         false; \
  2560.     fi
  2561. Making all in database
  2562. Making all in engine
  2563. Making all in metadata_log
  2564. make[4]: Nothing to be done for `all'.
  2565. make[4]: Nothing to be done for `all-am'.
  2566. make[3]: Nothing to be done for `all-am'.
  2567. Making all in exporting
  2568. Making all in tests
  2569. make[3]: Nothing to be done for `all'.
  2570. Making all in graphite
  2571. make[3]: Nothing to be done for `all'.
  2572. Making all in json
  2573. make[3]: Nothing to be done for `all'.
  2574. Making all in opentsdb
  2575. make[3]: Nothing to be done for `all'.
  2576. Making all in prometheus
  2577. Making all in remote_write
  2578. make[4]: Nothing to be done for `all'.
  2579. make[4]: Nothing to be done for `all-am'.
  2580. Making all in aws_kinesis
  2581. make[3]: Nothing to be done for `all'.
  2582. Making all in pubsub
  2583. make[3]: Nothing to be done for `all'.
  2584. Making all in mongodb
  2585. make[3]: Nothing to be done for `all'.
  2586. make[3]: Nothing to be done for `all-am'.
  2587. Making all in health
  2588. Making all in notifications
  2589. if sed \
  2590.         -e 's#[@]localstatedir_POST@#/usr/local/netdata/var#g' \
  2591.         -e 's#[@]sbindir_POST@#/usr/local/netdata/usr/sbin#g' \
  2592.         -e 's#[@]pluginsdir_POST@#/usr/local/netdata/usr/libexec/netdata/plugins.d#g' \
  2593.         -e 's#[@]configdir_POST@#/usr/local/netdata/etc/netdata#g' \
  2594.         -e 's#[@]libconfigdir_POST@#/usr/local/netdata/usr/lib/netdata/conf.d#g' \
  2595.         -e 's#[@]pkglibexecdir_POST@#/usr/local/netdata/usr/libexec/netdata#g' \
  2596.         -e 's#[@]cachedir_POST@#/usr/local/netdata/var/cache/netdata#g' \
  2597.         -e 's#[@]registrydir_POST@#/usr/local/netdata/var/lib/netdata/registry#g' \
  2598.         -e 's#[@]varlibdir_POST@#/usr/local/netdata/var/lib/netdata#g' \
  2599.         -e 's#[@]webdir_POST@#/usr/local/netdata/usr/share/netdata/web#g' \
  2600.         -e 's#[@]enable_aclk_POST@#yes#g' \
  2601.         -e 's#[@]enable_cloud_POST@#yes#g' \
  2602.         alarm-notify.sh.in > alarm-notify.sh.tmp; then \
  2603.         mv "alarm-notify.sh.tmp" "alarm-notify.sh"; \
  2604.     else \
  2605.         rm -f "alarm-notify.sh.tmp"; \
  2606.         false; \
  2607.     fi
  2608. make[3]: Nothing to be done for `all-am'.
  2609. Making all in libnetdata
  2610. Making all in adaptive_resortable_list
  2611. make[3]: Nothing to be done for `all'.
  2612. Making all in avl
  2613. make[3]: Nothing to be done for `all'.
  2614. Making all in buffer
  2615. make[3]: Nothing to be done for `all'.
  2616. Making all in clocks
  2617. make[3]: Nothing to be done for `all'.
  2618. Making all in completion
  2619. make[3]: Nothing to be done for `all'.
  2620. Making all in config
  2621. make[3]: Nothing to be done for `all'.
  2622. Making all in dictionary
  2623. make[3]: Nothing to be done for `all'.
  2624. Making all in ebpf
  2625. make[3]: Nothing to be done for `all'.
  2626. Making all in eval
  2627. make[3]: Nothing to be done for `all'.
  2628. Making all in json
  2629. make[3]: Nothing to be done for `all'.
  2630. Making all in health
  2631. make[3]: Nothing to be done for `all'.
  2632. Making all in locks
  2633. make[3]: Nothing to be done for `all'.
  2634. Making all in log
  2635. make[3]: Nothing to be done for `all'.
  2636. Making all in popen
  2637. make[3]: Nothing to be done for `all'.
  2638. Making all in procfile
  2639. make[3]: Nothing to be done for `all'.
  2640. Making all in simple_pattern
  2641. make[3]: Nothing to be done for `all'.
  2642. Making all in socket
  2643. make[3]: Nothing to be done for `all'.
  2644. Making all in statistical
  2645. make[3]: Nothing to be done for `all'.
  2646. Making all in storage_number
  2647. Making all in tests
  2648. make[4]: Nothing to be done for `all'.
  2649. make[4]: Nothing to be done for `all-am'.
  2650. Making all in threads
  2651. make[3]: Nothing to be done for `all'.
  2652. Making all in url
  2653. make[3]: Nothing to be done for `all'.
  2654. Making all in tests
  2655. make[3]: Nothing to be done for `all'.
  2656. make[3]: Nothing to be done for `all-am'.
  2657. Making all in registry
  2658. make[2]: Nothing to be done for `all'.
  2659. Making all in streaming
  2660. make[2]: Nothing to be done for `all'.
  2661. Making all in web
  2662. Making all in api
  2663. Making all in badges
  2664. make[4]: Nothing to be done for `all'.
  2665. Making all in queries
  2666. Making all in average
  2667. make[5]: Nothing to be done for `all'.
  2668. Making all in des
  2669. make[5]: Nothing to be done for `all'.
  2670. Making all in incremental_sum
  2671. make[5]: Nothing to be done for `all'.
  2672. Making all in max
  2673. make[5]: Nothing to be done for `all'.
  2674. Making all in min
  2675. make[5]: Nothing to be done for `all'.
  2676. Making all in sum
  2677. make[5]: Nothing to be done for `all'.
  2678. Making all in median
  2679. make[5]: Nothing to be done for `all'.
  2680. Making all in ses
  2681. make[5]: Nothing to be done for `all'.
  2682. Making all in stddev
  2683. make[5]: Nothing to be done for `all'.
  2684. make[5]: Nothing to be done for `all-am'.
  2685. Making all in exporters
  2686. Making all in shell
  2687. make[5]: Nothing to be done for `all'.
  2688. Making all in prometheus
  2689. make[5]: Nothing to be done for `all'.
  2690. make[5]: Nothing to be done for `all-am'.
  2691. Making all in formatters
  2692. Making all in csv
  2693. make[5]: Nothing to be done for `all'.
  2694. Making all in json
  2695. make[5]: Nothing to be done for `all'.
  2696. Making all in ssv
  2697. make[5]: Nothing to be done for `all'.
  2698. Making all in value
  2699. make[5]: Nothing to be done for `all'.
  2700. make[5]: Nothing to be done for `all-am'.
  2701. Making all in health
  2702. make[4]: Nothing to be done for `all'.
  2703. make[4]: Nothing to be done for `all-am'.
  2704. Making all in gui
  2705. Making all in dashboard
  2706. make[4]: Nothing to be done for `all'.
  2707. if test -f dashboard.js; then rm -f dashboard.js; fi
  2708. if test -d "../../.git"; then \
  2709.         git --git-dir="../../.git" log -n 1 --format=%H; \
  2710.     fi > version.txt.tmp
  2711. test -s version.txt.tmp || echo 0 > version.txt.tmp
  2712. cat src/dashboard.js/prologue.js.inc src/dashboard.js/utils.js src/dashboard.js/server-detection.js src/dashboard.js/dependencies.js src/dashboard.js/error-handling.js src/dashboard.js/compatibility.js src/dashboard.js/xss.js src/dashboard.js/colors.js src/dashboard.js/units-conversion.js src/dashboard.js/options.js src/dashboard.js/localstorage.js src/dashboard.js/timeout.js src/dashboard.js/themes.js src/dashboard.js/charting/dygraph.js src/dashboard.js/charting/sparkline.js src/dashboard.js/charting/google-charts.js src/dashboard.js/charting/gauge.js src/dashboard.js/charting/easy-pie-chart.js src/dashboard.js/charting/d3pie.js src/dashboard.js/charting/d3.js src/dashboard.js/charting/peity.js src/dashboard.js/charting/textonly.js src/dashboard.js/charting.js src/dashboard.js/chart-registry.js src/dashboard.js/common.js src/dashboard.js/main.js src/dashboard.js/alarms.js src/dashboard.js/registry.js src/dashboard.js/boot.js src/dashboard.js/epilogue.js.inc  > dashboard.js.tmp && mv dashboard.js.tmp dashboard.js
  2713. mv version.txt.tmp version.txt
  2714. Making all in server
  2715. Making all in static
  2716. make[5]: Nothing to be done for `all-am'.
  2717. make[4]: Nothing to be done for `all-am'.
  2718. make[3]: Nothing to be done for `all-am'.
  2719. Making all in claim
  2720. if sed \
  2721.         -e 's#[@]localstatedir_POST@#/usr/local/netdata/var#g' \
  2722.         -e 's#[@]sbindir_POST@#/usr/local/netdata/usr/sbin#g' \
  2723.         -e 's#[@]pluginsdir_POST@#/usr/local/netdata/usr/libexec/netdata/plugins.d#g' \
  2724.         -e 's#[@]configdir_POST@#/usr/local/netdata/etc/netdata#g' \
  2725.         -e 's#[@]libconfigdir_POST@#/usr/local/netdata/usr/lib/netdata/conf.d#g' \
  2726.         -e 's#[@]pkglibexecdir_POST@#/usr/local/netdata/usr/libexec/netdata#g' \
  2727.         -e 's#[@]cachedir_POST@#/usr/local/netdata/var/cache/netdata#g' \
  2728.         -e 's#[@]registrydir_POST@#/usr/local/netdata/var/lib/netdata/registry#g' \
  2729.         -e 's#[@]varlibdir_POST@#/usr/local/netdata/var/lib/netdata#g' \
  2730.         -e 's#[@]webdir_POST@#/usr/local/netdata/usr/share/netdata/web#g' \
  2731.         -e 's#[@]enable_aclk_POST@#yes#g' \
  2732.         -e 's#[@]enable_cloud_POST@#yes#g' \
  2733.         netdata-claim.sh.in > netdata-claim.sh.tmp; then \
  2734.         mv "netdata-claim.sh.tmp" "netdata-claim.sh"; \
  2735.     else \
  2736.         rm -f "netdata-claim.sh.tmp"; \
  2737.         false; \
  2738.     fi
  2739. Making all in parser
  2740. make[2]: Nothing to be done for `all'.
  2741. Making all in spawn
  2742. make[2]: Nothing to be done for `all'.
  2743. Making all in ml
  2744. Making all in kmeans
  2745. make[3]: Nothing to be done for `all'.
  2746. make[3]: Nothing to be done for `all-am'.
  2747.   CC       libnetdata/os.o
  2748.   CC       web/api/formatters/json_wrapper.o
  2749.   CC       web/api/formatters/charts2json.o
  2750.   CC       web/api/formatters/rrdset2json.o
  2751.   CC       exporting/read_config.o
  2752.   CC       exporting/clean_connectors.o
  2753.   CC       exporting/init_connectors.o
  2754.   CC       exporting/process_data.o
  2755.   CC       exporting/check_filters.o
  2756.   CC       exporting/send_data.o
  2757.   CC       exporting/send_internal_metrics.o
  2758.   CXX      ml/ml.o
  2759.   CC       aclk/aclk_charts_api.o
  2760.   CC       aclk/aclk_alarm_api.o
  2761.   CC       daemon/static_threads_macos.o
  2762.   CXX      aclk/aclk-schemas/proto/agent/v1/disconnect.pb.o
  2763.   CC       collectors/cups.plugin/cups_plugin.o
  2764.   CC       libnetdata/adaptive_resortable_list/adaptive_resortable_list.o
  2765.   CC       libnetdata/config/appconfig.o
  2766.   CC       libnetdata/avl/avl.o
  2767.   CC       libnetdata/buffer/buffer.o
  2768.   CC       libnetdata/circular_buffer/circular_buffer.o
  2769.   CC       libnetdata/clocks/clocks.o
  2770.   CC       libnetdata/completion/completion.o
  2771.   CC       libnetdata/dictionary/dictionary.o
  2772.   CC       libnetdata/eval/eval.o
  2773.   CC       libnetdata/libnetdata.o
  2774.   CC       libnetdata/locks/locks.o
  2775.   CC       libnetdata/log/log.o
  2776.   CC       libnetdata/popen/popen.o
  2777.   CC       libnetdata/procfile/procfile.o
  2778.   CC       libnetdata/simple_pattern/simple_pattern.o
  2779.   CC       libnetdata/socket/socket.o
  2780.   CC       libnetdata/socket/security.o
  2781.   CC       libnetdata/statistical/statistical.o
  2782.   CC       libnetdata/storage_number/storage_number.o
  2783.   CC       libnetdata/threads/threads.o
  2784.   CC       libnetdata/url/url.o
  2785.   CC       libnetdata/json/json.o
  2786.   CC       libnetdata/json/jsmn.o
  2787.   CC       libnetdata/health/health.o
  2788.   CC       daemon/buildinfo.o
  2789.   CC       daemon/common.o
  2790.   CC       daemon/daemon.o
  2791.   CC       daemon/global_statistics.o
  2792.   CC       daemon/analytics.o
  2793.   CC       daemon/main.o
  2794.   CC       daemon/signals.o
  2795.   CC       daemon/service.o
  2796.   CC       daemon/static_threads.o
  2797.   CC       daemon/commands.o
  2798.   CC       daemon/unit_test.o
  2799.   CC       web/api/badges/web_buffer_svg.o
  2800.   CC       web/api/exporters/allmetrics.o
  2801.   CC       web/api/exporters/shell/allmetrics_shell.o
  2802.   CC       web/api/queries/average/average.o
  2803.   CC       web/api/queries/des/des.o
  2804.   CC       web/api/queries/incremental_sum/incremental_sum.o
  2805.   CC       web/api/queries/max/max.o
  2806.   CC       web/api/queries/median/median.o
  2807.   CC       web/api/queries/min/min.o
  2808.   CC       web/api/queries/query.o
  2809.   CC       web/api/queries/rrdr.o
  2810.   CC       web/api/queries/ses/ses.o
  2811.   CC       web/api/queries/stddev/stddev.o
  2812.   CC       web/api/queries/sum/sum.o
  2813.   CC       web/api/formatters/rrd2json.o
  2814.   CC       web/api/formatters/csv/csv.o
  2815.   CC       web/api/formatters/json/json.o
  2816.   CC       web/api/formatters/ssv/ssv.o
  2817.   CC       web/api/formatters/value/value.o
  2818.   CC       web/api/health/health_cmdapi.o
  2819.   CC       web/api/web_api_v1.o
  2820.   CC       backends/backends.o
  2821.   CC       backends/graphite/graphite.o
  2822.   CC       backends/json/json.o
  2823.   CC       backends/opentsdb/opentsdb.o
  2824.   CC       backends/prometheus/backend_prometheus.o
  2825.   CC       exporting/exporting_engine.o
  2826.   CC       exporting/graphite/graphite.o
  2827.   CC       exporting/json/json.o
  2828.   CC       exporting/opentsdb/opentsdb.o
  2829.   CC       exporting/prometheus/prometheus.o
  2830.   CC       collectors/checks.plugin/plugin_checks.o
  2831.   CC       health/health.o
  2832.   CC       health/health_config.o
  2833.   CC       health/health_json.o
  2834.   CC       health/health_log.o
  2835.   CC       ml/ml-dummy.o
  2836.   CXX      ml/BitBufferCounter.o
  2837.   CXX      ml/BitRateWindow.o
  2838.   CXX      ml/Config.o
  2839.   CXX      ml/Database.o
  2840.   CXX      ml/Dimension.o
  2841.   CXX      ml/Host.o
  2842.   CXX      ml/kmeans/KMeans.o
  2843.   CXX      ml/kmeans/SamplesBuffer.o
  2844.   CXX      ml/kmeans/dlib/dlib/all/source.o
  2845.   CC       collectors/idlejitter.plugin/plugin_idlejitter.o
  2846.   CC       collectors/plugins.d/plugins_d.o
  2847.   CC       collectors/plugins.d/pluginsd_parser.o
  2848.   CC       registry/registry.o
  2849.   CC       registry/registry_db.o
  2850.   CC       registry/registry_init.o
  2851.   CC       registry/registry_internals.o
  2852.   CC       registry/registry_log.o
  2853.   CC       registry/registry_machine.o
  2854.   CC       registry/registry_person.o
  2855.   CC       registry/registry_url.o
  2856.   CC       database/rrdcalc.o
  2857.   CC       database/rrdcalctemplate.o
  2858.   CC       database/rrddim.o
  2859.   CC       database/rrddimvar.o
  2860.   CC       database/rrdfamily.o
  2861.   CC       database/rrdhost.o
  2862.   CC       database/rrdlabels.o
  2863.   CC       database/rrd.o
  2864.   CC       database/rrdset.o
  2865.   CC       database/rrdsetvar.o
  2866.   CC       database/rrdvar.o
  2867.   CC       database/sqlite/sqlite_functions.o
  2868.   CC       database/sqlite/sqlite_aclk.o
  2869.   CC       database/sqlite/sqlite_health.o
  2870.   CC       database/sqlite/sqlite_aclk_node.o
  2871.   CC       database/sqlite/sqlite_aclk_chart.o
  2872.   CC       database/sqlite/sqlite_aclk_alert.o
  2873.   CC       database/sqlite/sqlite3.o
  2874.   CC       database/engine/rrdengine.o
  2875.   CC       database/engine/datafile.o
  2876.   CC       database/engine/journalfile.o
  2877.   CC       database/engine/rrdenginelib.o
  2878.   CC       database/engine/rrdengineapi.o
  2879.   CC       database/engine/pagecache.o
  2880.   CC       database/engine/rrdenglocking.o
  2881.   CC       database/engine/metadata_log/metadatalogapi.o
  2882.   CC       database/engine/metadata_log/logfile.o
  2883.   CC       database/engine/metadata_log/metalogpluginsd.o
  2884.   CC       database/engine/metadata_log/compaction.o
  2885.   CC       streaming/rrdpush.o
  2886.   CC       streaming/compression.o
  2887.   CC       streaming/sender.o
  2888.   CC       streaming/receiver.o
  2889.   CC       collectors/statsd.plugin/statsd.o
  2890.   CC       web/server/web_client.o
  2891.   CC       web/server/web_server.o
  2892.   CC       web/server/web_client_cache.o
  2893.   CC       web/server/static/static-threaded.o
  2894.   CC       claim/claim.o
  2895.   CC       parser/parser.o
  2896.   CC       aclk/aclk_api.o
  2897.   CC       aclk/aclk_proxy.o
  2898.   CC       aclk/aclk_collector_list.o
  2899.   CC       aclk/aclk.o
  2900.   CC       aclk/aclk_util.o
  2901.   CC       aclk/aclk_stats.o
  2902.   CC       aclk/aclk_query.o
  2903.   CC       aclk/aclk_query_queue.o
  2904.   CC       aclk/aclk_otp.o
  2905.   CC       aclk/aclk_tx_msgs.o
  2906.   CC       aclk/aclk_rx_msgs.o
  2907.   CC       aclk/https_client.o
  2908.   CC       mqtt_websockets/src/mqtt_wss_client.o
  2909.   CC       mqtt_websockets/src/mqtt_wss_log.o
  2910.   CC       mqtt_websockets/src/ws_client.o
  2911.   CC       mqtt_websockets/c-rbuf/src/ringbuffer.o
  2912.   CC       mqtt_websockets/MQTT-C/src/mqtt.o
  2913.   CXX      aclk/schema-wrappers/connection.o
  2914.   CXX      aclk/schema-wrappers/node_connection.o
  2915.   CXX      aclk/schema-wrappers/node_creation.o
  2916.   CXX      aclk/schema-wrappers/chart_stream.o
  2917.   CXX      aclk/schema-wrappers/chart_config.o
  2918.   CXX      aclk/schema-wrappers/alarm_stream.o
  2919.   CXX      aclk/schema-wrappers/alarm_config.o
  2920.   CXX      aclk/schema-wrappers/node_info.o
  2921.   CXX      aclk/schema-wrappers/schema_wrapper_utils.o
  2922.   CC       spawn/spawn.o
  2923.   CC       spawn/spawn_server.o
  2924.   CC       spawn/spawn_client.o
  2925.   CC       collectors/macos.plugin/plugin_macos.o
  2926.   CC       collectors/macos.plugin/macos_sysctl.o
  2927.   CC       collectors/macos.plugin/macos_mach_smi.o
  2928.   CC       collectors/macos.plugin/macos_fw.o
  2929.   CXX      aclk/aclk-schemas/proto/agent/v1/connection.pb.o
  2930.   CXX      aclk/aclk-schemas/proto/nodeinstance/connection/v1/connection.pb.o
  2931.   CXX      aclk/aclk-schemas/proto/nodeinstance/create/v1/creation.pb.o
  2932. collectors/macos.plugin/macos_fw.c:86:18: error: implicit declaration of function 'IOMainPort' is invalid in C99
  2933.       [-Werror,-Wimplicit-function-declaration]
  2934.     if (unlikely(IOMainPort(bootstrap_port, &main_port))) {
  2935.                  ^
  2936. 1 error generated.
  2937. make[2]: *** [collectors/macos.plugin/macos_fw.o] Error 1
  2938. make[2]: *** Waiting for unfinished jobs....
  2939. make[1]: *** [all-recursive] Error 1
  2940. make: *** [all] Error 2
  2941.  FAILED  
  2942.  
  2943. Dom 27 Feb 2022 11:20:17 CET : ERROR:  FAILED TO UPDATE NETDATA : FAILED TO COMPILE/INSTALL NETDATA
  2944.  FAILED
  2945.  
  2946.  ABORTED  Failed to update existing Netdata install at /usr/local/netdata
Add Comment
Please, Sign In to add comment