atuline

FastLED Platform IO Fail

Nov 27th, 2020 (edited)
1,053
0
Never
Not a member of Pastebin yet? Sign Up, it unlocks many cool features!
text 36.92 KB | None | 0 0
  1. Verbose mode can be enabled via `-v, --verbose` option
  2. CONFIGURATION: https://docs.platformio.org/page/boards/atmelavr/nanoatmega328.html
  3. PLATFORM: Atmel AVR (2.1.0) > Arduino Nano ATmega328
  4. HARDWARE: ATMEGA328P 16MHz, 2KB RAM, 30KB Flash
  5. DEBUG: Current (simavr) On-board (simavr)
  6. PACKAGES:
  7. - framework-arduino-avr 5.0.0
  8. - toolchain-atmelavr 1.50400.190710 (5.4.0)
  9. LDF: Library Dependency Finder -> http://bit.ly/configure-pio-ldf
  10. LDF Modes: Finder ~ chain, Compatibility ~ soft
  11. Found 6 compatible libraries
  12. Scanning dependencies...
  13. Dependency Graph
  14. |-- <FastLED> 3.3.3
  15. | |-- <SPI> 1.0
  16. | |-- <SoftwareSerial> 1.0
  17. Building in release mode
  18. Compiling .pio\build\nanoatmega328\lib9b6\FastLED\FastLED.cpp.o
  19. Compiling .pio\build\nanoatmega328\lib9b6\FastLED\bitswap.cpp.o
  20. Compiling .pio\build\nanoatmega328\lib9b6\FastLED\colorpalettes.cpp.o
  21. Compiling .pio\build\nanoatmega328\lib9b6\FastLED\colorutils.cpp.o
  22. Compiling .pio\build\nanoatmega328\lib9b6\FastLED\hsv2rgb.cpp.o
  23. Compiling .pio\build\nanoatmega328\lib9b6\FastLED\lib8tion.cpp.o
  24. Compiling .pio\build\nanoatmega328\lib9b6\FastLED\noise.cpp.o
  25. Compiling .pio\build\nanoatmega328\lib9b6\FastLED\power_mgt.cpp.o
  26. In file included from .pio\libdeps\nanoatmega328\FastLED\platforms/avr/fastled_avr.h:6:0,
  27. from .pio\libdeps\nanoatmega328\FastLED\platforms.h:39,
  28. from .pio\libdeps\nanoatmega328\FastLED\FastLED.h:52,
  29. from .pio\libdeps\nanoatmega328\FastLED\FastLED.cpp:2:
  30. .pio\libdeps\nanoatmega328\FastLED\platforms/avr/clockless_trinket.h: In static member function 'static void ClocklessController<DATA_PIN, T1, T2, T3, RGB_ORDER, XTRA0, FLIP, WAIT_TIME>::showRGBInternal(PixelController<RGB_ORDER>&)':
  31. .pio\libdeps\nanoatmega328\FastLED\platforms/avr/clockless_trinket.h:326:24: error: expected primary-expression before '__attribute__'
  32. #define FL_FALLTHROUGH __attribute__ ((fallthrough));
  33. ^
  34. .pio\libdeps\nanoatmega328\FastLED\platforms/avr/clockless_trinket.h:409:55: note: in expansion of macro 'FL_FALLTHROUGH'
  35. case 4: _D2(0) LO1 _D3(0) HI1 _D1(1) QLO2(b0,0) FL_FALLTHROUGH
  36. ^
  37. .pio\libdeps\nanoatmega328\FastLED\platforms/avr/clockless_trinket.h:326:24: error: expected primary-expression before '__attribute__'
  38. #define FL_FALLTHROUGH __attribute__ ((fallthrough));
  39. ^
  40. .pio\libdeps\nanoatmega328\FastLED\platforms/avr/clockless_trinket.h:410:55: note: in expansion of macro 'FL_FALLTHROUGH'
  41. case 3: _D2(0) LO1 _D3(0) HI1 _D1(1) QLO2(b0,0) FL_FALLTHROUGH
  42. ^
  43. .pio\libdeps\nanoatmega328\FastLED\platforms/avr/clockless_trinket.h:326:24: error: expected primary-expression before '__attribute__'
  44. #define FL_FALLTHROUGH __attribute__ ((fallthrough));
  45. ^
  46. .pio\libdeps\nanoatmega328\FastLED\platforms/avr/clockless_trinket.h:411:55: note: in expansion of macro 'FL_FALLTHROUGH'
  47. case 2: _D2(0) LO1 _D3(0) HI1 _D1(1) QLO2(b0,0) FL_FALLTHROUGH
  48. ^
  49. .pio\libdeps\nanoatmega328\FastLED\platforms/avr/clockless_trinket.h:326:24: error: expected primary-expression before '__attribute__'
  50. #define FL_FALLTHROUGH __attribute__ ((fallthrough));
  51. ^
  52. .pio\libdeps\nanoatmega328\FastLED\platforms/avr/clockless_trinket.h:425:55: note: in expansion of macro 'FL_FALLTHROUGH'
  53. case 4: _D2(0) LO1 _D3(0) HI1 _D1(1) QLO2(b0,0) FL_FALLTHROUGH
  54. ^
  55. .pio\libdeps\nanoatmega328\FastLED\platforms/avr/clockless_trinket.h:326:24: error: expected primary-expression before '__attribute__'
  56. #define FL_FALLTHROUGH __attribute__ ((fallthrough));
  57. ^
  58. .pio\libdeps\nanoatmega328\FastLED\platforms/avr/clockless_trinket.h:426:55: note: in expansion of macro 'FL_FALLTHROUGH'
  59. case 3: _D2(0) LO1 _D3(0) HI1 _D1(1) QLO2(b0,0) FL_FALLTHROUGH
  60. ^
  61. .pio\libdeps\nanoatmega328\FastLED\platforms/avr/clockless_trinket.h:326:24: error: expected primary-expression before '__attribute__'
  62. #define FL_FALLTHROUGH __attribute__ ((fallthrough));
  63. ^
  64. .pio\libdeps\nanoatmega328\FastLED\platforms/avr/clockless_trinket.h:427:55: note: in expansion of macro 'FL_FALLTHROUGH'
  65. case 2: _D2(0) LO1 _D3(0) HI1 _D1(1) QLO2(b0,0) FL_FALLTHROUGH
  66. ^
  67. In file included from .pio\libdeps\nanoatmega328\FastLED\platforms/avr/fastled_avr.h:6:0,
  68. from .pio\libdeps\nanoatmega328\FastLED\platforms.h:39,
  69. from .pio\libdeps\nanoatmega328\FastLED\FastLED.h:52,
  70. from .pio\libdeps\nanoatmega328\FastLED\bitswap.cpp:2:
  71. .pio\libdeps\nanoatmega328\FastLED\platforms/avr/clockless_trinket.h: In static member function 'static void ClocklessController<DATA_PIN, T1, T2, T3, RGB_ORDER, XTRA0, FLIP, WAIT_TIME>::showRGBInternal(PixelController<RGB_ORDER>&)':
  72. .pio\libdeps\nanoatmega328\FastLED\platforms/avr/clockless_trinket.h:326:24: error: expected primary-expression before '__attribute__'
  73. #define FL_FALLTHROUGH __attribute__ ((fallthrough));
  74. ^
  75. .pio\libdeps\nanoatmega328\FastLED\platforms/avr/clockless_trinket.h:409:55: note: in expansion of macro 'FL_FALLTHROUGH'
  76. case 4: _D2(0) LO1 _D3(0) HI1 _D1(1) QLO2(b0,0) FL_FALLTHROUGH
  77. ^
  78. .pio\libdeps\nanoatmega328\FastLED\platforms/avr/clockless_trinket.h:326:24: error: expected primary-expression before '__attribute__'
  79. #define FL_FALLTHROUGH __attribute__ ((fallthrough));
  80. ^
  81. .pio\libdeps\nanoatmega328\FastLED\platforms/avr/clockless_trinket.h:410:55: note: in expansion of macro 'FL_FALLTHROUGH'
  82. case 3: _D2(0) LO1 _D3(0) HI1 _D1(1) QLO2(b0,0) FL_FALLTHROUGH
  83. ^
  84. .pio\libdeps\nanoatmega328\FastLED\platforms/avr/clockless_trinket.h:326:24: error: expected primary-expression before '__attribute__'
  85. #define FL_FALLTHROUGH __attribute__ ((fallthrough));
  86. ^
  87. .pio\libdeps\nanoatmega328\FastLED\platforms/avr/clockless_trinket.h:411:55: note: in expansion of macro 'FL_FALLTHROUGH'
  88. case 2: _D2(0) LO1 _D3(0) HI1 _D1(1) QLO2(b0,0) FL_FALLTHROUGH
  89. ^
  90. .pio\libdeps\nanoatmega328\FastLED\platforms/avr/clockless_trinket.h:326:24: error: expected primary-expression before '__attribute__'
  91. #define FL_FALLTHROUGH __attribute__ ((fallthrough));
  92. ^
  93. .pio\libdeps\nanoatmega328\FastLED\platforms/avr/clockless_trinket.h:444:55: note: in expansion of macro 'FL_FALLTHROUGH'
  94. case 4: _D2(0) LO1 _D3(0) HI1 _D1(1) QLO2(b0,0) FL_FALLTHROUGH
  95. ^
  96. .pio\libdeps\nanoatmega328\FastLED\platforms/avr/clockless_trinket.h:326:24: error: expected primary-expression before '__attribute__'
  97. #define FL_FALLTHROUGH __attribute__ ((fallthrough));
  98. ^
  99. .pio\libdeps\nanoatmega328\FastLED\platforms/avr/clockless_trinket.h:445:55: note: in expansion of macro 'FL_FALLTHROUGH'
  100. case 3: _D2(0) LO1 _D3(0) HI1 _D1(1) QLO2(b0,0) FL_FALLTHROUGH
  101. ^
  102. .pio\libdeps\nanoatmega328\FastLED\platforms/avr/clockless_trinket.h:326:24: error: expected primary-expression before '__attribute__'
  103. #define FL_FALLTHROUGH __attribute__ ((fallthrough));
  104. ^
  105. .pio\libdeps\nanoatmega328\FastLED\platforms/avr/clockless_trinket.h:446:55: note: in expansion of macro 'FL_FALLTHROUGH'
  106. case 2: _D2(0) LO1 _D3(0) HI1 _D1(1) QLO2(b0,0) FL_FALLTHROUGH
  107. ^
  108. In file included from .pio\libdeps\nanoatmega328\FastLED\platforms/avr/fastled_avr.h:6:0,
  109. from .pio\libdeps\nanoatmega328\FastLED\platforms.h:39,
  110. from .pio\libdeps\nanoatmega328\FastLED\FastLED.h:52,
  111. from .pio\libdeps\nanoatmega328\FastLED\colorpalettes.cpp:4:
  112. .pio\libdeps\nanoatmega328\FastLED\platforms/avr/clockless_trinket.h: In static member function 'static void ClocklessController<DATA_PIN, T1, T2, T3, RGB_ORDER, XTRA0, FLIP, WAIT_TIME>::showRGBInternal(PixelController<RGB_ORDER>&)':
  113. .pio\libdeps\nanoatmega328\FastLED\platforms/avr/clockless_trinket.h:326:24: error: expected primary-expression before '__attribute__'
  114. #define FL_FALLTHROUGH __attribute__ ((fallthrough));
  115. ^
  116. .pio\libdeps\nanoatmega328\FastLED\platforms/avr/clockless_trinket.h:409:55: note: in expansion of macro 'FL_FALLTHROUGH'
  117. case 4: _D2(0) LO1 _D3(0) HI1 _D1(1) QLO2(b0,0) FL_FALLTHROUGH
  118. ^
  119. .pio\libdeps\nanoatmega328\FastLED\platforms/avr/clockless_trinket.h:326:24: error: expected primary-expression before '__attribute__'
  120. #define FL_FALLTHROUGH __attribute__ ((fallthrough));
  121. ^
  122. .pio\libdeps\nanoatmega328\FastLED\platforms/avr/clockless_trinket.h:410:55: note: in expansion of macro 'FL_FALLTHROUGH'
  123. case 3: _D2(0) LO1 _D3(0) HI1 _D1(1) QLO2(b0,0) FL_FALLTHROUGH
  124. ^
  125. .pio\libdeps\nanoatmega328\FastLED\platforms/avr/clockless_trinket.h:326:24: error: expected primary-expression before '__attribute__'
  126. #define FL_FALLTHROUGH __attribute__ ((fallthrough));
  127. ^
  128. .pio\libdeps\nanoatmega328\FastLED\platforms/avr/clockless_trinket.h:411:55: note: in expansion of macro 'FL_FALLTHROUGH'
  129. case 2: _D2(0) LO1 _D3(0) HI1 _D1(1) QLO2(b0,0) FL_FALLTHROUGH
  130. ^
  131. .pio\libdeps\nanoatmega328\FastLED\platforms/avr/clockless_trinket.h:326:24: error: expected primary-expression before '__attribute__'
  132. #define FL_FALLTHROUGH __attribute__ ((fallthrough));
  133. ^
  134. .pio\libdeps\nanoatmega328\FastLED\platforms/avr/clockless_trinket.h:425:55: note: in expansion of macro 'FL_FALLTHROUGH'
  135. case 4: _D2(0) LO1 _D3(0) HI1 _D1(1) QLO2(b0,0) FL_FALLTHROUGH
  136. ^
  137. In file included from .pio\libdeps\nanoatmega328\FastLED\platforms/avr/fastled_avr.h:6:0,
  138. from .pio\libdeps\nanoatmega328\FastLED\platforms.h:39,
  139. from .pio\libdeps\nanoatmega328\FastLED\FastLED.h:52,
  140. from .pio\libdeps\nanoatmega328\FastLED\hsv2rgb.cpp:4:
  141. .pio\libdeps\nanoatmega328\FastLED\platforms/avr/clockless_trinket.h: In static member function 'static void ClocklessController<DATA_PIN, T1, T2, T3, RGB_ORDER, XTRA0, FLIP, WAIT_TIME>::showRGBInternal(PixelController<RGB_ORDER>&)':
  142. .pio\libdeps\nanoatmega328\FastLED\platforms/avr/clockless_trinket.h:326:24: error: expected primary-expression before '__attribute__'
  143. #define FL_FALLTHROUGH __attribute__ ((fallthrough));
  144. ^
  145. .pio\libdeps\nanoatmega328\FastLED\platforms/avr/clockless_trinket.h:409:55: note: in expansion of macro 'FL_FALLTHROUGH'
  146. case 4: _D2(0) LO1 _D3(0) HI1 _D1(1) QLO2(b0,0) FL_FALLTHROUGH
  147. ^
  148. In file included from .pio\libdeps\nanoatmega328\FastLED\platforms/avr/fastled_avr.h:6:0,
  149. from .pio\libdeps\nanoatmega328\FastLED\platforms.h:39,
  150. from .pio\libdeps\nanoatmega328\FastLED\FastLED.h:52,
  151. from .pio\libdeps\nanoatmega328\FastLED\colorutils.cpp:7:
  152. .pio\libdeps\nanoatmega328\FastLED\platforms/avr/clockless_trinket.h: In static member function 'static void ClocklessController<DATA_PIN, T1, T2, T3, RGB_ORDER, XTRA0, FLIP, WAIT_TIME>::showRGBInternal(PixelController<RGB_ORDER>&)':
  153. .pio\libdeps\nanoatmega328\FastLED\platforms/avr/clockless_trinket.h:326:24: error: expected primary-expression before '__attribute__'
  154. #define FL_FALLTHROUGH __attribute__ ((fallthrough));
  155. ^
  156. .pio\libdeps\nanoatmega328\FastLED\platforms/avr/clockless_trinket.h:409:55: note: in expansion of macro 'FL_FALLTHROUGH'
  157. case 4: _D2(0) LO1 _D3(0) HI1 _D1(1) QLO2(b0,0) FL_FALLTHROUGH
  158. ^
  159. .pio\libdeps\nanoatmega328\FastLED\platforms/avr/clockless_trinket.h:326:24: error: expected primary-expression before '__attribute__'
  160. #define FL_FALLTHROUGH __attribute__ ((fallthrough));
  161. ^
  162. .pio\libdeps\nanoatmega328\FastLED\platforms/avr/clockless_trinket.h:426:55: note: in expansion of macro 'FL_FALLTHROUGH'
  163. case 3: _D2(0) LO1 _D3(0) HI1 _D1(1) QLO2(b0,0) FL_FALLTHROUGH
  164. ^
  165. .pio\libdeps\nanoatmega328\FastLED\platforms/avr/clockless_trinket.h:326:24: error: expected primary-expression before '__attribute__'
  166. #define FL_FALLTHROUGH __attribute__ ((fallthrough));
  167. ^
  168. .pio\libdeps\nanoatmega328\FastLED\platforms/avr/clockless_trinket.h:425:55: note: in expansion of macro 'FL_FALLTHROUGH'
  169. case 4: _D2(0) LO1 _D3(0) HI1 _D1(1) QLO2(b0,0) FL_FALLTHROUGH
  170. ^
  171. In file included from .pio\libdeps\nanoatmega328\FastLED\platforms/avr/fastled_avr.h:6:0,
  172. from .pio\libdeps\nanoatmega328\FastLED\platforms.h:39,
  173. from .pio\libdeps\nanoatmega328\FastLED\FastLED.h:52,
  174. from .pio\libdeps\nanoatmega328\FastLED\lib8tion.cpp:3:
  175. .pio\libdeps\nanoatmega328\FastLED\platforms/avr/clockless_trinket.h: In static member function 'static void ClocklessController<DATA_PIN, T1, T2, T3, RGB_ORDER, XTRA0, FLIP, WAIT_TIME>::showRGBInternal(PixelController<RGB_ORDER>&)':
  176. .pio\libdeps\nanoatmega328\FastLED\platforms/avr/clockless_trinket.h:326:24: error: expected primary-expression before '__attribute__'
  177. #define FL_FALLTHROUGH __attribute__ ((fallthrough));
  178. ^
  179. .pio\libdeps\nanoatmega328\FastLED\platforms/avr/clockless_trinket.h:409:55: note: in expansion of macro 'FL_FALLTHROUGH'
  180. case 4: _D2(0) LO1 _D3(0) HI1 _D1(1) QLO2(b0,0) FL_FALLTHROUGH
  181. ^
  182. In file included from .pio\libdeps\nanoatmega328\FastLED\platforms/avr/fastled_avr.h:6:0,
  183. from .pio\libdeps\nanoatmega328\FastLED\platforms.h:39,
  184. from .pio\libdeps\nanoatmega328\FastLED\FastLED.h:52,
  185. from .pio\libdeps\nanoatmega328\FastLED\noise.cpp:2:
  186. .pio\libdeps\nanoatmega328\FastLED\platforms/avr/clockless_trinket.h: In static member function 'static void ClocklessController<DATA_PIN, T1, T2, T3, RGB_ORDER, XTRA0, FLIP, WAIT_TIME>::showRGBInternal(PixelController<RGB_ORDER>&)':
  187. .pio\libdeps\nanoatmega328\FastLED\platforms/avr/clockless_trinket.h:326:24: error: expected primary-expression before '__attribute__'
  188. #define FL_FALLTHROUGH __attribute__ ((fallthrough));
  189. ^
  190. .pio\libdeps\nanoatmega328\FastLED\platforms/avr/clockless_trinket.h:409:55: note: in expansion of macro 'FL_FALLTHROUGH'
  191. case 4: _D2(0) LO1 _D3(0) HI1 _D1(1) QLO2(b0,0) FL_FALLTHROUGH
  192. ^
  193. In file included from .pio\libdeps\nanoatmega328\FastLED\platforms/avr/fastled_avr.h:6:0,
  194. from .pio\libdeps\nanoatmega328\FastLED\platforms.h:39,
  195. from .pio\libdeps\nanoatmega328\FastLED\FastLED.h:52,
  196. from .pio\libdeps\nanoatmega328\FastLED\power_mgt.cpp:2:
  197. .pio\libdeps\nanoatmega328\FastLED\platforms/avr/clockless_trinket.h: In static member function 'static void ClocklessController<DATA_PIN, T1, T2, T3, RGB_ORDER, XTRA0, FLIP, WAIT_TIME>::showRGBInternal(PixelController<RGB_ORDER>&)':
  198. .pio\libdeps\nanoatmega328\FastLED\platforms/avr/clockless_trinket.h:326:24: error: expected primary-expression before '__attribute__'
  199. #define FL_FALLTHROUGH __attribute__ ((fallthrough));
  200. ^
  201. .pio\libdeps\nanoatmega328\FastLED\platforms/avr/clockless_trinket.h:409:55: note: in expansion of macro 'FL_FALLTHROUGH'
  202. case 4: _D2(0) LO1 _D3(0) HI1 _D1(1) QLO2(b0,0) FL_FALLTHROUGH
  203. ^
  204. *** [.pio\build\nanoatmega328\lib9b6\FastLED\FastLED.cpp.o] Error 1
  205. .pio\libdeps\nanoatmega328\FastLED\platforms/avr/clockless_trinket.h:326:24: error: expected primary-expression before '__attribute__'
  206. #define FL_FALLTHROUGH __attribute__ ((fallthrough));
  207. ^
  208. .pio\libdeps\nanoatmega328\FastLED\platforms/avr/clockless_trinket.h:410:55: note: in expansion of macro 'FL_FALLTHROUGH'
  209. case 3: _D2(0) LO1 _D3(0) HI1 _D1(1) QLO2(b0,0) FL_FALLTHROUGH
  210. ^
  211. .pio\libdeps\nanoatmega328\FastLED\platforms/avr/clockless_trinket.h:326:24: error: expected primary-expression before '__attribute__'
  212. #define FL_FALLTHROUGH __attribute__ ((fallthrough));
  213. ^
  214. .pio\libdeps\nanoatmega328\FastLED\platforms/avr/clockless_trinket.h:427:55: note: in expansion of macro 'FL_FALLTHROUGH'
  215. case 2: _D2(0) LO1 _D3(0) HI1 _D1(1) QLO2(b0,0) FL_FALLTHROUGH
  216. ^
  217. .pio\libdeps\nanoatmega328\FastLED\platforms/avr/clockless_trinket.h:326:24: error: expected primary-expression before '__attribute__'
  218. #define FL_FALLTHROUGH __attribute__ ((fallthrough));
  219. ^
  220. .pio\libdeps\nanoatmega328\FastLED\platforms/avr/clockless_trinket.h:426:55: note: in expansion of macro 'FL_FALLTHROUGH'
  221. case 3: _D2(0) LO1 _D3(0) HI1 _D1(1) QLO2(b0,0) FL_FALLTHROUGH
  222. ^
  223. .pio\libdeps\nanoatmega328\FastLED\platforms/avr/clockless_trinket.h:326:24: error: expected primary-expression before '__attribute__'
  224. #define FL_FALLTHROUGH __attribute__ ((fallthrough));
  225. ^
  226. .pio\libdeps\nanoatmega328\FastLED\platforms/avr/clockless_trinket.h:410:55: note: in expansion of macro 'FL_FALLTHROUGH'
  227. case 3: _D2(0) LO1 _D3(0) HI1 _D1(1) QLO2(b0,0) FL_FALLTHROUGH
  228. ^
  229. .pio\libdeps\nanoatmega328\FastLED\platforms/avr/clockless_trinket.h:326:24: error: expected primary-expression before '__attribute__'
  230. #define FL_FALLTHROUGH __attribute__ ((fallthrough));
  231. ^
  232. .pio\libdeps\nanoatmega328\FastLED\platforms/avr/clockless_trinket.h:410:55: note: in expansion of macro 'FL_FALLTHROUGH'
  233. case 3: _D2(0) LO1 _D3(0) HI1 _D1(1) QLO2(b0,0) FL_FALLTHROUGH
  234. ^
  235. .pio\libdeps\nanoatmega328\FastLED\platforms/avr/clockless_trinket.h:326:24: error: expected primary-expression before '__attribute__'
  236. #define FL_FALLTHROUGH __attribute__ ((fallthrough));
  237. ^
  238. .pio\libdeps\nanoatmega328\FastLED\platforms/avr/clockless_trinket.h:410:55: note: in expansion of macro 'FL_FALLTHROUGH'
  239. case 3: _D2(0) LO1 _D3(0) HI1 _D1(1) QLO2(b0,0) FL_FALLTHROUGH
  240. ^
  241. .pio\libdeps\nanoatmega328\FastLED\platforms/avr/clockless_trinket.h:326:24: error: expected primary-expression before '__attribute__'
  242. #define FL_FALLTHROUGH __attribute__ ((fallthrough));
  243. ^
  244. .pio\libdeps\nanoatmega328\FastLED\platforms/avr/clockless_trinket.h:427:55: note: in expansion of macro 'FL_FALLTHROUGH'
  245. case 2: _D2(0) LO1 _D3(0) HI1 _D1(1) QLO2(b0,0) FL_FALLTHROUGH
  246. ^
  247. .pio\libdeps\nanoatmega328\FastLED\platforms/avr/clockless_trinket.h:326:24: error: expected primary-expression before '__attribute__'
  248. #define FL_FALLTHROUGH __attribute__ ((fallthrough));
  249. ^
  250. .pio\libdeps\nanoatmega328\FastLED\platforms/avr/clockless_trinket.h:411:55: note: in expansion of macro 'FL_FALLTHROUGH'
  251. case 2: _D2(0) LO1 _D3(0) HI1 _D1(1) QLO2(b0,0) FL_FALLTHROUGH
  252. ^
  253. .pio\libdeps\nanoatmega328\FastLED\platforms/avr/clockless_trinket.h:326:24: error: expected primary-expression before '__attribute__'
  254. #define FL_FALLTHROUGH __attribute__ ((fallthrough));
  255. ^
  256. .pio\libdeps\nanoatmega328\FastLED\platforms/avr/clockless_trinket.h:411:55: note: in expansion of macro 'FL_FALLTHROUGH'
  257. case 2: _D2(0) LO1 _D3(0) HI1 _D1(1) QLO2(b0,0) FL_FALLTHROUGH
  258. ^
  259. .pio\libdeps\nanoatmega328\FastLED\platforms/avr/clockless_trinket.h:326:24: error: expected primary-expression before '__attribute__'
  260. #define FL_FALLTHROUGH __attribute__ ((fallthrough));
  261. ^
  262. .pio\libdeps\nanoatmega328\FastLED\platforms/avr/clockless_trinket.h:411:55: note: in expansion of macro 'FL_FALLTHROUGH'
  263. case 2: _D2(0) LO1 _D3(0) HI1 _D1(1) QLO2(b0,0) FL_FALLTHROUGH
  264. ^
  265. .pio\libdeps\nanoatmega328\FastLED\platforms/avr/clockless_trinket.h:326:24: error: expected primary-expression before '__attribute__'
  266. #define FL_FALLTHROUGH __attribute__ ((fallthrough));
  267. ^
  268. .pio\libdeps\nanoatmega328\FastLED\platforms/avr/clockless_trinket.h:410:55: note: in expansion of macro 'FL_FALLTHROUGH'
  269. case 3: _D2(0) LO1 _D3(0) HI1 _D1(1) QLO2(b0,0) FL_FALLTHROUGH
  270. ^
  271. .pio\libdeps\nanoatmega328\FastLED\platforms/avr/clockless_trinket.h:326:24: error: expected primary-expression before '__attribute__'
  272. #define FL_FALLTHROUGH __attribute__ ((fallthrough));
  273. ^
  274. .pio\libdeps\nanoatmega328\FastLED\platforms/avr/clockless_trinket.h:411:55: note: in expansion of macro 'FL_FALLTHROUGH'
  275. case 2: _D2(0) LO1 _D3(0) HI1 _D1(1) QLO2(b0,0) FL_FALLTHROUGH
  276. ^
  277. .pio\libdeps\nanoatmega328\FastLED\platforms/avr/clockless_trinket.h:326:24: error: expected primary-expression before '__attribute__'
  278. #define FL_FALLTHROUGH __attribute__ ((fallthrough));
  279. ^
  280. .pio\libdeps\nanoatmega328\FastLED\platforms/avr/clockless_trinket.h:444:55: note: in expansion of macro 'FL_FALLTHROUGH'
  281. case 4: _D2(0) LO1 _D3(0) HI1 _D1(1) QLO2(b0,0) FL_FALLTHROUGH
  282. ^
  283. .pio\libdeps\nanoatmega328\FastLED\platforms/avr/clockless_trinket.h:326:24: error: expected primary-expression before '__attribute__'
  284. #define FL_FALLTHROUGH __attribute__ ((fallthrough));
  285. ^
  286. .pio\libdeps\nanoatmega328\FastLED\platforms/avr/clockless_trinket.h:444:55: note: in expansion of macro 'FL_FALLTHROUGH'
  287. case 4: _D2(0) LO1 _D3(0) HI1 _D1(1) QLO2(b0,0) FL_FALLTHROUGH
  288. ^
  289. .pio\libdeps\nanoatmega328\FastLED\platforms/avr/clockless_trinket.h:326:24: error: expected primary-expression before '__attribute__'
  290. #define FL_FALLTHROUGH __attribute__ ((fallthrough));
  291. ^
  292. .pio\libdeps\nanoatmega328\FastLED\platforms/avr/clockless_trinket.h:425:55: note: in expansion of macro 'FL_FALLTHROUGH'
  293. case 4: _D2(0) LO1 _D3(0) HI1 _D1(1) QLO2(b0,0) FL_FALLTHROUGH
  294. ^
  295. .pio\libdeps\nanoatmega328\FastLED\platforms/avr/clockless_trinket.h:326:24: error: expected primary-expression before '__attribute__'
  296. #define FL_FALLTHROUGH __attribute__ ((fallthrough));
  297. ^
  298. .pio\libdeps\nanoatmega328\FastLED\platforms/avr/clockless_trinket.h:445:55: note: in expansion of macro 'FL_FALLTHROUGH'
  299. case 3: _D2(0) LO1 _D3(0) HI1 _D1(1) QLO2(b0,0) FL_FALLTHROUGH
  300. ^
  301. .pio\libdeps\nanoatmega328\FastLED\platforms/avr/clockless_trinket.h:326:24: error: expected primary-expression before '__attribute__'
  302. #define FL_FALLTHROUGH __attribute__ ((fallthrough));
  303. ^
  304. .pio\libdeps\nanoatmega328\FastLED\platforms/avr/clockless_trinket.h:411:55: note: in expansion of macro 'FL_FALLTHROUGH'
  305. case 2: _D2(0) LO1 _D3(0) HI1 _D1(1) QLO2(b0,0) FL_FALLTHROUGH
  306. ^
  307. .pio\libdeps\nanoatmega328\FastLED\platforms/avr/clockless_trinket.h:326:24: error: expected primary-expression before '__attribute__'
  308. #define FL_FALLTHROUGH __attribute__ ((fallthrough));
  309. ^
  310. .pio\libdeps\nanoatmega328\FastLED\platforms/avr/clockless_trinket.h:445:55: note: in expansion of macro 'FL_FALLTHROUGH'
  311. case 3: _D2(0) LO1 _D3(0) HI1 _D1(1) QLO2(b0,0) FL_FALLTHROUGH
  312. ^
  313. .pio\libdeps\nanoatmega328\FastLED\platforms/avr/clockless_trinket.h:326:24: error: expected primary-expression before '__attribute__'
  314. #define FL_FALLTHROUGH __attribute__ ((fallthrough));
  315. ^
  316. .pio\libdeps\nanoatmega328\FastLED\platforms/avr/clockless_trinket.h:426:55: note: in expansion of macro 'FL_FALLTHROUGH'
  317. case 3: _D2(0) LO1 _D3(0) HI1 _D1(1) QLO2(b0,0) FL_FALLTHROUGH
  318. ^
  319. .pio\libdeps\nanoatmega328\FastLED\platforms/avr/clockless_trinket.h:326:24: error: expected primary-expression before '__attribute__'
  320. #define FL_FALLTHROUGH __attribute__ ((fallthrough));
  321. ^
  322. .pio\libdeps\nanoatmega328\FastLED\platforms/avr/clockless_trinket.h:446:55: note: in expansion of macro 'FL_FALLTHROUGH'
  323. case 2: _D2(0) LO1 _D3(0) HI1 _D1(1) QLO2(b0,0) FL_FALLTHROUGH
  324. ^
  325. .pio\libdeps\nanoatmega328\FastLED\platforms/avr/clockless_trinket.h:326:24: error: expected primary-expression before '__attribute__'
  326. #define FL_FALLTHROUGH __attribute__ ((fallthrough));
  327. ^
  328. .pio\libdeps\nanoatmega328\FastLED\platforms/avr/clockless_trinket.h:425:55: note: in expansion of macro 'FL_FALLTHROUGH'
  329. case 4: _D2(0) LO1 _D3(0) HI1 _D1(1) QLO2(b0,0) FL_FALLTHROUGH
  330. ^
  331. .pio\libdeps\nanoatmega328\FastLED\platforms/avr/clockless_trinket.h:326:24: error: expected primary-expression before '__attribute__'
  332. #define FL_FALLTHROUGH __attribute__ ((fallthrough));
  333. ^
  334. .pio\libdeps\nanoatmega328\FastLED\platforms/avr/clockless_trinket.h:425:55: note: in expansion of macro 'FL_FALLTHROUGH'
  335. case 4: _D2(0) LO1 _D3(0) HI1 _D1(1) QLO2(b0,0) FL_FALLTHROUGH
  336. ^
  337. .pio\libdeps\nanoatmega328\FastLED\platforms/avr/clockless_trinket.h:326:24: error: expected primary-expression before '__attribute__'
  338. #define FL_FALLTHROUGH __attribute__ ((fallthrough));
  339. ^
  340. .pio\libdeps\nanoatmega328\FastLED\platforms/avr/clockless_trinket.h:425:55: note: in expansion of macro 'FL_FALLTHROUGH'
  341. case 4: _D2(0) LO1 _D3(0) HI1 _D1(1) QLO2(b0,0) FL_FALLTHROUGH
  342. ^
  343. .pio\libdeps\nanoatmega328\FastLED\platforms/avr/clockless_trinket.h:326:24: error: expected primary-expression before '__attribute__'
  344. #define FL_FALLTHROUGH __attribute__ ((fallthrough));
  345. ^
  346. .pio\libdeps\nanoatmega328\FastLED\platforms/avr/clockless_trinket.h:425:55: note: in expansion of macro 'FL_FALLTHROUGH'
  347. case 4: _D2(0) LO1 _D3(0) HI1 _D1(1) QLO2(b0,0) FL_FALLTHROUGH
  348. ^
  349. .pio\libdeps\nanoatmega328\FastLED\platforms/avr/clockless_trinket.h:326:24: error: expected primary-expression before '__attribute__'
  350. #define FL_FALLTHROUGH __attribute__ ((fallthrough));
  351. ^
  352. .pio\libdeps\nanoatmega328\FastLED\platforms/avr/clockless_trinket.h:446:55: note: in expansion of macro 'FL_FALLTHROUGH'
  353. case 2: _D2(0) LO1 _D3(0) HI1 _D1(1) QLO2(b0,0) FL_FALLTHROUGH
  354. ^
  355. .pio\libdeps\nanoatmega328\FastLED\platforms/avr/clockless_trinket.h:326:24: error: expected primary-expression before '__attribute__'
  356. #define FL_FALLTHROUGH __attribute__ ((fallthrough));
  357. ^
  358. .pio\libdeps\nanoatmega328\FastLED\platforms/avr/clockless_trinket.h:426:55: note: in expansion of macro 'FL_FALLTHROUGH'
  359. case 3: _D2(0) LO1 _D3(0) HI1 _D1(1) QLO2(b0,0) FL_FALLTHROUGH
  360. ^
  361. .pio\libdeps\nanoatmega328\FastLED\platforms/avr/clockless_trinket.h:326:24: error: expected primary-expression before '__attribute__'
  362. #define FL_FALLTHROUGH __attribute__ ((fallthrough));
  363. ^
  364. .pio\libdeps\nanoatmega328\FastLED\platforms/avr/clockless_trinket.h:426:55: note: in expansion of macro 'FL_FALLTHROUGH'
  365. case 3: _D2(0) LO1 _D3(0) HI1 _D1(1) QLO2(b0,0) FL_FALLTHROUGH
  366. ^
  367. .pio\libdeps\nanoatmega328\FastLED\platforms/avr/clockless_trinket.h:326:24: error: expected primary-expression before '__attribute__'
  368. #define FL_FALLTHROUGH __attribute__ ((fallthrough));
  369. ^
  370. .pio\libdeps\nanoatmega328\FastLED\platforms/avr/clockless_trinket.h:426:55: note: in expansion of macro 'FL_FALLTHROUGH'
  371. case 3: _D2(0) LO1 _D3(0) HI1 _D1(1) QLO2(b0,0) FL_FALLTHROUGH
  372. ^
  373. .pio\libdeps\nanoatmega328\FastLED\platforms/avr/clockless_trinket.h:326:24: error: expected primary-expression before '__attribute__'
  374. #define FL_FALLTHROUGH __attribute__ ((fallthrough));
  375. ^
  376. .pio\libdeps\nanoatmega328\FastLED\platforms/avr/clockless_trinket.h:427:55: note: in expansion of macro 'FL_FALLTHROUGH'
  377. case 2: _D2(0) LO1 _D3(0) HI1 _D1(1) QLO2(b0,0) FL_FALLTHROUGH
  378. ^
  379. .pio\libdeps\nanoatmega328\FastLED\platforms/avr/clockless_trinket.h:326:24: error: expected primary-expression before '__attribute__'
  380. #define FL_FALLTHROUGH __attribute__ ((fallthrough));
  381. ^
  382. .pio\libdeps\nanoatmega328\FastLED\platforms/avr/clockless_trinket.h:426:55: note: in expansion of macro 'FL_FALLTHROUGH'
  383. case 3: _D2(0) LO1 _D3(0) HI1 _D1(1) QLO2(b0,0) FL_FALLTHROUGH
  384. ^
  385. .pio\libdeps\nanoatmega328\FastLED\platforms/avr/clockless_trinket.h:326:24: error: expected primary-expression before '__attribute__'
  386. #define FL_FALLTHROUGH __attribute__ ((fallthrough));
  387. ^
  388. .pio\libdeps\nanoatmega328\FastLED\platforms/avr/clockless_trinket.h:427:55: note: in expansion of macro 'FL_FALLTHROUGH'
  389. case 2: _D2(0) LO1 _D3(0) HI1 _D1(1) QLO2(b0,0) FL_FALLTHROUGH
  390. ^
  391. *** [.pio\build\nanoatmega328\lib9b6\FastLED\bitswap.cpp.o] Error 1
  392. *** [.pio\build\nanoatmega328\lib9b6\FastLED\colorpalettes.cpp.o] Error 1
  393. .pio\libdeps\nanoatmega328\FastLED\platforms/avr/clockless_trinket.h:326:24: error: expected primary-expression before '__attribute__'
  394. #define FL_FALLTHROUGH __attribute__ ((fallthrough));
  395. ^
  396. .pio\libdeps\nanoatmega328\FastLED\platforms/avr/clockless_trinket.h:427:55: note: in expansion of macro 'FL_FALLTHROUGH'
  397. case 2: _D2(0) LO1 _D3(0) HI1 _D1(1) QLO2(b0,0) FL_FALLTHROUGH
  398. ^
  399. .pio\libdeps\nanoatmega328\FastLED\platforms/avr/clockless_trinket.h:326:24: error: expected primary-expression before '__attribute__'
  400. #define FL_FALLTHROUGH __attribute__ ((fallthrough));
  401. ^
  402. .pio\libdeps\nanoatmega328\FastLED\platforms/avr/clockless_trinket.h:427:55: note: in expansion of macro 'FL_FALLTHROUGH'
  403. case 2: _D2(0) LO1 _D3(0) HI1 _D1(1) QLO2(b0,0) FL_FALLTHROUGH
  404. ^
  405. .pio\libdeps\nanoatmega328\FastLED\platforms/avr/clockless_trinket.h:326:24: error: expected primary-expression before '__attribute__'
  406. #define FL_FALLTHROUGH __attribute__ ((fallthrough));
  407. ^
  408. .pio\libdeps\nanoatmega328\FastLED\platforms/avr/clockless_trinket.h:427:55: note: in expansion of macro 'FL_FALLTHROUGH'
  409. case 2: _D2(0) LO1 _D3(0) HI1 _D1(1) QLO2(b0,0) FL_FALLTHROUGH
  410. ^
  411. .pio\libdeps\nanoatmega328\FastLED\platforms/avr/clockless_trinket.h:326:24: error: expected primary-expression before '__attribute__'
  412. #define FL_FALLTHROUGH __attribute__ ((fallthrough));
  413. ^
  414. .pio\libdeps\nanoatmega328\FastLED\platforms/avr/clockless_trinket.h:444:55: note: in expansion of macro 'FL_FALLTHROUGH'
  415. case 4: _D2(0) LO1 _D3(0) HI1 _D1(1) QLO2(b0,0) FL_FALLTHROUGH
  416. ^
  417. .pio\libdeps\nanoatmega328\FastLED\platforms/avr/clockless_trinket.h:326:24: error: expected primary-expression before '__attribute__'
  418. #define FL_FALLTHROUGH __attribute__ ((fallthrough));
  419. ^
  420. .pio\libdeps\nanoatmega328\FastLED\platforms/avr/clockless_trinket.h:444:55: note: in expansion of macro 'FL_FALLTHROUGH'
  421. case 4: _D2(0) LO1 _D3(0) HI1 _D1(1) QLO2(b0,0) FL_FALLTHROUGH
  422. ^
  423. .pio\libdeps\nanoatmega328\FastLED\platforms/avr/clockless_trinket.h:326:24: error: expected primary-expression before '__attribute__'
  424. #define FL_FALLTHROUGH __attribute__ ((fallthrough));
  425. ^
  426. .pio\libdeps\nanoatmega328\FastLED\platforms/avr/clockless_trinket.h:444:55: note: in expansion of macro 'FL_FALLTHROUGH'
  427. case 4: _D2(0) LO1 _D3(0) HI1 _D1(1) QLO2(b0,0) FL_FALLTHROUGH
  428. ^
  429. .pio\libdeps\nanoatmega328\FastLED\platforms/avr/clockless_trinket.h:326:24: error: expected primary-expression before '__attribute__'
  430. #define FL_FALLTHROUGH __attribute__ ((fallthrough));
  431. ^
  432. .pio\libdeps\nanoatmega328\FastLED\platforms/avr/clockless_trinket.h:445:55: note: in expansion of macro 'FL_FALLTHROUGH'
  433. case 3: _D2(0) LO1 _D3(0) HI1 _D1(1) QLO2(b0,0) FL_FALLTHROUGH
  434. ^
  435. .pio\libdeps\nanoatmega328\FastLED\platforms/avr/clockless_trinket.h:326:24: error: expected primary-expression before '__attribute__'
  436. #define FL_FALLTHROUGH __attribute__ ((fallthrough));
  437. ^
  438. .pio\libdeps\nanoatmega328\FastLED\platforms/avr/clockless_trinket.h:444:55: note: in expansion of macro 'FL_FALLTHROUGH'
  439. case 4: _D2(0) LO1 _D3(0) HI1 _D1(1) QLO2(b0,0) FL_FALLTHROUGH
  440. ^
  441. .pio\libdeps\nanoatmega328\FastLED\platforms/avr/clockless_trinket.h:326:24: error: expected primary-expression before '__attribute__'
  442. #define FL_FALLTHROUGH __attribute__ ((fallthrough));
  443. ^
  444. .pio\libdeps\nanoatmega328\FastLED\platforms/avr/clockless_trinket.h:444:55: note: in expansion of macro 'FL_FALLTHROUGH'
  445. case 4: _D2(0) LO1 _D3(0) HI1 _D1(1) QLO2(b0,0) FL_FALLTHROUGH
  446. ^
  447. .pio\libdeps\nanoatmega328\FastLED\platforms/avr/clockless_trinket.h:326:24: error: expected primary-expression before '__attribute__'
  448. #define FL_FALLTHROUGH __attribute__ ((fallthrough));
  449. ^
  450. .pio\libdeps\nanoatmega328\FastLED\platforms/avr/clockless_trinket.h:446:55: note: in expansion of macro 'FL_FALLTHROUGH'
  451. case 2: _D2(0) LO1 _D3(0) HI1 _D1(1) QLO2(b0,0) FL_FALLTHROUGH
  452. ^
  453. .pio\libdeps\nanoatmega328\FastLED\platforms/avr/clockless_trinket.h:326:24: error: expected primary-expression before '__attribute__'
  454. #define FL_FALLTHROUGH __attribute__ ((fallthrough));
  455. ^
  456. .pio\libdeps\nanoatmega328\FastLED\platforms/avr/clockless_trinket.h:445:55: note: in expansion of macro 'FL_FALLTHROUGH'
  457. case 3: _D2(0) LO1 _D3(0) HI1 _D1(1) QLO2(b0,0) FL_FALLTHROUGH
  458. ^
  459. .pio\libdeps\nanoatmega328\FastLED\platforms/avr/clockless_trinket.h:326:24: error: expected primary-expression before '__attribute__'
  460. #define FL_FALLTHROUGH __attribute__ ((fallthrough));
  461. ^
  462. .pio\libdeps\nanoatmega328\FastLED\platforms/avr/clockless_trinket.h:445:55: note: in expansion of macro 'FL_FALLTHROUGH'
  463. case 3: _D2(0) LO1 _D3(0) HI1 _D1(1) QLO2(b0,0) FL_FALLTHROUGH
  464. ^
  465. .pio\libdeps\nanoatmega328\FastLED\platforms/avr/clockless_trinket.h:326:24: error: expected primary-expression before '__attribute__'
  466. #define FL_FALLTHROUGH __attribute__ ((fallthrough));
  467. ^
  468. .pio\libdeps\nanoatmega328\FastLED\platforms/avr/clockless_trinket.h:445:55: note: in expansion of macro 'FL_FALLTHROUGH'
  469. case 3: _D2(0) LO1 _D3(0) HI1 _D1(1) QLO2(b0,0) FL_FALLTHROUGH
  470. ^
  471. .pio\libdeps\nanoatmega328\FastLED\platforms/avr/clockless_trinket.h:326:24: error: expected primary-expression before '__attribute__'
  472. #define FL_FALLTHROUGH __attribute__ ((fallthrough));
  473. ^
  474. .pio\libdeps\nanoatmega328\FastLED\platforms/avr/clockless_trinket.h:445:55: note: in expansion of macro 'FL_FALLTHROUGH'
  475. case 3: _D2(0) LO1 _D3(0) HI1 _D1(1) QLO2(b0,0) FL_FALLTHROUGH
  476.  
  477. . . . . (and it goes on from here). . . .
Advertisement
Add Comment
Please, Sign In to add comment