beingtmk

error while compiling open-mrs-core

Mar 15th, 2019
186
0
Never
Not a member of Pastebin yet? Sign Up, it unlocks many cool features!
Bash 7.59 KB | None | 0 0
  1. [INFO] Compiling 1 source file to /home/vampire/Projects/WebDev/openmrs-test/openmrs-core/tools/target/classes
  2. [INFO] -------------------------------------------------------------
  3. [ERROR] COMPILATION ERROR :
  4. [INFO] -------------------------------------------------------------
  5. [ERROR] /home/vampire/Projects/WebDev/openmrs-test/openmrs-core/tools/src/main/java/org/openmrs/tools/doclet/ShouldTaglet.java:[15,28] error: package com.sun.tools.doclets does not exist
  6.  
  7. [ERROR] /home/vampire/Projects/WebDev/openmrs-test/openmrs-core/tools/src/main/java/org/openmrs/tools/doclet/ShouldTaglet.java:[20,37] error: cannot find symbol
  8.  
  9. [ERROR]  class Taglet
  10. /home/vampire/Projects/WebDev/openmrs-test/openmrs-core/tools/src/main/java/org/openmrs/tools/doclet/ShouldTaglet.java:[29,1] error: method does not override or implement a method from a supertype
  11.  
  12. [ERROR] /home/vampire/Projects/WebDev/openmrs-test/openmrs-core/tools/src/main/java/org/openmrs/tools/doclet/ShouldTaglet.java:[40,1] error: method does not override or implement a method from a supertype
  13.  
  14. [ERROR] /home/vampire/Projects/WebDev/openmrs-test/openmrs-core/tools/src/main/java/org/openmrs/tools/doclet/ShouldTaglet.java:[51,1] error: method does not override or implement a method from a supertype
  15.  
  16. [ERROR] /home/vampire/Projects/WebDev/openmrs-test/openmrs-core/tools/src/main/java/org/openmrs/tools/doclet/ShouldTaglet.java:[62,1] error: method does not override or implement a method from a supertype
  17.  
  18. [ERROR] /home/vampire/Projects/WebDev/openmrs-test/openmrs-core/tools/src/main/java/org/openmrs/tools/doclet/ShouldTaglet.java:[73,1] error: method does not override or implement a method from a supertype
  19.  
  20. [ERROR] /home/vampire/Projects/WebDev/openmrs-test/openmrs-core/tools/src/main/java/org/openmrs/tools/doclet/ShouldTaglet.java:[84,1] error: method does not override or implement a method from a supertype
  21.  
  22. [ERROR] /home/vampire/Projects/WebDev/openmrs-test/openmrs-core/tools/src/main/java/org/openmrs/tools/doclet/ShouldTaglet.java:[96,1] error: method does not override or implement a method from a supertype
  23.  
  24. [ERROR] /home/vampire/Projects/WebDev/openmrs-test/openmrs-core/tools/src/main/java/org/openmrs/tools/doclet/ShouldTaglet.java:[107,1] error: method does not override or implement a method from a supertype
  25.  
  26. [ERROR] /home/vampire/Projects/WebDev/openmrs-test/openmrs-core/tools/src/main/java/org/openmrs/tools/doclet/ShouldTaglet.java:[119,2] error: cannot find symbol
  27.  
  28. [ERROR]  class ShouldTaglet
  29. /home/vampire/Projects/WebDev/openmrs-test/openmrs-core/tools/src/main/java/org/openmrs/tools/doclet/ShouldTaglet.java:[119,14] error: cannot find symbol
  30.  
  31. [ERROR]  class ShouldTaglet
  32. /home/vampire/Projects/WebDev/openmrs-test/openmrs-core/tools/src/main/java/org/openmrs/tools/doclet/ShouldTaglet.java:[132,1] error: method does not override or implement a method from a supertype
  33.  
  34. [ERROR] /home/vampire/Projects/WebDev/openmrs-test/openmrs-core/tools/src/main/java/org/openmrs/tools/doclet/ShouldTaglet.java:[143,1] error: method does not override or implement a method from a supertype
  35.  
  36. [INFO] 14 errors
  37. [INFO] -------------------------------------------------------------
  38. [INFO] ------------------------------------------------------------------------
  39. [INFO] Reactor Summary:
  40. [INFO]
  41. [INFO] OpenMRS ............................................ SUCCESS [07:21 min]
  42. [INFO] openmrs-tools ...................................... FAILURE [01:51 min]
  43. [INFO] openmrs-test ....................................... SKIPPED
  44. [INFO] openmrs-api ........................................ SKIPPED
  45. [INFO] openmrs-web ........................................ SKIPPED
  46. [INFO] openmrs-webapp ..................................... SKIPPED
  47. [INFO] ------------------------------------------------------------------------
  48. [INFO] BUILD FAILURE
  49. [INFO] ------------------------------------------------------------------------
  50. [INFO] Total time: 09:13 min
  51. [INFO] Finished at: 2019-03-15T18:31:14+05:30
  52. [INFO] Final Memory: 19M/70M
  53. [INFO] ------------------------------------------------------------------------
  54. [ERROR] Failed to execute goal org.apache.maven.plugins:maven-compiler-plugin:2.1:compile (default-compile) on project openmrs-tools: Compilation failure: Compilation failure:
  55. [ERROR] /home/vampire/Projects/WebDev/openmrs-test/openmrs-core/tools/src/main/java/org/openmrs/tools/doclet/ShouldTaglet.java:[15,28] error: package com.sun.tools.doclets does not exist
  56. [ERROR]
  57. [ERROR] /home/vampire/Projects/WebDev/openmrs-test/openmrs-core/tools/src/main/java/org/openmrs/tools/doclet/ShouldTaglet.java:[20,37] error: cannot find symbol
  58. [ERROR]
  59. [ERROR]  class Taglet
  60. [ERROR] /home/vampire/Projects/WebDev/openmrs-test/openmrs-core/tools/src/main/java/org/openmrs/tools/doclet/ShouldTaglet.java:[29,1] error: method does not override or implement a method from a supertype
  61. [ERROR]
  62. [ERROR] /home/vampire/Projects/WebDev/openmrs-test/openmrs-core/tools/src/main/java/org/openmrs/tools/doclet/ShouldTaglet.java:[40,1] error: method does not override or implement a method from a supertype
  63. [ERROR]
  64. [ERROR] /home/vampire/Projects/WebDev/openmrs-test/openmrs-core/tools/src/main/java/org/openmrs/tools/doclet/ShouldTaglet.java:[51,1] error: method does not override or implement a method from a supertype
  65. [ERROR]
  66. [ERROR] /home/vampire/Projects/WebDev/openmrs-test/openmrs-core/tools/src/main/java/org/openmrs/tools/doclet/ShouldTaglet.java:[62,1] error: method does not override or implement a method from a supertype
  67. [ERROR]
  68. [ERROR] /home/vampire/Projects/WebDev/openmrs-test/openmrs-core/tools/src/main/java/org/openmrs/tools/doclet/ShouldTaglet.java:[73,1] error: method does not override or implement a method from a supertype
  69. [ERROR]
  70. [ERROR] /home/vampire/Projects/WebDev/openmrs-test/openmrs-core/tools/src/main/java/org/openmrs/tools/doclet/ShouldTaglet.java:[84,1] error: method does not override or implement a method from a supertype
  71. [ERROR]
  72. [ERROR] /home/vampire/Projects/WebDev/openmrs-test/openmrs-core/tools/src/main/java/org/openmrs/tools/doclet/ShouldTaglet.java:[96,1] error: method does not override or implement a method from a supertype
  73. [ERROR]
  74. [ERROR] /home/vampire/Projects/WebDev/openmrs-test/openmrs-core/tools/src/main/java/org/openmrs/tools/doclet/ShouldTaglet.java:[107,1] error: method does not override or implement a method from a supertype
  75. [ERROR]
  76. [ERROR] /home/vampire/Projects/WebDev/openmrs-test/openmrs-core/tools/src/main/java/org/openmrs/tools/doclet/ShouldTaglet.java:[119,2] error: cannot find symbol
  77. [ERROR]
  78. [ERROR]  class ShouldTaglet
  79. [ERROR] /home/vampire/Projects/WebDev/openmrs-test/openmrs-core/tools/src/main/java/org/openmrs/tools/doclet/ShouldTaglet.java:[119,14] error: cannot find symbol
  80. [ERROR]
  81. [ERROR]  class ShouldTaglet
  82. [ERROR] /home/vampire/Projects/WebDev/openmrs-test/openmrs-core/tools/src/main/java/org/openmrs/tools/doclet/ShouldTaglet.java:[132,1] error: method does not override or implement a method from a supertype
  83. [ERROR]
  84. [ERROR] /home/vampire/Projects/WebDev/openmrs-test/openmrs-core/tools/src/main/java/org/openmrs/tools/doclet/ShouldTaglet.java:[143,1] error: method does not override or implement a method from a supertype
  85. [ERROR] -> [Help 1]
  86. [ERROR]
  87. [ERROR] To see the full stack trace of the errors, re-run Maven with the -e switch.
  88. [ERROR] Re-run Maven using the -X switch to enable full debug logging.
  89. [ERROR]
  90. [ERROR] For more information about the errors and possible solutions, please read the following articles:
  91. [ERROR] [Help 1] http://cwiki.apache.org/confluence/display/MAVEN/MojoFailureException
  92. [ERROR]
  93. [ERROR] After correcting the problems, you can resume the build with the command
  94. [ERROR]   mvn <goals> -rf :openmrs-tools
Advertisement
Add Comment
Please, Sign In to add comment