SHARE
TWEET

AUR gzdoom-git compilation error

a guest Oct 8th, 2019 91 Never
Not a member of Pastebin yet? Sign Up, it unlocks many cool features!
  1. Scanning dependencies of target zdoom
  2. [ 49%] Building CXX object src/CMakeFiles/zdoom.dir/__autostart.cpp.o
  3. [ 49%] Building CXX object src/CMakeFiles/zdoom.dir/posix/i_steam.cpp.o
  4. [ 49%] Building C object src/CMakeFiles/zdoom.dir/posix/sdl/crashcatcher.c.o
  5. [ 49%] Building CXX object src/CMakeFiles/zdoom.dir/posix/sdl/hardware.cpp.o
  6. [ 50%] Building CXX object src/CMakeFiles/zdoom.dir/posix/sdl/i_gui.cpp.o
  7. [ 50%] Building CXX object src/CMakeFiles/zdoom.dir/posix/sdl/i_input.cpp.o
  8. [ 50%] Building CXX object src/CMakeFiles/zdoom.dir/posix/sdl/i_joystick.cpp.o
  9. [ 50%] Building CXX object src/CMakeFiles/zdoom.dir/posix/sdl/i_main.cpp.o
  10. [ 50%] Building CXX object src/CMakeFiles/zdoom.dir/posix/sdl/i_system.cpp.o
  11. /home/badr/.cache/yay/gzdoom-git/src/gzdoom/src/posix/sdl/i_system.cpp: In function ‘void Linux_I_FatalError(const char*)’:
  12. /home/badr/.cache/yay/gzdoom-git/src/gzdoom/src/posix/sdl/i_system.cpp:128:3: error: ‘I_FatalError_Gtk’ was not declared in this scope; did you mean ‘I_ShowFatalError_Gtk’?
  13.   128 |   I_FatalError_Gtk(errortext);
  14.       |   ^~~~~~~~~~~~~~~~
  15.       |   I_ShowFatalError_Gtk
  16. make[2]: *** [src/CMakeFiles/zdoom.dir/build.make:188: src/CMakeFiles/zdoom.dir/posix/sdl/i_system.cpp.o] Error 1
  17. make[1]: *** [CMakeFiles/Makefile2:1464: src/CMakeFiles/zdoom.dir/all] Error 2
  18. make: *** [Makefile:130: all] Error 2
  19. ==> ERROR: A failure occurred in build().
  20.     Aborting...
RAW Paste Data
We use cookies for various purposes including analytics. By continuing to use Pastebin, you agree to our use of cookies as described in the Cookies Policy. OK, I Understand
Top