AFire_YT

Untitled

Mar 3rd, 2026 (edited)
137
0
Never
Not a member of Pastebin yet? Sign Up, it unlocks many cool features!
text 3.63 KB | Help | 0 0
  1. Executing Gradle synchronization tasks
  2. Build info: MCreator 2025.3.45720, neoforge-1.21.1, 64-bit, 32060 MB, Windows 11, JVM 21.0.8, JAVA_HOME: C:\Program Files\Pylo\MCreator\jdk, started on: 2026-03-04-02:01:31
  3.  
  4. > Task :createMinecraftArtifacts
  5. > Task :createMinecraftArtifacts FAILED
  6. FAILURE: Build failed with an exception.
  7. * What went wrong:
  8. Execution failed for task ':createMinecraftArtifacts'.
  9. > Error while evaluating property 'artifactManifestEntries' of task ':createMinecraftArtifacts'.
  10. > Could not resolve all artifacts for configuration ':neoFormRuntimeExternalTools'.
  11. > Could not download DiffPatch-2.0.0.36-all.jar (io.codechicken:DiffPatch:2.0.0.36)
  12. > Could not get resource 'https://maven.neoforged.net/releases/io/codechicken/DiffPatch/2.0.0.36/DiffPatch-2.0.0.36-all.jar'.
  13. > Read timed out
  14. > Could not download jst-cli-bundle-1.0.74.jar (net.neoforged.jst:jst-cli-bundle:1.0.74)
  15. > Could not get resource 'https://maven.neoforged.net/releases/net/neoforged/jst/jst-cli-bundle/1.0.74/jst-cli-bundle-1.0.74.jar'.
  16. > Read timed out
  17. > Could not download mergetool-1.1.7-fatjar.jar (net.minecraftforge:mergetool:1.1.7)
  18. > Could not get resource 'https://maven.neoforged.net/releases/net/minecraftforge/mergetool/1.1.7/mergetool-1.1.7-fatjar.jar'.
  19. > Read timed out
  20. > Could not download Quack-0.4.10.101.jar (net.covers1624:Quack:0.4.10.101)
  21. > Could not get resource 'https://maven.neoforged.net/releases/net/covers1624/Quack/0.4.10.101/Quack-0.4.10.101.jar'.
  22. > Read timed out
  23. > Could not download fastutil-8.3.1.jar (it.unimi.dsi:fastutil:8.3.1)
  24. > Could not get resource 'https://maven.neoforged.net/releases/it/unimi/dsi/fastutil/8.3.1/fastutil-8.3.1.jar'.
  25. > Read timed out
  26. > Could not download commons-lang3-3.9.jar (org.apache.commons:commons-lang3:3.9)
  27. > Could not get resource 'https://maven.neoforged.net/releases/org/apache/commons/commons-lang3/3.9/commons-lang3-3.9.jar'.
  28. > Read timed out
  29. > Could not download commons-compress-1.18.jar (org.apache.commons:commons-compress:1.18)
  30. > Could not get resource 'https://maven.neoforged.net/releases/org/apache/commons/commons-compress/1.18/commons-compress-1.18.jar'.
  31. > Read timed out
  32. > Could not download xz-1.8.jar (org.tukaani:xz:1.8)
  33. > Could not get resource 'https://maven.neoforged.net/releases/org/tukaani/xz/1.8/xz-1.8.jar'.
  34. > Read timed out
  35. > Could not download asm-util-9.5.jar (org.ow2.asm:asm-util:9.5)
  36. > Could not get resource 'https://maven.neoforged.net/releases/org/ow2/asm/asm-util/9.5/asm-util-9.5.jar'.
  37. > Read timed out
  38. > Could not download asm-analysis-9.5.jar (org.ow2.asm:asm-analysis:9.5)
  39. > Could not get resource 'https://maven.neoforged.net/releases/org/ow2/asm/asm-analysis/9.5/asm-analysis-9.5.jar'.
  40. > Read timed out
  41. > Could not download asm-tree-9.5.jar (org.ow2.asm:asm-tree:9.5)
  42. > Could not get resource 'https://maven.neoforged.net/releases/org/ow2/asm/asm-tree/9.5/asm-tree-9.5.jar'.
  43. > Read timed out
  44. > Could not download asm-9.5.jar (org.ow2.asm:asm:9.5)
  45. > Could not get resource 'https://maven.neoforged.net/releases/org/ow2/asm/asm/9.5/asm-9.5.jar'.
  46. > Read timed out
  47. > Could not download srgutils-0.4.15.jar (net.minecraftforge:srgutils:0.4.15)
  48. > Could not get resource 'https://maven.neoforged.net/releases/net/minecraftforge/srgutils/0.4.15/srgutils-0.4.15.jar'.
  49. > Read timed out
  50. * Try:
  51. > Run with --stacktrace option to get the stack trace.
  52. > Run with --info or --debug option to get more log output.
  53. > Run with --scan to generate a Build Scan (Powered by Develocity).
  54. > Get more help at https://help.gradle.org.
  55. BUILD FAILED in 1m 44s
  56. 1 actionable task: 1 executed
  57.  
  58. BUILD FAILED
  59. Task completed in 1 minute and 45 seconds
Advertisement
Add Comment
Please, Sign In to add comment