Not a member of Pastebin yet?
Sign Up,
it unlocks many cool features!
- Performing C++ SOURCE FILE Test FLAG_MISSING_VARIABLE_DECLARATIONS failed with the following output:
- Change Dir: /home/gerbality/Dolphin/dolphin-master/Build/CMakeFiles/CMakeTmp
- Run Build Command:/usr/bin/gmake "cmTryCompileExec610284542/fast"
- /usr/bin/gmake -f CMakeFiles/cmTryCompileExec610284542.dir/build.make CMakeFiles/cmTryCompileExec610284542.dir/build
- gmake[1]: Entering directory `/home/gerbality/Dolphin/dolphin-master/Build/CMakeFiles/CMakeTmp'
- /usr/bin/cmake -E cmake_progress_report /home/gerbality/Dolphin/dolphin-master/Build/CMakeFiles/CMakeTmp/CMakeFiles 1
- Building CXX object CMakeFiles/cmTryCompileExec610284542.dir/src.cxx.o
- /usr/bin/c++ -Wtype-limits -Wsign-compare -Wignored-qualifiers -Wuninitialized -Wlogical-op -Wshadow -Winit-self -Wmissing-declarations -DFLAG_MISSING_VARIABLE_DECLARATIONS -Wmissing-variable-declarations -o CMakeFiles/cmTryCompileExec610284542.dir/src.cxx.o -c /home/gerbality/Dolphin/dolphin-master/Build/CMakeFiles/CMakeTmp/src.cxx
- cc1plus: error: unrecognized command line option "-Wmissing-variable-declarations"
- gmake[1]: Leaving directory `/home/gerbality/Dolphin/dolphin-master/Build/CMakeFiles/CMakeTmp'
- gmake[1]: *** [CMakeFiles/cmTryCompileExec610284542.dir/src.cxx.o] Error 1
- gmake: *** [cmTryCompileExec610284542/fast] Error 2
- Source file was:
- int main() { return 0;}
- Performing C++ SOURCE FILE Test PORTAUDIO failed with the following output:
- Change Dir: /home/gerbality/Dolphin/dolphin-master/Build/CMakeFiles/CMakeTmp
- Run Build Command:/usr/bin/gmake "cmTryCompileExec3364632903/fast"
- /usr/bin/gmake -f CMakeFiles/cmTryCompileExec3364632903.dir/build.make CMakeFiles/cmTryCompileExec3364632903.dir/build
- gmake[1]: Entering directory `/home/gerbality/Dolphin/dolphin-master/Build/CMakeFiles/CMakeTmp'
- /usr/bin/cmake -E cmake_progress_report /home/gerbality/Dolphin/dolphin-master/Build/CMakeFiles/CMakeTmp/CMakeFiles 1
- Building CXX object CMakeFiles/cmTryCompileExec3364632903.dir/src.cxx.o
- /usr/bin/c++ -Wtype-limits -Wsign-compare -Wignored-qualifiers -Wuninitialized -Wlogical-op -Wshadow -Winit-self -Wmissing-declarations -fvisibility-inlines-hidden -fvisibility=hidden -DPORTAUDIO -o CMakeFiles/cmTryCompileExec3364632903.dir/src.cxx.o -c /home/gerbality/Dolphin/dolphin-master/Build/CMakeFiles/CMakeTmp/src.cxx
- /home/gerbality/Dolphin/dolphin-master/Build/CMakeFiles/CMakeTmp/src.cxx:1:23: error: portaudio.h: No such file or directory
- /home/gerbality/Dolphin/dolphin-master/Build/CMakeFiles/CMakeTmp/src.cxx: In function ‘int main(int, char**)’:
- /home/gerbality/Dolphin/dolphin-master/Build/CMakeFiles/CMakeTmp/src.cxx:3: error: ‘Pa_GetVersion’ was not declared in this scope
- gmake[1]: *** [CMakeFiles/cmTryCompileExec3364632903.dir/src.cxx.o] Error 1
- gmake[1]: Leaving directory `/home/gerbality/Dolphin/dolphin-master/Build/CMakeFiles/CMakeTmp'
- gmake: *** [cmTryCompileExec3364632903/fast] Error 2
- Return value: 1
- Source file was:
- #include <portaudio.h>
- int main(int argc, char **argv)
- { if(Pa_GetVersion() >= 1890) return 0; else return 1; }
- Determining if the pthread_create exist failed with the following output:
- Change Dir: /home/gerbality/Dolphin/dolphin-master/Build/CMakeFiles/CMakeTmp
- Run Build Command:/usr/bin/gmake "cmTryCompileExec660224545/fast"
- /usr/bin/gmake -f CMakeFiles/cmTryCompileExec660224545.dir/build.make CMakeFiles/cmTryCompileExec660224545.dir/build
- gmake[1]: Entering directory `/home/gerbality/Dolphin/dolphin-master/Build/CMakeFiles/CMakeTmp'
- /usr/bin/cmake -E cmake_progress_report /home/gerbality/Dolphin/dolphin-master/Build/CMakeFiles/CMakeTmp/CMakeFiles 1
- Building C object CMakeFiles/cmTryCompileExec660224545.dir/CheckSymbolExists.c.o
- /usr/bin/cc -o CMakeFiles/cmTryCompileExec660224545.dir/CheckSymbolExists.c.o -c /home/gerbality/Dolphin/dolphin-master/Build/CMakeFiles/CMakeTmp/CheckSymbolExists.c
- Linking C executable cmTryCompileExec660224545
- /usr/bin/cmake -E cmake_link_script CMakeFiles/cmTryCompileExec660224545.dir/link.txt --verbose=1
- /usr/bin/cc CMakeFiles/cmTryCompileExec660224545.dir/CheckSymbolExists.c.o -o cmTryCompileExec660224545 -rdynamic
- CMakeFiles/cmTryCompileExec660224545.dir/CheckSymbolExists.c.o: In function `main':
- CheckSymbolExists.c:(.text+0xc): undefined reference to `pthread_create'
- collect2: ld returned 1 exit status
- gmake[1]: *** [cmTryCompileExec660224545] Error 1
- gmake[1]: Leaving directory `/home/gerbality/Dolphin/dolphin-master/Build/CMakeFiles/CMakeTmp'
- gmake: *** [cmTryCompileExec660224545/fast] Error 2
- File /home/gerbality/Dolphin/dolphin-master/Build/CMakeFiles/CMakeTmp/CheckSymbolExists.c:
- /* */
- #include <pthread.h>
- int main(int argc, char** argv)
- {
- (void)argv;
- #ifndef pthread_create
- return ((int*)(&pthread_create))[argc];
- #else
- (void)argc;
- return 0;
- #endif
- }
- Determining if the function pthread_create exists in the pthreads failed with the following output:
- Change Dir: /home/gerbality/Dolphin/dolphin-master/Build/CMakeFiles/CMakeTmp
- Run Build Command:/usr/bin/gmake "cmTryCompileExec1632430939/fast"
- /usr/bin/gmake -f CMakeFiles/cmTryCompileExec1632430939.dir/build.make CMakeFiles/cmTryCompileExec1632430939.dir/build
- gmake[1]: Entering directory `/home/gerbality/Dolphin/dolphin-master/Build/CMakeFiles/CMakeTmp'
- /usr/bin/cmake -E cmake_progress_report /home/gerbality/Dolphin/dolphin-master/Build/CMakeFiles/CMakeTmp/CMakeFiles 1
- Building C object CMakeFiles/cmTryCompileExec1632430939.dir/CheckFunctionExists.c.o
- /usr/bin/cc -DCHECK_FUNCTION_EXISTS=pthread_create -o CMakeFiles/cmTryCompileExec1632430939.dir/CheckFunctionExists.c.o -c /usr/share/cmake/Modules/CheckFunctionExists.c
- Linking C executable cmTryCompileExec1632430939
- /usr/bin/cmake -E cmake_link_script CMakeFiles/cmTryCompileExec1632430939.dir/link.txt --verbose=1
- /usr/bin/cc -DCHECK_FUNCTION_EXISTS=pthread_create CMakeFiles/cmTryCompileExec1632430939.dir/CheckFunctionExists.c.o -o cmTryCompileExec1632430939 -rdynamic -lpthreads
- /usr/bin/ld: cannot find -lpthreads
- collect2: ld returned 1 exit status
- gmake[1]: Leaving directory `/home/gerbality/Dolphin/dolphin-master/Build/CMakeFiles/CMakeTmp'
- gmake[1]: *** [cmTryCompileExec1632430939] Error 1
- gmake: *** [cmTryCompileExec1632430939/fast] Error 2
Advertisement
Add Comment
Please, Sign In to add comment