SHARE
TWEET

Untitled

a guest Nov 19th, 2017 29 Never
Not a member of Pastebin yet? Sign Up, it unlocks many cool features!
  1. [ 97%] Linking C executable pantheon-mail
  2. /usr/sbin/ld: warning: libicui18n.so.59, needed by /usr/lib/gcc/x86_64-pc-linux-gnu/7.2.0/../../../../lib/libwebkitgtk-3.0.so, not found (try using -rpath or -rpath-link)
  3. /usr/sbin/ld: warning: libicuuc.so.59, needed by /usr/lib/gcc/x86_64-pc-linux-gnu/7.2.0/../../../../lib/libwebkitgtk-3.0.so, not found (try using -rpath or -rpath-link)
  4. /usr/sbin/ld: warning: libicudata.so.59, needed by /usr/lib/gcc/x86_64-pc-linux-gnu/7.2.0/../../../../lib/libdee-1.0.so, not found (try using -rpath or -rpath-link)
  5. /usr/lib/gcc/x86_64-pc-linux-gnu/7.2.0/../../../../lib/libwebkitgtk-3.0.so: undefined reference to `cairo_gl_surface_get_width'
  6. /usr/lib/gcc/x86_64-pc-linux-gnu/7.2.0/../../../../lib/libwebkitgtk-3.0.so: undefined reference to `usearch_setText_59'
  7. /usr/lib/gcc/x86_64-pc-linux-gnu/7.2.0/../../../../lib/libwebkitgtk-3.0.so: undefined reference to `cairo_gl_surface_get_height'
  8. /usr/lib/gcc/x86_64-pc-linux-gnu/7.2.0/../../../../lib/libjavascriptcoregtk-3.0.so: undefined reference to `u_strFoldCase_59'
  9. /usr/lib/gcc/x86_64-pc-linux-gnu/7.2.0/../../../../lib/libwebkitgtk-3.0.so: undefined reference to `cairo_gl_device_set_thread_aware'
  10. /usr/lib/gcc/x86_64-pc-linux-gnu/7.2.0/../../../../lib/libjavascriptcoregtk-3.0.so: undefined reference to `udat_format_59'
  11. /usr/lib/gcc/x86_64-pc-linux-gnu/7.2.0/../../../../lib/libwebkitgtk-3.0.so: undefined reference to `ucnv_getAlias_59'
  12. /usr/lib/gcc/x86_64-pc-linux-gnu/7.2.0/../../../../lib/libjavascriptcoregtk-3.0.so: undefined reference to `ucol_strcoll_59'
  13. /usr/lib/gcc/x86_64-pc-linux-gnu/7.2.0/../../../../lib/libwebkitgtk-3.0.so: undefined reference to `ucnv_reset_59'
  14. /usr/lib/gcc/x86_64-pc-linux-gnu/7.2.0/../../../../lib/libwebkitgtk-3.0.so: undefined reference to `ublock_getCode_59'
  15. /usr/lib/gcc/x86_64-pc-linux-gnu/7.2.0/../../../../lib/libwebkitgtk-3.0.so: undefined reference to `u_toupper_59'
  16. /usr/lib/gcc/x86_64-pc-linux-gnu/7.2.0/../../../../lib/libwebkitgtk-3.0.so: undefined reference to `usearch_setOffset_59'
  17. /usr/lib/gcc/x86_64-pc-linux-gnu/7.2.0/../../../../lib/libwebkitgtk-3.0.so: undefined reference to `ucnv_setToUCallBack_59'
  18. /usr/lib/gcc/x86_64-pc-linux-gnu/7.2.0/../../../../lib/libwebkitgtk-3.0.so: undefined reference to `cairo_egl_device_create'
  19. /usr/lib/gcc/x86_64-pc-linux-gnu/7.2.0/../../../../lib/libdee-1.0.so: undefined reference to `utrans_close_59'
  20. /usr/lib/gcc/x86_64-pc-linux-gnu/7.2.0/../../../../lib/libjavascriptcoregtk-3.0.so: undefined reference to `ucol_getLocaleByType_59'
  21. /usr/lib/gcc/x86_64-pc-linux-gnu/7.2.0/../../../../lib/libwebkitgtk-3.0.so: undefined reference to `UCNV_FROM_U_CALLBACK_SUBSTITUTE_59'
  22. /usr/lib/gcc/x86_64-pc-linux-gnu/7.2.0/../../../../lib/libwebkitgtk-3.0.so: undefined reference to `u_charMirror_59'
  23. /usr/lib/gcc/x86_64-pc-linux-gnu/7.2.0/../../../../lib/libwebkitgtk-3.0.so: undefined reference to `ucnv_setFallback_59'
  24. /usr/lib/gcc/x86_64-pc-linux-gnu/7.2.0/../../../../lib/libwebkitgtk-3.0.so: undefined reference to `vtable for icu_59::UnicodeString'
  25. /usr/lib/gcc/x86_64-pc-linux-gnu/7.2.0/../../../../lib/libwebkitgtk-3.0.so: undefined reference to `ucnv_setFromUCallBack_59'
  26. /usr/lib/gcc/x86_64-pc-linux-gnu/7.2.0/../../../../lib/libwebkitgtk-3.0.so: undefined reference to `uscript_getScript_59'
  27. /usr/lib/gcc/x86_64-pc-linux-gnu/7.2.0/../../../../lib/libwebkitgtk-3.0.so: undefined reference to `ucnv_setSubstChars_59'
  28. /usr/lib/gcc/x86_64-pc-linux-gnu/7.2.0/../../../../lib/libwebkitgtk-3.0.so: undefined reference to `u_isprint_59'
  29. /usr/lib/gcc/x86_64-pc-linux-gnu/7.2.0/../../../../lib/libwebkitgtk-3.0.so: undefined reference to `usearch_next_59'
  30. /usr/lib/gcc/x86_64-pc-linux-gnu/7.2.0/../../../../lib/libwebkitgtk-3.0.so: undefined reference to `ucnv_countAvailable_59'
  31. /usr/lib/gcc/x86_64-pc-linux-gnu/7.2.0/../../../../lib/libwebkitgtk-3.0.so: undefined reference to `icu_59::UnicodeString::UnicodeString(char16_t const*, int)'
  32. /usr/lib/gcc/x86_64-pc-linux-gnu/7.2.0/../../../../lib/libwebkitgtk-3.0.so: undefined reference to `ubrk_open_59'
  33. /usr/lib/gcc/x86_64-pc-linux-gnu/7.2.0/../../../../lib/libwebkitgtk-3.0.so: undefined reference to `ucnv_cbFromUWriteUChars_59'
  34. /usr/lib/gcc/x86_64-pc-linux-gnu/7.2.0/../../../../lib/libwebkitgtk-3.0.so: undefined reference to `ucnv_fromUnicode_59'
  35. /usr/lib/gcc/x86_64-pc-linux-gnu/7.2.0/../../../../lib/libwebkitgtk-3.0.so: undefined reference to `uset_close_59'
  36. /usr/lib/gcc/x86_64-pc-linux-gnu/7.2.0/../../../../lib/libjavascriptcoregtk-3.0.so: undefined reference to `udat_open_59'
  37. /usr/lib/gcc/x86_64-pc-linux-gnu/7.2.0/../../../../lib/libwebkitgtk-3.0.so: undefined reference to `uset_openPattern_59'
  38. /usr/lib/gcc/x86_64-pc-linux-gnu/7.2.0/../../../../lib/libwebkitgtk-3.0.so: undefined reference to `unorm_quickCheck_59'
  39. /usr/lib/gcc/x86_64-pc-linux-gnu/7.2.0/../../../../lib/libwebkitgtk-3.0.so: undefined reference to `cairo_gl_surface_create_for_texture'
  40. /usr/lib/gcc/x86_64-pc-linux-gnu/7.2.0/../../../../lib/libwebkitgtk-3.0.so: undefined reference to `ucol_setStrength_59'
  41. /usr/lib/gcc/x86_64-pc-linux-gnu/7.2.0/../../../../lib/libwebkitgtk-3.0.so: undefined reference to `uset_add_59'
  42. /usr/lib/gcc/x86_64-pc-linux-gnu/7.2.0/../../../../lib/libwebkitgtk-3.0.so: undefined reference to `usearch_setAttribute_59'
  43. /usr/lib/gcc/x86_64-pc-linux-gnu/7.2.0/../../../../lib/libwebkitgtk-3.0.so: undefined reference to `icu_59::UnicodeString::~UnicodeString()'
  44. /usr/lib/gcc/x86_64-pc-linux-gnu/7.2.0/../../../../lib/libwebkitgtk-3.0.so: undefined reference to `ucnv_getAvailableName_59'
  45. /usr/lib/gcc/x86_64-pc-linux-gnu/7.2.0/../../../../lib/libdee-1.0.so: undefined reference to `u_strFromUTF8Lenient_59'
  46. /usr/lib/gcc/x86_64-pc-linux-gnu/7.2.0/../../../../lib/libwebkitgtk-3.0.so: undefined reference to `uset_addAll_59'
  47. /usr/lib/gcc/x86_64-pc-linux-gnu/7.2.0/../../../../lib/libwebkitgtk-3.0.so: undefined reference to `ucnv_cbFromUWriteBytes_59'
  48. /usr/lib/gcc/x86_64-pc-linux-gnu/7.2.0/../../../../lib/libwebkitgtk-3.0.so: undefined reference to `ubrk_close_59'
  49. /usr/lib/gcc/x86_64-pc-linux-gnu/7.2.0/../../../../lib/libjavascriptcoregtk-3.0.so: undefined reference to `u_memcasecmp_59'
  50. /usr/lib/gcc/x86_64-pc-linux-gnu/7.2.0/../../../../lib/libwebkitgtk-3.0.so: undefined reference to `ucnv_toUnicode_59'
  51. /usr/lib/gcc/x86_64-pc-linux-gnu/7.2.0/../../../../lib/libwebkitgtk-3.0.so: undefined reference to `UCNV_TO_U_CALLBACK_SUBSTITUTE_59'
  52. /usr/lib/gcc/x86_64-pc-linux-gnu/7.2.0/../../../../lib/libwebkitgtk-3.0.so: undefined reference to `usearch_getMatchedLength_59'
  53. /usr/lib/gcc/x86_64-pc-linux-gnu/7.2.0/../../../../lib/libjavascriptcoregtk-3.0.so: undefined reference to `ucol_setAttribute_59'
  54. /usr/lib/gcc/x86_64-pc-linux-gnu/7.2.0/../../../../lib/libdee-1.0.so: undefined reference to `utrans_transUChars_59'
  55. /usr/lib/gcc/x86_64-pc-linux-gnu/7.2.0/../../../../lib/libwebkitgtk-3.0.so: undefined reference to `ubrk_last_59'
  56. /usr/lib/gcc/x86_64-pc-linux-gnu/7.2.0/../../../../lib/libwebkitgtk-3.0.so: undefined reference to `u_totitle_59'
  57. /usr/lib/gcc/x86_64-pc-linux-gnu/7.2.0/../../../../lib/libwebkitgtk-3.0.so: undefined reference to `usearch_getCollator_59'
  58. /usr/lib/gcc/x86_64-pc-linux-gnu/7.2.0/../../../../lib/libwebkitgtk-3.0.so: undefined reference to `u_tolower_59'
  59. /usr/lib/gcc/x86_64-pc-linux-gnu/7.2.0/../../../../lib/libwebkitgtk-3.0.so: undefined reference to `ucnv_open_59'
  60. /usr/lib/gcc/x86_64-pc-linux-gnu/7.2.0/../../../../lib/libwebkitgtk-3.0.so: undefined reference to `u_islower_59'
  61. /usr/lib/gcc/x86_64-pc-linux-gnu/7.2.0/../../../../lib/libwebkitgtk-3.0.so: undefined reference to `utext_setup_59'
  62. /usr/lib/gcc/x86_64-pc-linux-gnu/7.2.0/../../../../lib/libwebkitgtk-3.0.so: undefined reference to `ubrk_isBoundary_59'
  63. /usr/lib/gcc/x86_64-pc-linux-gnu/7.2.0/../../../../lib/libwebkitgtk-3.0.so: undefined reference to `u_getIntPropertyValue_59'
  64. /usr/lib/gcc/x86_64-pc-linux-gnu/7.2.0/../../../../lib/libwebkitgtk-3.0.so: undefined reference to `ubrk_openRules_59'
  65. /usr/lib/gcc/x86_64-pc-linux-gnu/7.2.0/../../../../lib/libjavascriptcoregtk-3.0.so: undefined reference to `udat_close_59'
  66. /usr/lib/gcc/x86_64-pc-linux-gnu/7.2.0/../../../../lib/libwebkitgtk-3.0.so: undefined reference to `ucnv_close_59'
  67. /usr/lib/gcc/x86_64-pc-linux-gnu/7.2.0/../../../../lib/libwebkitgtk-3.0.so: undefined reference to `ubrk_setUText_59'
  68. /usr/lib/gcc/x86_64-pc-linux-gnu/7.2.0/../../../../lib/libwebkitgtk-3.0.so: undefined reference to `usearch_open_59'
  69. /usr/lib/gcc/x86_64-pc-linux-gnu/7.2.0/../../../../lib/libwebkitgtk-3.0.so: undefined reference to `u_ispunct_59'
  70. /usr/lib/gcc/x86_64-pc-linux-gnu/7.2.0/../../../../lib/libjavascriptcoregtk-3.0.so: undefined reference to `ucol_close_59'
  71. /usr/lib/gcc/x86_64-pc-linux-gnu/7.2.0/../../../../lib/libwebkitgtk-3.0.so: undefined reference to `ubrk_previous_59'
  72. /usr/lib/gcc/x86_64-pc-linux-gnu/7.2.0/../../../../lib/libwebkitgtk-3.0.so: undefined reference to `u_charType_59'
  73. /usr/lib/gcc/x86_64-pc-linux-gnu/7.2.0/../../../../lib/libwebkitgtk-3.0.so: undefined reference to `ubrk_setText_59'
  74. /usr/lib/gcc/x86_64-pc-linux-gnu/7.2.0/../../../../lib/libwebkitgtk-3.0.so: undefined reference to `utext_close_59'
  75. /usr/lib/gcc/x86_64-pc-linux-gnu/7.2.0/../../../../lib/libwebkitgtk-3.0.so: undefined reference to `ucnv_countAliases_59'
  76. /usr/lib/gcc/x86_64-pc-linux-gnu/7.2.0/../../../../lib/libwebkitgtk-3.0.so: undefined reference to `cairo_glx_device_create'
  77. /usr/lib/gcc/x86_64-pc-linux-gnu/7.2.0/../../../../lib/libwebkitgtk-3.0.so: undefined reference to `u_isalnum_59'
  78. /usr/lib/gcc/x86_64-pc-linux-gnu/7.2.0/../../../../lib/libwebkitgtk-3.0.so: undefined reference to `u_charDirection_59'
  79. /usr/lib/gcc/x86_64-pc-linux-gnu/7.2.0/../../../../lib/libwebkitgtk-3.0.so: undefined reference to `icu_59::Normalizer::normalize(icu_59::UnicodeString const&, UNormalizationMode, int, icu_59::UnicodeString&, UErrorCode&)'
  80. /usr/lib/gcc/x86_64-pc-linux-gnu/7.2.0/../../../../lib/libwebkitgtk-3.0.so: undefined reference to `u_foldCase_59'
  81. /usr/lib/gcc/x86_64-pc-linux-gnu/7.2.0/../../../../lib/libjavascriptcoregtk-3.0.so: undefined reference to `ucol_open_59'
  82. /usr/lib/gcc/x86_64-pc-linux-gnu/7.2.0/../../../../lib/libwebkitgtk-3.0.so: undefined reference to `ubrk_current_59'
  83. /usr/lib/gcc/x86_64-pc-linux-gnu/7.2.0/../../../../lib/libwebkitgtk-3.0.so: undefined reference to `uidna_IDNToASCII_59'
  84. /usr/lib/gcc/x86_64-pc-linux-gnu/7.2.0/../../../../lib/libwebkitgtk-3.0.so: undefined reference to `ucnv_getStandardName_59'
  85. /usr/lib/gcc/x86_64-pc-linux-gnu/7.2.0/../../../../lib/libwebkitgtk-3.0.so: undefined reference to `unorm_normalize_59'
  86. /usr/lib/gcc/x86_64-pc-linux-gnu/7.2.0/../../../../lib/libwebkitgtk-3.0.so: undefined reference to `ubrk_preceding_59'
  87. /usr/lib/gcc/x86_64-pc-linux-gnu/7.2.0/../../../../lib/libjavascriptcoregtk-3.0.so: undefined reference to `u_strToUpper_59'
  88. /usr/lib/gcc/x86_64-pc-linux-gnu/7.2.0/../../../../lib/libwebkitgtk-3.0.so: undefined reference to `ubrk_following_59'
  89. /usr/lib/gcc/x86_64-pc-linux-gnu/7.2.0/../../../../lib/libwebkitgtk-3.0.so: undefined reference to `ucnv_getCanonicalName_59'
  90. /usr/lib/gcc/x86_64-pc-linux-gnu/7.2.0/../../../../lib/libwebkitgtk-3.0.so: undefined reference to `ubrk_next_59'
  91. /usr/lib/gcc/x86_64-pc-linux-gnu/7.2.0/../../../../lib/libdee-1.0.so: undefined reference to `u_errorName_59'
  92. /usr/lib/gcc/x86_64-pc-linux-gnu/7.2.0/../../../../lib/libjavascriptcoregtk-3.0.so: undefined reference to `ucol_getAttribute_59'
  93. /usr/lib/gcc/x86_64-pc-linux-gnu/7.2.0/../../../../lib/libwebkitgtk-3.0.so: undefined reference to `ucnv_getName_59'
  94. /usr/lib/gcc/x86_64-pc-linux-gnu/7.2.0/../../../../lib/libwebkitgtk-3.0.so: undefined reference to `u_getCombiningClass_59'
  95. /usr/lib/gcc/x86_64-pc-linux-gnu/7.2.0/../../../../lib/libwebkitgtk-3.0.so: undefined reference to `ucol_getStrength_59'
  96. /usr/lib/gcc/x86_64-pc-linux-gnu/7.2.0/../../../../lib/libwebkitgtk-3.0.so: undefined reference to `usearch_reset_59'
  97. /usr/lib/gcc/x86_64-pc-linux-gnu/7.2.0/../../../../lib/libwebkitgtk-3.0.so: undefined reference to `uscript_hasScript_59'
  98. /usr/lib/gcc/x86_64-pc-linux-gnu/7.2.0/../../../../lib/libwebkitgtk-3.0.so: undefined reference to `uset_contains_59'
  99. /usr/lib/gcc/x86_64-pc-linux-gnu/7.2.0/../../../../lib/libjavascriptcoregtk-3.0.so: undefined reference to `u_strToLower_59'
  100. /usr/lib/gcc/x86_64-pc-linux-gnu/7.2.0/../../../../lib/libwebkitgtk-3.0.so: undefined reference to `uset_addRange_59'
  101. /usr/lib/gcc/x86_64-pc-linux-gnu/7.2.0/../../../../lib/libwebkitgtk-3.0.so: undefined reference to `ubrk_first_59'
  102. /usr/lib/gcc/x86_64-pc-linux-gnu/7.2.0/../../../../lib/libwebkitgtk-3.0.so: undefined reference to `UCNV_FROM_U_CALLBACK_ESCAPE_59'
  103. /usr/lib/gcc/x86_64-pc-linux-gnu/7.2.0/../../../../lib/libdee-1.0.so: undefined reference to `utrans_openU_59'
  104. /usr/lib/gcc/x86_64-pc-linux-gnu/7.2.0/../../../../lib/libwebkitgtk-3.0.so: undefined reference to `usearch_setPattern_59'
  105. /usr/lib/gcc/x86_64-pc-linux-gnu/7.2.0/../../../../lib/libwebkitgtk-3.0.so: undefined reference to `ubrk_getRuleStatus_59'
  106. collect2: error: ld returned 1 exit status
  107. make[2]: *** [src/CMakeFiles/pantheon-mail.dir/build.make:3687: src/pantheon-mail] Error 1
  108. make[1]: *** [CMakeFiles/Makefile2:330: src/CMakeFiles/pantheon-mail.dir/all] Error 2
  109. make: *** [Makefile:130: all] Error 2
  110. ==> ERROR: A failure occurred in build().
  111.     Aborting...
  112. :: failed to build pantheon-mail-git package(s)
RAW Paste Data
We use cookies for various purposes including analytics. By continuing to use Pastebin, you agree to our use of cookies as described in the Cookies Policy. OK, I Understand
 
Top