tterrag1098

Untitled

May 4th, 2020
143
0
Never
Not a member of Pastebin yet? Sign Up, it unlocks many cool features!
text 14.95 KB | None | 0 0
  1. * What went wrong:
  2. Execution failed for task ':mapIntermediaryJar'.
  3. > Failed to remap jar
  4.  
  5. * Try:
  6. Run with --stacktrace option to get the stack trace. Run with --info or --debug
  7. option to get more log output. Run with --scan to get full insights.
  8.  
  9. * Get more help at https://help.gradle.org
  10.  
  11. Deprecated Gradle features were used in this build, making it incompatible with
  12. Gradle 7.0.
  13. Use '--warning-mode all' to show the individual deprecation warnings.
  14. See https://docs.gradle.org/6.0.1/userguide/command_line_interface.html#sec:comm
  15. and_line_warnings
  16.  
  17. BUILD FAILED in 1m 21s
  18. 7 actionable tasks: 7 executed
  19.  
  20. Q:\Development\Misc\yarn-20w08a>gradlew yarn --stacktrace
  21. To honour the JVM settings for this build a new JVM will be forked. Please consi
  22. der using the daemon: https://docs.gradle.org/6.0.1/userguide/gradle_daemon.html
  23. .
  24. Daemon will be stopped at the end of the build stopping after processing
  25.  
  26. > Task :downloadIntermediary
  27. Unable to get progress logger. Download progress will not be displayed.
  28.  
  29. > Task :downloadVersionsManifest
  30. :downloading minecraft versions manifest
  31.  
  32. > Task :downloadMcLibs
  33. :downloading minecraft libraries
  34.  
  35. > Task :downloadMcJars
  36. :downloading minecraft jars
  37. :downloading minecraft client
  38. :downloading minecraft server
  39.  
  40. > Task :mapIntermediaryJar FAILED
  41. :mapping minecraft to intermediary
  42.  
  43. FAILURE: Build failed with an exception.
  44.  
  45. * Where:
  46. Build file 'Q:\Development\Misc\yarn-20w08a\build.gradle' line: 628
  47.  
  48. * What went wrong:
  49. Execution failed for task ':mapIntermediaryJar'.
  50. > Failed to remap jar
  51.  
  52. * Try:
  53. Run with --info or --debug option to get more log output. Run with --scan to get
  54. full insights.
  55.  
  56. * Exception is:
  57. org.gradle.api.tasks.TaskExecutionException: Execution failed for task ':mapInte
  58. rmediaryJar'.
  59. at org.gradle.api.internal.tasks.execution.ExecuteActionsTaskExecuter.la
  60. mbda$executeIfValid$1(ExecuteActionsTaskExecuter.java:187)
  61. at org.gradle.internal.Try$Failure.ifSuccessfulOrElse(Try.java:263)
  62. at org.gradle.api.internal.tasks.execution.ExecuteActionsTaskExecuter.ex
  63. ecuteIfValid(ExecuteActionsTaskExecuter.java:185)
  64. at org.gradle.api.internal.tasks.execution.ExecuteActionsTaskExecuter.ex
  65. ecute(ExecuteActionsTaskExecuter.java:166)
  66. at org.gradle.api.internal.tasks.execution.CleanupStaleOutputsExecuter.e
  67. xecute(CleanupStaleOutputsExecuter.java:109)
  68. at org.gradle.api.internal.tasks.execution.FinalizePropertiesTaskExecute
  69. r.execute(FinalizePropertiesTaskExecuter.java:46)
  70. at org.gradle.api.internal.tasks.execution.ResolveTaskExecutionModeExecu
  71. ter.execute(ResolveTaskExecutionModeExecuter.java:62)
  72. at org.gradle.api.internal.tasks.execution.SkipTaskWithNoActionsExecuter
  73. .execute(SkipTaskWithNoActionsExecuter.java:57)
  74. at org.gradle.api.internal.tasks.execution.SkipOnlyIfTaskExecuter.execut
  75. e(SkipOnlyIfTaskExecuter.java:56)
  76. at org.gradle.api.internal.tasks.execution.CatchExceptionTaskExecuter.ex
  77. ecute(CatchExceptionTaskExecuter.java:36)
  78. at org.gradle.api.internal.tasks.execution.EventFiringTaskExecuter$1.exe
  79. cuteTask(EventFiringTaskExecuter.java:77)
  80. at org.gradle.api.internal.tasks.execution.EventFiringTaskExecuter$1.cal
  81. l(EventFiringTaskExecuter.java:55)
  82. at org.gradle.api.internal.tasks.execution.EventFiringTaskExecuter$1.cal
  83. l(EventFiringTaskExecuter.java:52)
  84. at org.gradle.internal.operations.DefaultBuildOperationExecutor$Callable
  85. BuildOperationWorker.execute(DefaultBuildOperationExecutor.java:416)
  86. at org.gradle.internal.operations.DefaultBuildOperationExecutor$Callable
  87. BuildOperationWorker.execute(DefaultBuildOperationExecutor.java:406)
  88. at org.gradle.internal.operations.DefaultBuildOperationExecutor$1.execut
  89. e(DefaultBuildOperationExecutor.java:165)
  90. at org.gradle.internal.operations.DefaultBuildOperationExecutor.execute(
  91. DefaultBuildOperationExecutor.java:250)
  92. at org.gradle.internal.operations.DefaultBuildOperationExecutor.execute(
  93. DefaultBuildOperationExecutor.java:158)
  94. at org.gradle.internal.operations.DefaultBuildOperationExecutor.call(Def
  95. aultBuildOperationExecutor.java:102)
  96. at org.gradle.internal.operations.DelegatingBuildOperationExecutor.call(
  97. DelegatingBuildOperationExecutor.java:36)
  98. at org.gradle.api.internal.tasks.execution.EventFiringTaskExecuter.execu
  99. te(EventFiringTaskExecuter.java:52)
  100. at org.gradle.execution.plan.LocalTaskNodeExecutor.execute(LocalTaskNode
  101. Executor.java:41)
  102. at org.gradle.execution.taskgraph.DefaultTaskExecutionGraph$InvokeNodeEx
  103. ecutorsAction.execute(DefaultTaskExecutionGraph.java:374)
  104. at org.gradle.execution.taskgraph.DefaultTaskExecutionGraph$InvokeNodeEx
  105. ecutorsAction.execute(DefaultTaskExecutionGraph.java:361)
  106. at org.gradle.execution.taskgraph.DefaultTaskExecutionGraph$BuildOperati
  107. onAwareExecutionAction.execute(DefaultTaskExecutionGraph.java:354)
  108. at org.gradle.execution.taskgraph.DefaultTaskExecutionGraph$BuildOperati
  109. onAwareExecutionAction.execute(DefaultTaskExecutionGraph.java:340)
  110. at org.gradle.execution.plan.DefaultPlanExecutor$ExecutorWorker.lambda$r
  111. un$0(DefaultPlanExecutor.java:127)
  112. at org.gradle.execution.plan.DefaultPlanExecutor$ExecutorWorker.execute(
  113. DefaultPlanExecutor.java:191)
  114. at org.gradle.execution.plan.DefaultPlanExecutor$ExecutorWorker.executeN
  115. extNode(DefaultPlanExecutor.java:182)
  116. at org.gradle.execution.plan.DefaultPlanExecutor$ExecutorWorker.run(Defa
  117. ultPlanExecutor.java:124)
  118. at org.gradle.internal.concurrent.ExecutorPolicy$CatchAndRecordFailures.
  119. onExecute(ExecutorPolicy.java:64)
  120. at org.gradle.internal.concurrent.ManagedExecutorImpl$1.run(ManagedExecu
  121. torImpl.java:48)
  122. at org.gradle.internal.concurrent.ThreadFactoryImpl$ManagedThreadRunnabl
  123. e.run(ThreadFactoryImpl.java:56)
  124. Caused by: java.lang.RuntimeException: Failed to remap jar
  125. at build_buuc9ek6wsv1nblsrigm2gp3q.mapJar(Q:\Development\Misc\yarn-20w08
  126. a\build.gradle:638)
  127. at org.gradle.internal.metaobject.BeanDynamicObject$MetaClassAdapter.inv
  128. okeMethod(BeanDynamicObject.java:483)
  129. at org.gradle.internal.metaobject.BeanDynamicObject.tryInvokeMethod(Bean
  130. DynamicObject.java:195)
  131. at org.gradle.groovy.scripts.BasicScript$ScriptDynamicObject.tryInvokeMe
  132. thod(BasicScript.java:130)
  133. at org.gradle.internal.metaobject.ConfigureDelegate.invokeMethod(Configu
  134. reDelegate.java:77)
  135. at build_buuc9ek6wsv1nblsrigm2gp3q$_run_closure12$_closure51.doCall(Q:\D
  136. evelopment\Misc\yarn-20w08a\build.gradle:304)
  137. at org.gradle.api.internal.AbstractTask$ClosureTaskAction.execute(Abstra
  138. ctTask.java:664)
  139. at org.gradle.api.internal.AbstractTask$ClosureTaskAction.execute(Abstra
  140. ctTask.java:637)
  141. at org.gradle.api.internal.tasks.execution.ExecuteActionsTaskExecuter$3.
  142. run(ExecuteActionsTaskExecuter.java:539)
  143. at org.gradle.internal.operations.DefaultBuildOperationExecutor$Runnable
  144. BuildOperationWorker.execute(DefaultBuildOperationExecutor.java:402)
  145. at org.gradle.internal.operations.DefaultBuildOperationExecutor$Runnable
  146. BuildOperationWorker.execute(DefaultBuildOperationExecutor.java:394)
  147. at org.gradle.internal.operations.DefaultBuildOperationExecutor$1.execut
  148. e(DefaultBuildOperationExecutor.java:165)
  149. at org.gradle.internal.operations.DefaultBuildOperationExecutor.execute(
  150. DefaultBuildOperationExecutor.java:250)
  151. at org.gradle.internal.operations.DefaultBuildOperationExecutor.execute(
  152. DefaultBuildOperationExecutor.java:158)
  153. at org.gradle.internal.operations.DefaultBuildOperationExecutor.run(Defa
  154. ultBuildOperationExecutor.java:92)
  155. at org.gradle.internal.operations.DelegatingBuildOperationExecutor.run(D
  156. elegatingBuildOperationExecutor.java:31)
  157. at org.gradle.api.internal.tasks.execution.ExecuteActionsTaskExecuter.ex
  158. ecuteAction(ExecuteActionsTaskExecuter.java:524)
  159. at org.gradle.api.internal.tasks.execution.ExecuteActionsTaskExecuter.ex
  160. ecuteActions(ExecuteActionsTaskExecuter.java:507)
  161. at org.gradle.api.internal.tasks.execution.ExecuteActionsTaskExecuter.ac
  162. cess$300(ExecuteActionsTaskExecuter.java:109)
  163. at org.gradle.api.internal.tasks.execution.ExecuteActionsTaskExecuter$Ta
  164. skExecution.executeWithPreviousOutputFiles(ExecuteActionsTaskExecuter.java:258)
  165. at org.gradle.api.internal.tasks.execution.ExecuteActionsTaskExecuter$Ta
  166. skExecution.execute(ExecuteActionsTaskExecuter.java:247)
  167. at org.gradle.internal.execution.steps.ExecuteStep.lambda$execute$1(Exec
  168. uteStep.java:33)
  169. at org.gradle.internal.execution.steps.ExecuteStep.execute(ExecuteStep.j
  170. ava:33)
  171. at org.gradle.internal.execution.steps.ExecuteStep.execute(ExecuteStep.j
  172. ava:26)
  173. at org.gradle.internal.execution.steps.CleanupOutputsStep.execute(Cleanu
  174. pOutputsStep.java:63)
  175. at org.gradle.internal.execution.steps.CleanupOutputsStep.execute(Cleanu
  176. pOutputsStep.java:35)
  177. at org.gradle.internal.execution.steps.ResolveInputChangesStep.execute(R
  178. esolveInputChangesStep.java:49)
  179. at org.gradle.internal.execution.steps.ResolveInputChangesStep.execute(R
  180. esolveInputChangesStep.java:34)
  181. at org.gradle.internal.execution.steps.CancelExecutionStep.execute(Cance
  182. lExecutionStep.java:43)
  183. at org.gradle.internal.execution.steps.TimeoutStep.executeWithoutTimeout
  184. (TimeoutStep.java:73)
  185. at org.gradle.internal.execution.steps.TimeoutStep.execute(TimeoutStep.j
  186. ava:54)
  187. at org.gradle.internal.execution.steps.CatchExceptionStep.execute(CatchE
  188. xceptionStep.java:34)
  189. at org.gradle.internal.execution.steps.CreateOutputsStep.execute(CreateO
  190. utputsStep.java:44)
  191. at org.gradle.internal.execution.steps.SnapshotOutputsStep.execute(Snaps
  192. hotOutputsStep.java:54)
  193. at org.gradle.internal.execution.steps.SnapshotOutputsStep.execute(Snaps
  194. hotOutputsStep.java:38)
  195. at org.gradle.internal.execution.steps.CacheStep.executeWithoutCache(Cac
  196. heStep.java:153)
  197. at org.gradle.internal.execution.steps.CacheStep.execute(CacheStep.java:
  198. 67)
  199. at org.gradle.internal.execution.steps.CacheStep.execute(CacheStep.java:
  200. 41)
  201. at org.gradle.internal.execution.steps.BroadcastChangingOutputsStep.exec
  202. ute(BroadcastChangingOutputsStep.java:49)
  203. at org.gradle.internal.execution.steps.StoreExecutionStateStep.execute(S
  204. toreExecutionStateStep.java:44)
  205. at org.gradle.internal.execution.steps.StoreExecutionStateStep.execute(S
  206. toreExecutionStateStep.java:33)
  207. at org.gradle.internal.execution.steps.RecordOutputsStep.execute(RecordO
  208. utputsStep.java:38)
  209. at org.gradle.internal.execution.steps.RecordOutputsStep.execute(RecordO
  210. utputsStep.java:24)
  211. at org.gradle.internal.execution.steps.SkipUpToDateStep.executeBecause(S
  212. kipUpToDateStep.java:92)
  213. at org.gradle.internal.execution.steps.SkipUpToDateStep.lambda$execute$0
  214. (SkipUpToDateStep.java:85)
  215. at org.gradle.internal.execution.steps.SkipUpToDateStep.execute(SkipUpTo
  216. DateStep.java:55)
  217. at org.gradle.internal.execution.steps.SkipUpToDateStep.execute(SkipUpTo
  218. DateStep.java:39)
  219. at org.gradle.internal.execution.steps.ResolveChangesStep.execute(Resolv
  220. eChangesStep.java:76)
  221. at org.gradle.internal.execution.steps.ResolveChangesStep.execute(Resolv
  222. eChangesStep.java:37)
  223. at org.gradle.internal.execution.steps.legacy.MarkSnapshottingInputsFini
  224. shedStep.execute(MarkSnapshottingInputsFinishedStep.java:36)
  225. at org.gradle.internal.execution.steps.legacy.MarkSnapshottingInputsFini
  226. shedStep.execute(MarkSnapshottingInputsFinishedStep.java:26)
  227. at org.gradle.internal.execution.steps.ResolveCachingStateStep.execute(R
  228. esolveCachingStateStep.java:94)
  229. at org.gradle.internal.execution.steps.ResolveCachingStateStep.execute(R
  230. esolveCachingStateStep.java:49)
  231. at org.gradle.internal.execution.steps.CaptureStateBeforeExecutionStep.e
  232. xecute(CaptureStateBeforeExecutionStep.java:79)
  233. at org.gradle.internal.execution.steps.CaptureStateBeforeExecutionStep.e
  234. xecute(CaptureStateBeforeExecutionStep.java:53)
  235. at org.gradle.internal.execution.steps.ValidateStep.execute(ValidateStep
  236. .java:74)
  237. at org.gradle.internal.execution.steps.SkipEmptyWorkStep.lambda$execute$
  238. 2(SkipEmptyWorkStep.java:78)
  239. at org.gradle.internal.execution.steps.SkipEmptyWorkStep.execute(SkipEmp
  240. tyWorkStep.java:78)
  241. at org.gradle.internal.execution.steps.SkipEmptyWorkStep.execute(SkipEmp
  242. tyWorkStep.java:34)
  243. at org.gradle.internal.execution.steps.legacy.MarkSnapshottingInputsStar
  244. tedStep.execute(MarkSnapshottingInputsStartedStep.java:39)
  245. at org.gradle.internal.execution.steps.LoadExecutionStateStep.execute(Lo
  246. adExecutionStateStep.java:40)
  247. at org.gradle.internal.execution.steps.LoadExecutionStateStep.execute(Lo
  248. adExecutionStateStep.java:28)
  249. at org.gradle.internal.execution.impl.DefaultWorkExecutor.execute(Defaul
  250. tWorkExecutor.java:33)
  251. at org.gradle.api.internal.tasks.execution.ExecuteActionsTaskExecuter.ex
  252. ecuteIfValid(ExecuteActionsTaskExecuter.java:174)
  253. ... 30 more
  254. Caused by: java.lang.RuntimeException: java.util.concurrent.ExecutionException:
  255. java.lang.IllegalArgumentException: Unsupported api 524288
  256. at net.fabricmc.tinyremapper.TinyRemapper.read(TinyRemapper.java:246)
  257. at net.fabricmc.tinyremapper.TinyRemapper.readInputs(TinyRemapper.java:2
  258. 12)
  259. at build_buuc9ek6wsv1nblsrigm2gp3q.mapJar(Q:\Development\Misc\yarn-20w08
  260. a\build.gradle:628)
  261. ... 93 more
  262. Caused by: java.util.concurrent.ExecutionException: java.lang.IllegalArgumentExc
  263. eption: Unsupported api 524288
  264. at net.fabricmc.tinyremapper.TinyRemapper.read(TinyRemapper.java:233)
  265. ... 95 more
  266. Caused by: java.lang.IllegalArgumentException: Unsupported api 524288
  267. at org.objectweb.asm.ClassVisitor.<init>(ClassVisitor.java:70)
  268. at net.fabricmc.tinyremapper.TinyRemapper$3.<init>(TinyRemapper.java:333
  269. )
  270. at net.fabricmc.tinyremapper.TinyRemapper.analyze(TinyRemapper.java:333)
  271.  
  272. at net.fabricmc.tinyremapper.TinyRemapper.access$400(TinyRemapper.java:6
  273. 2)
  274. at net.fabricmc.tinyremapper.TinyRemapper$2.visitFile(TinyRemapper.java:
  275. 315)
  276. at net.fabricmc.tinyremapper.TinyRemapper$2.visitFile(TinyRemapper.java:
  277. 311)
  278. at net.fabricmc.tinyremapper.TinyRemapper.readFile(TinyRemapper.java:311
  279. )
  280. at net.fabricmc.tinyremapper.TinyRemapper.access$200(TinyRemapper.java:6
  281. 2)
  282. at net.fabricmc.tinyremapper.TinyRemapper$1$1.call(TinyRemapper.java:281
  283. )
  284. at net.fabricmc.tinyremapper.TinyRemapper$1$1.call(TinyRemapper.java:277
  285. )
  286.  
  287.  
  288. * Get more help at https://help.gradle.org
  289.  
  290. Deprecated Gradle features were used in this build, making it incompatible with
  291. Gradle 7.0.
  292. Use '--warning-mode all' to show the individual deprecation warnings.
  293. See https://docs.gradle.org/6.0.1/userguide/command_line_interface.html#sec:comm
  294. and_line_warnings
  295.  
  296. BUILD FAILED in 8s
  297. 7 actionable tasks: 6 executed, 1 up-to-date
  298.  
  299. Q:\Development\Misc\yarn-20w08a>
Add Comment
Please, Sign In to add comment