SHARE
TWEET

Untitled

a guest Nov 19th, 2013 208 Never
Not a member of Pastebin yet? Sign Up, it unlocks many cool features!
  1. DEBUG: Executing shell function do_compile
  2.  
  3. Invoking test make...
  4. make -C /home/ericn/yocto/build-qt4-n6x/tmp/work/nitrogen6x-poky-linux-gnueabi/imx-test/1_3.10.9-1.0.0-r0/imx-test-3.10.9-1.0.0/test
  5. make[1]: Entering directory `/home/ericn/yocto/build-qt4-n6x/tmp/work/nitrogen6x-poky-linux-gnueabi/imx-test/1_3.10.9-1.0.0-r0/imx-test-3.10.9-1.0.0/test'
  6. make -C ar3k_bt
  7. make[2]: Entering directory `/home/ericn/yocto/build-qt4-n6x/tmp/work/nitrogen6x-poky-linux-gnueabi/imx-test/1_3.10.9-1.0.0-r0/imx-test-3.10.9-1.0.0/test/ar3k_bt'
  8. arm-poky-linux-gnueabi-gcc  -march=armv7-a -mthumb-interwork -mfloat-abi=hard -mfpu=neon -mtune=cortex-a9 --sysroot=/home/ericn/yocto/build-qt4-n6x/tmp/sysroots/nitrogen6x  -I/home/ericn/yocto/build-qt4-n6x/tmp/sysroots/nitrogen6x/usr/include              -I/home/ericn/yocto/build-qt4-n6x/tmp/work/nitrogen6x-poky-linux-gnueabi/imx-test/1_3.10.9-1.0.0-r0/imx-test-3.10.9-1.0.0/include              -I/home/ericn/yocto/build-qt4-n6x/tmp/sysroots/nitrogen6x/usr/src/kernel/include/uapi              -I/home/ericn/yocto/build-qt4-n6x/tmp/sysroots/nitrogen6x/usr/src/kernel/include              -I/home/ericn/yocto/build-qt4-n6x/tmp/sysroots/nitrogen6x/usr/src/kernel/arch/arm/include              -I/home/ericn/yocto/build-qt4-n6x/tmp/sysroots/nitrogen6x/usr/src/kernel/drivers/mxc/security/rng/include              -I/home/ericn/yocto/build-qt4-n6x/tmp/sysroots/nitrogen6x/usr/src/kernel/drivers/mxc/security/sahara2/include -Wall -lbluetooth -g hciattach_ath3k.c  hciattach.c  hciattach_qualcomm.c  hciattach_st.c  hciattach_tialt.c  hciattach_ti.c -o hciattach-ar3k.bin
  9. hciattach.c: In function 'bcsp_tshy_sig_alarm':
  10. hciattach.c:354:6: warning: variable 'len' set but not used [-Wunused-but-set-variable]
  11.   int len;
  12.       ^
  13. hciattach.c: In function 'bcsp_tconf_sig_alarm':
  14. hciattach.c:372:6: warning: variable 'len' set but not used [-Wunused-but-set-variable]
  15.   int len;
  16.       ^
  17. hciattach.c: In function 'bcsp':
  18. hciattach.c:397:6: warning: variable 'len' set but not used [-Wunused-but-set-variable]
  19.   int len;
  20.       ^
  21. hciattach.c: In function 'ar3kinit':
  22. hciattach.c:774:2: warning: implicit declaration of function 'ath_ps_download' [-Wimplicit-function-declaration]
  23.   r = ath_ps_download(fd);
  24.   ^
  25. hciattach.c: At top level:
  26. hciattach.c:686:12: warning: 'ar3kpost' defined but not used [-Wunused-function]
  27.  static int ar3kpost(int fd, struct uart_t *u, struct termios *ti)
  28.             ^
  29. hciattach.c:725:12: warning: 'ar3kpmpost' defined but not used [-Wunused-function]
  30.  static int ar3kpmpost(int fd, struct uart_t *u, struct termios *ti)
  31.             ^
  32. hciattach.c:764:12: warning: 'ar3kinit' defined but not used [-Wunused-function]
  33.  static int ar3kinit(int fd, struct uart_t *u, struct termios *ti)
  34.             ^
  35. make[2]: Leaving directory `/home/ericn/yocto/build-qt4-n6x/tmp/work/nitrogen6x-poky-linux-gnueabi/imx-test/1_3.10.9-1.0.0-r0/imx-test-3.10.9-1.0.0/test/ar3k_bt'
  36. make -C doc
  37. make[2]: Entering directory `/home/ericn/yocto/build-qt4-n6x/tmp/work/nitrogen6x-poky-linux-gnueabi/imx-test/1_3.10.9-1.0.0-r0/imx-test-3.10.9-1.0.0/test/doc'
  38. ./gen_conf.sh IMX6Q
  39. asciidoc -a toc ut_um.toc
  40. asciidoc: WARNING: FSL-UT-CAN-001.txt: line 34: no output from filter: "/usr/bin/python" "/usr/bin/asciidoc" -b xhtml11  --attribute "toc" --attribute "chip=IMX6Q" --attribute "imx6q" -a "indir=/home/ericn/yocto/build-qt4-n6x/tmp/work/nitrogen6x-poky-linux-gnueabi/imx-test/1_3.10.9-1.0.0-r0/imx-test-3.10.9-1.0.0/test/can/doc" -a "blockname=table" -s -
  41. asciidoc: WARNING: FSL-UT-CAN-002.txt: line 41: no output from filter: "/usr/bin/python" "/usr/bin/asciidoc" -b xhtml11  --attribute "toc" --attribute "chip=IMX6Q" --attribute "imx6q" -a "indir=/home/ericn/yocto/build-qt4-n6x/tmp/work/nitrogen6x-poky-linux-gnueabi/imx-test/1_3.10.9-1.0.0-r0/imx-test-3.10.9-1.0.0/test/can/doc" -a "blockname=table" -s -
  42. asciidoc: WARNING: FSL-UT-CAN-003.txt: line 66: no output from filter: "/usr/bin/python" "/usr/bin/asciidoc" -b xhtml11  --attribute "toc" --attribute "chip=IMX6Q" --attribute "imx6q" -a "indir=/home/ericn/yocto/build-qt4-n6x/tmp/work/nitrogen6x-poky-linux-gnueabi/imx-test/1_3.10.9-1.0.0-r0/imx-test-3.10.9-1.0.0/test/can/doc" -a "blockname=table" -s -
  43. asciidoc: WARNING: FSL-UT-CAN-004.txt: line 54: no output from filter: "/usr/bin/python" "/usr/bin/asciidoc" -b xhtml11  --attribute "toc" --attribute "chip=IMX6Q" --attribute "imx6q" -a "indir=/home/ericn/yocto/build-qt4-n6x/tmp/work/nitrogen6x-poky-linux-gnueabi/imx-test/1_3.10.9-1.0.0-r0/imx-test-3.10.9-1.0.0/test/can/doc" -a "blockname=table" -s -
  44. asciidoc: WARNING: FSL-UT-FEC-001.txt: line 37: no output from filter: "/usr/bin/python" "/usr/bin/asciidoc" -b xhtml11  --attribute "toc" --attribute "chip=IMX6Q" --attribute "imx6q" -a "indir=/home/ericn/yocto/build-qt4-n6x/tmp/work/nitrogen6x-poky-linux-gnueabi/imx-test/1_3.10.9-1.0.0-r0/imx-test-3.10.9-1.0.0/test/misc/doc" -a "blockname=table" -s -
  45. asciidoc: WARNING: FSL-UT-FEC-002.txt: line 41: no output from filter: "/usr/bin/python" "/usr/bin/asciidoc" -b xhtml11  --attribute "toc" --attribute "chip=IMX6Q" --attribute "imx6q" -a "indir=/home/ericn/yocto/build-qt4-n6x/tmp/work/nitrogen6x-poky-linux-gnueabi/imx-test/1_3.10.9-1.0.0-r0/imx-test-3.10.9-1.0.0/test/misc/doc" -a "blockname=table" -s -
  46. asciidoc: WARNING: FSL-UT-FEC-003.txt: line 38: no output from filter: "/usr/bin/python" "/usr/bin/asciidoc" -b xhtml11  --attribute "toc" --attribute "chip=IMX6Q" --attribute "imx6q" -a "indir=/home/ericn/yocto/build-qt4-n6x/tmp/work/nitrogen6x-poky-linux-gnueabi/imx-test/1_3.10.9-1.0.0-r0/imx-test-3.10.9-1.0.0/test/misc/doc" -a "blockname=table" -s -
  47. asciidoc: WARNING: FSL-UT-FEC-004.txt: line 43: no output from filter: "/usr/bin/python" "/usr/bin/asciidoc" -b xhtml11  --attribute "toc" --attribute "chip=IMX6Q" --attribute "imx6q" -a "indir=/home/ericn/yocto/build-qt4-n6x/tmp/work/nitrogen6x-poky-linux-gnueabi/imx-test/1_3.10.9-1.0.0-r0/imx-test-3.10.9-1.0.0/test/misc/doc" -a "blockname=table" -s -
  48. asciidoc: WARNING: FSL-UT-FEC-005.txt: line 43: no output from filter: "/usr/bin/python" "/usr/bin/asciidoc" -b xhtml11  --attribute "toc" --attribute "chip=IMX6Q" --attribute "imx6q" -a "indir=/home/ericn/yocto/build-qt4-n6x/tmp/work/nitrogen6x-poky-linux-gnueabi/imx-test/1_3.10.9-1.0.0-r0/imx-test-3.10.9-1.0.0/test/misc/doc" -a "blockname=table" -s -
  49. asciidoc: WARNING: FSL-UT-HDMI-001.txt: line 49: no output from filter: "/usr/bin/python" "/usr/bin/asciidoc" -b xhtml11  --attribute "toc" --attribute "chip=IMX6Q" --attribute "imx6q" -a "indir=/home/ericn/yocto/build-qt4-n6x/tmp/work/nitrogen6x-poky-linux-gnueabi/imx-test/1_3.10.9-1.0.0-r0/imx-test-3.10.9-1.0.0/test/mxc_fb_test/doc" -a "blockname=table" -s -
  50. asciidoc: WARNING: FSL-UT-HDMI-001.txt: line 49: no output from filter: "/usr/bin/python" "/usr/bin/asciidoc" -b xhtml11  --attribute "toc" --attribute "chip=IMX6Q" --attribute "imx6q" -a "indir=/home/ericn/yocto/build-qt4-n6x/tmp/work/nitrogen6x-poky-linux-gnueabi/imx-test/1_3.10.9-1.0.0-r0/imx-test-3.10.9-1.0.0/test/mxc_fb_test/doc" -a "blockname=table" -s -
  51. asciidoc: WARNING: FSL-UT-HDMI-002.txt: line 32: no output from filter: "/usr/bin/python" "/usr/bin/asciidoc" -b xhtml11  --attribute "toc" --attribute "chip=IMX6Q" --attribute "imx6q" -a "indir=/home/ericn/yocto/build-qt4-n6x/tmp/work/nitrogen6x-poky-linux-gnueabi/imx-test/1_3.10.9-1.0.0-r0/imx-test-3.10.9-1.0.0/test/mxc_fb_test/doc" -a "blockname=table" -s -
  52. asciidoc: WARNING: FSL-UT-HDMI-002.txt: line 32: no output from filter: "/usr/bin/python" "/usr/bin/asciidoc" -b xhtml11  --attribute "toc" --attribute "chip=IMX6Q" --attribute "imx6q" -a "indir=/home/ericn/yocto/build-qt4-n6x/tmp/work/nitrogen6x-poky-linux-gnueabi/imx-test/1_3.10.9-1.0.0-r0/imx-test-3.10.9-1.0.0/test/mxc_fb_test/doc" -a "blockname=table" -s -
  53. asciidoc: WARNING: FSL-UT-I2C-001.txt: line 32: no output from filter: "/usr/bin/python" "/usr/bin/asciidoc" -b xhtml11  --attribute "toc" --attribute "chip=IMX6Q" --attribute "imx6q" -a "indir=/home/ericn/yocto/build-qt4-n6x/tmp/work/nitrogen6x-poky-linux-gnueabi/imx-test/1_3.10.9-1.0.0-r0/imx-test-3.10.9-1.0.0/test/misc/doc" -a "blockname=table" -s -
  54. asciidoc: WARNING: FSL-UT-MISC-002.txt: line 31: no output from filter: "/usr/bin/python" "/usr/bin/asciidoc" -b xhtml11  --attribute "toc" --attribute "chip=IMX6Q" --attribute "imx6q" -a "indir=/home/ericn/yocto/build-qt4-n6x/tmp/work/nitrogen6x-poky-linux-gnueabi/imx-test/1_3.10.9-1.0.0-r0/imx-test-3.10.9-1.0.0/test/misc/doc" -a "blockname=table" -s -
  55. asciidoc: WARNING: FSL-UT-MFG-001.txt: line 35: no output from filter: "/usr/bin/python" "/usr/bin/asciidoc" -b xhtml11  --attribute "toc" --attribute "chip=IMX6Q" --attribute "imx6q" -a "indir=/home/ericn/yocto/build-qt4-n6x/tmp/work/nitrogen6x-poky-linux-gnueabi/imx-test/1_3.10.9-1.0.0-r0/imx-test-3.10.9-1.0.0/test/misc/doc" -a "blockname=table" -s -
  56. asciidoc: WARNING: FSL-UT-MMC-001.txt: line 28: no output from filter: "/usr/bin/python" "/usr/bin/asciidoc" -b xhtml11  --attribute "toc" --attribute "chip=IMX6Q" --attribute "imx6q" -a "indir=/home/ericn/yocto/build-qt4-n6x/tmp/work/nitrogen6x-poky-linux-gnueabi/imx-test/1_3.10.9-1.0.0-r0/imx-test-3.10.9-1.0.0/test/mxc_mmc_test/doc" -a "blockname=table" -s -
  57. asciidoc: WARNING: FSL-UT-MMC-002.txt: line 28: no output from filter: "/usr/bin/python" "/usr/bin/asciidoc" -b xhtml11  --attribute "toc" --attribute "chip=IMX6Q" --attribute "imx6q" -a "indir=/home/ericn/yocto/build-qt4-n6x/tmp/work/nitrogen6x-poky-linux-gnueabi/imx-test/1_3.10.9-1.0.0-r0/imx-test-3.10.9-1.0.0/test/mxc_mmc_test/doc" -a "blockname=table" -s -
  58. asciidoc: WARNING: FSL-UT-MMC-005.txt: line 28: no output from filter: "/usr/bin/python" "/usr/bin/asciidoc" -b xhtml11  --attribute "toc" --attribute "chip=IMX6Q" --attribute "imx6q" -a "indir=/home/ericn/yocto/build-qt4-n6x/tmp/work/nitrogen6x-poky-linux-gnueabi/imx-test/1_3.10.9-1.0.0-r0/imx-test-3.10.9-1.0.0/test/mxc_mmc_test/doc" -a "blockname=table" -s -
  59. asciidoc: WARNING: FSL-UT-MMC-006.txt: line 28: no output from filter: "/usr/bin/python" "/usr/bin/asciidoc" -b xhtml11  --attribute "toc" --attribute "chip=IMX6Q" --attribute "imx6q" -a "indir=/home/ericn/yocto/build-qt4-n6x/tmp/work/nitrogen6x-poky-linux-gnueabi/imx-test/1_3.10.9-1.0.0-r0/imx-test-3.10.9-1.0.0/test/mxc_mmc_test/doc" -a "blockname=table" -s -
  60. asciidoc: WARNING: FSL-UT-MMC-007.txt: line 28: no output from filter: "/usr/bin/python" "/usr/bin/asciidoc" -b xhtml11  --attribute "toc" --attribute "chip=IMX6Q" --attribute "imx6q" -a "indir=/home/ericn/yocto/build-qt4-n6x/tmp/work/nitrogen6x-poky-linux-gnueabi/imx-test/1_3.10.9-1.0.0-r0/imx-test-3.10.9-1.0.0/test/mxc_mmc_test/doc" -a "blockname=table" -s -
  61. asciidoc: WARNING: FSL-UT-MMC-008.txt: line 34: no output from filter: "/usr/bin/python" "/usr/bin/asciidoc" -b xhtml11  --attribute "toc" --attribute "chip=IMX6Q" --attribute "imx6q" -a "indir=/home/ericn/yocto/build-qt4-n6x/tmp/work/nitrogen6x-poky-linux-gnueabi/imx-test/1_3.10.9-1.0.0-r0/imx-test-3.10.9-1.0.0/test/mxc_mmc_test/doc" -a "blockname=table" -s -
  62. asciidoc: WARNING: FSL-UT-NAND-001.txt: line 62: no output from filter: "/usr/bin/python" "/usr/bin/asciidoc" -b xhtml11  --attribute "toc" --attribute "chip=IMX6Q" --attribute "imx6q" -a "indir=/home/ericn/yocto/build-qt4-n6x/tmp/work/nitrogen6x-poky-linux-gnueabi/imx-test/1_3.10.9-1.0.0-r0/imx-test-3.10.9-1.0.0/test/misc/doc" -a "blockname=table" -s -
  63. asciidoc: WARNING: FSL-UT-NAND-002.txt: line 32: no output from filter: "/usr/bin/python" "/usr/bin/asciidoc" -b xhtml11  --attribute "toc" --attribute "chip=IMX6Q" --attribute "imx6q" -a "indir=/home/ericn/yocto/build-qt4-n6x/tmp/work/nitrogen6x-poky-linux-gnueabi/imx-test/1_3.10.9-1.0.0-r0/imx-test-3.10.9-1.0.0/test/misc/doc" -a "blockname=table" -s -
  64. asciidoc: WARNING: FSL-UT-PM-001.txt: line 26: no output from filter: "/usr/bin/python" "/usr/bin/asciidoc" -b xhtml11  --attribute "toc" --attribute "chip=IMX6Q" --attribute "imx6q" -a "indir=/home/ericn/yocto/build-qt4-n6x/tmp/work/nitrogen6x-poky-linux-gnueabi/imx-test/1_3.10.9-1.0.0-r0/imx-test-3.10.9-1.0.0/test/pm/doc" -a "blockname=table" -s -
  65. asciidoc: WARNING: FSL-UT-PM-002.txt: line 24: no output from filter: "/usr/bin/python" "/usr/bin/asciidoc" -b xhtml11  --attribute "toc" --attribute "chip=IMX6Q" --attribute "imx6q" -a "indir=/home/ericn/yocto/build-qt4-n6x/tmp/work/nitrogen6x-poky-linux-gnueabi/imx-test/1_3.10.9-1.0.0-r0/imx-test-3.10.9-1.0.0/test/pm/doc" -a "blockname=table" -s -
  66. asciidoc: WARNING: FSL-UT-PM-003.txt: line 24: no output from filter: "/usr/bin/python" "/usr/bin/asciidoc" -b xhtml11  --attribute "toc" --attribute "chip=IMX6Q" --attribute "imx6q" -a "indir=/home/ericn/yocto/build-qt4-n6x/tmp/work/nitrogen6x-poky-linux-gnueabi/imx-test/1_3.10.9-1.0.0-r0/imx-test-3.10.9-1.0.0/test/pm/doc" -a "blockname=table" -s -
  67. asciidoc: WARNING: FSL-UT-PM-004.txt: line 28: no output from filter: "/usr/bin/python" "/usr/bin/asciidoc" -b xhtml11  --attribute "toc" --attribute "chip=IMX6Q" --attribute "imx6q" -a "indir=/home/ericn/yocto/build-qt4-n6x/tmp/work/nitrogen6x-poky-linux-gnueabi/imx-test/1_3.10.9-1.0.0-r0/imx-test-3.10.9-1.0.0/test/pm/doc" -a "blockname=table" -s -
  68. asciidoc: WARNING: FSL-UT-PM-005.txt: line 28: no output from filter: "/usr/bin/python" "/usr/bin/asciidoc" -b xhtml11  --attribute "toc" --attribute "chip=IMX6Q" --attribute "imx6q" -a "indir=/home/ericn/yocto/build-qt4-n6x/tmp/work/nitrogen6x-poky-linux-gnueabi/imx-test/1_3.10.9-1.0.0-r0/imx-test-3.10.9-1.0.0/test/pm/doc" -a "blockname=table" -s -
  69. asciidoc: WARNING: FSL-UT-SATA-001.txt: line 31: no output from filter: "/usr/bin/python" "/usr/bin/asciidoc" -b xhtml11  --attribute "toc" --attribute "chip=IMX6Q" --attribute "imx6q" -a "indir=/home/ericn/yocto/build-qt4-n6x/tmp/work/nitrogen6x-poky-linux-gnueabi/imx-test/1_3.10.9-1.0.0-r0/imx-test-3.10.9-1.0.0/test/misc/doc" -a "blockname=table" -s -
  70. asciidoc: WARNING: FSL-UT-SATA-002.txt: line 29: no output from filter: "/usr/bin/python" "/usr/bin/asciidoc" -b xhtml11  --attribute "toc" --attribute "chip=IMX6Q" --attribute "imx6q" -a "indir=/home/ericn/yocto/build-qt4-n6x/tmp/work/nitrogen6x-poky-linux-gnueabi/imx-test/1_3.10.9-1.0.0-r0/imx-test-3.10.9-1.0.0/test/misc/doc" -a "blockname=table" -s -
  71. asciidoc: WARNING: FSL-UT-SATA-003.txt: line 30: no output from filter: "/usr/bin/python" "/usr/bin/asciidoc" -b xhtml11  --attribute "toc" --attribute "chip=IMX6Q" --attribute "imx6q" -a "indir=/home/ericn/yocto/build-qt4-n6x/tmp/work/nitrogen6x-poky-linux-gnueabi/imx-test/1_3.10.9-1.0.0-r0/imx-test-3.10.9-1.0.0/test/misc/doc" -a "blockname=table" -s -
  72. asciidoc: WARNING: FSL-UT-USB-001.txt: line 51: no output from filter: "/usr/bin/python" "/usr/bin/asciidoc" -b xhtml11  --attribute "toc" --attribute "chip=IMX6Q" --attribute "imx6q" -a "indir=/home/ericn/yocto/build-qt4-n6x/tmp/work/nitrogen6x-poky-linux-gnueabi/imx-test/1_3.10.9-1.0.0-r0/imx-test-3.10.9-1.0.0/test/mxc_usb_test/doc" -a "blockname=table" -s -
  73. asciidoc: WARNING: FSL-UT-USB-002.txt: line 69: no output from filter: "/usr/bin/python" "/usr/bin/asciidoc" -b xhtml11  --attribute "toc" --attribute "chip=IMX6Q" --attribute "imx6q" -a "indir=/home/ericn/yocto/build-qt4-n6x/tmp/work/nitrogen6x-poky-linux-gnueabi/imx-test/1_3.10.9-1.0.0-r0/imx-test-3.10.9-1.0.0/test/mxc_usb_test/doc" -a "blockname=table" -s -
  74. asciidoc: WARNING: FSL-UT-USB-004.txt: line 150: no output from filter: "/usr/bin/python" "/usr/bin/asciidoc" -b xhtml11  --attribute "toc" --attribute "chip=IMX6Q" --attribute "imx6q" -a "indir=/home/ericn/yocto/build-qt4-n6x/tmp/work/nitrogen6x-poky-linux-gnueabi/imx-test/1_3.10.9-1.0.0-r0/imx-test-3.10.9-1.0.0/test/mxc_usb_test/doc" -a "blockname=table" -s -
  75. asciidoc: WARNING: FSL-UT-USB-005.txt: line 68: no output from filter: "/usr/bin/python" "/usr/bin/asciidoc" -b xhtml11  --attribute "toc" --attribute "chip=IMX6Q" --attribute "imx6q" -a "indir=/home/ericn/yocto/build-qt4-n6x/tmp/work/nitrogen6x-poky-linux-gnueabi/imx-test/1_3.10.9-1.0.0-r0/imx-test-3.10.9-1.0.0/test/mxc_usb_test/doc" -a "blockname=table" -s -
  76. asciidoc: WARNING: FSL-UT-USB-006.txt: line 76: no output from filter: "/usr/bin/python" "/usr/bin/asciidoc" -b xhtml11  --attribute "toc" --attribute "chip=IMX6Q" --attribute "imx6q" -a "indir=/home/ericn/yocto/build-qt4-n6x/tmp/work/nitrogen6x-poky-linux-gnueabi/imx-test/1_3.10.9-1.0.0-r0/imx-test-3.10.9-1.0.0/test/mxc_usb_test/doc" -a "blockname=table" -s -
  77. asciidoc: WARNING: FSL-UT-USB-007.txt: line 34: no output from filter: "/usr/bin/python" "/usr/bin/asciidoc" -b xhtml11  --attribute "toc" --attribute "chip=IMX6Q" --attribute "imx6q" -a "indir=/home/ericn/yocto/build-qt4-n6x/tmp/work/nitrogen6x-poky-linux-gnueabi/imx-test/1_3.10.9-1.0.0-r0/imx-test-3.10.9-1.0.0/test/mxc_usb_test/doc" -a "blockname=table" -s -
  78. asciidoc: WARNING: FSL-UT-USB-008.txt: line 109: no output from filter: "/usr/bin/python" "/usr/bin/asciidoc" -b xhtml11  --attribute "toc" --attribute "chip=IMX6Q" --attribute "imx6q" -a "indir=/home/ericn/yocto/build-qt4-n6x/tmp/work/nitrogen6x-poky-linux-gnueabi/imx-test/1_3.10.9-1.0.0-r0/imx-test-3.10.9-1.0.0/test/mxc_usb_test/doc" -a "blockname=table" -s -
  79. asciidoc: WARNING: FSL-UT-USB-009.txt: line 43: no output from filter: "/usr/bin/python" "/usr/bin/asciidoc" -b xhtml11  --attribute "toc" --attribute "chip=IMX6Q" --attribute "imx6q" -a "indir=/home/ericn/yocto/build-qt4-n6x/tmp/work/nitrogen6x-poky-linux-gnueabi/imx-test/1_3.10.9-1.0.0-r0/imx-test-3.10.9-1.0.0/test/mxc_usb_test/doc" -a "blockname=table" -s -
  80. asciidoc: WARNING: FSL-UT-USB-011.txt: line 62: no output from filter: "/usr/bin/python" "/usr/bin/asciidoc" -b xhtml11  --attribute "toc" --attribute "chip=IMX6Q" --attribute "imx6q" -a "indir=/home/ericn/yocto/build-qt4-n6x/tmp/work/nitrogen6x-poky-linux-gnueabi/imx-test/1_3.10.9-1.0.0-r0/imx-test-3.10.9-1.0.0/test/mxc_usb_test/doc" -a "blockname=table" -s -
  81. asciidoc: WARNING: FSL-UT-USB-012.txt: line 103: no output from filter: "/usr/bin/python" "/usr/bin/asciidoc" -b xhtml11  --attribute "toc" --attribute "chip=IMX6Q" --attribute "imx6q" -a "indir=/home/ericn/yocto/build-qt4-n6x/tmp/work/nitrogen6x-poky-linux-gnueabi/imx-test/1_3.10.9-1.0.0-r0/imx-test-3.10.9-1.0.0/test/mxc_usb_test/doc" -a "blockname=table" -s -
  82. asciidoc: WARNING: FSL-UT-USB-013.txt: line 39: no output from filter: "/usr/bin/python" "/usr/bin/asciidoc" -b xhtml11  --attribute "toc" --attribute "chip=IMX6Q" --attribute "imx6q" -a "indir=/home/ericn/yocto/build-qt4-n6x/tmp/work/nitrogen6x-poky-linux-gnueabi/imx-test/1_3.10.9-1.0.0-r0/imx-test-3.10.9-1.0.0/test/mxc_usb_test/doc" -a "blockname=table" -s -
  83. asciidoc: WARNING: FSL-UT-USB-014.txt: line 36: no output from filter: "/usr/bin/python" "/usr/bin/asciidoc" -b xhtml11  --attribute "toc" --attribute "chip=IMX6Q" --attribute "imx6q" -a "indir=/home/ericn/yocto/build-qt4-n6x/tmp/work/nitrogen6x-poky-linux-gnueabi/imx-test/1_3.10.9-1.0.0-r0/imx-test-3.10.9-1.0.0/test/mxc_usb_test/doc" -a "blockname=table" -s -
  84. asciidoc: WARNING: FSL-UT-USB-015.txt: line 41: no output from filter: "/usr/bin/python" "/usr/bin/asciidoc" -b xhtml11  --attribute "toc" --attribute "chip=IMX6Q" --attribute "imx6q" -a "indir=/home/ericn/yocto/build-qt4-n6x/tmp/work/nitrogen6x-poky-linux-gnueabi/imx-test/1_3.10.9-1.0.0-r0/imx-test-3.10.9-1.0.0/test/mxc_usb_test/doc" -a "blockname=table" -s -
  85. asciidoc: WARNING: FSL-UT-USB-016.txt: line 45: no output from filter: "/usr/bin/python" "/usr/bin/asciidoc" -b xhtml11  --attribute "toc" --attribute "chip=IMX6Q" --attribute "imx6q" -a "indir=/home/ericn/yocto/build-qt4-n6x/tmp/work/nitrogen6x-poky-linux-gnueabi/imx-test/1_3.10.9-1.0.0-r0/imx-test-3.10.9-1.0.0/test/mxc_usb_test/doc" -a "blockname=table" -s -
  86. asciidoc: WARNING: FSL-UT-USB-017.txt: line 54: no output from filter: "/usr/bin/python" "/usr/bin/asciidoc" -b xhtml11  --attribute "toc" --attribute "chip=IMX6Q" --attribute "imx6q" -a "indir=/home/ericn/yocto/build-qt4-n6x/tmp/work/nitrogen6x-poky-linux-gnueabi/imx-test/1_3.10.9-1.0.0-r0/imx-test-3.10.9-1.0.0/test/mxc_usb_test/doc" -a "blockname=table" -s -
  87. asciidoc: ERROR: FSL-UT-USB-018.txt: line 1: [blockdef-filter] missing closing delimiter
  88. make[2]: *** [single] Error 1
  89. make[2]: Leaving directory `/home/ericn/yocto/build-qt4-n6x/tmp/work/nitrogen6x-poky-linux-gnueabi/imx-test/1_3.10.9-1.0.0-r0/imx-test-3.10.9-1.0.0/test/doc'
  90. make[1]: [doc] Error 2 (ignored)
  91. make -C etm
  92. make[2]: Entering directory `/home/ericn/yocto/build-qt4-n6x/tmp/work/nitrogen6x-poky-linux-gnueabi/imx-test/1_3.10.9-1.0.0-r0/imx-test-3.10.9-1.0.0/test/etm'
  93. make[2]: Nothing to be done for `all'.
  94. make[2]: Leaving directory `/home/ericn/yocto/build-qt4-n6x/tmp/work/nitrogen6x-poky-linux-gnueabi/imx-test/1_3.10.9-1.0.0-r0/imx-test-3.10.9-1.0.0/test/etm'
  95. make -C gpu
  96. make[2]: Entering directory `/home/ericn/yocto/build-qt4-n6x/tmp/work/nitrogen6x-poky-linux-gnueabi/imx-test/1_3.10.9-1.0.0-r0/imx-test-3.10.9-1.0.0/test/gpu'
  97. make[2]: Nothing to be done for `all'.
  98. make[2]: Leaving directory `/home/ericn/yocto/build-qt4-n6x/tmp/work/nitrogen6x-poky-linux-gnueabi/imx-test/1_3.10.9-1.0.0-r0/imx-test-3.10.9-1.0.0/test/gpu'
  99. make -C imx_adc
  100. make[2]: Entering directory `/home/ericn/yocto/build-qt4-n6x/tmp/work/nitrogen6x-poky-linux-gnueabi/imx-test/1_3.10.9-1.0.0-r0/imx-test-3.10.9-1.0.0/test/imx_adc'
  101. make[2]: Nothing to be done for `all'.
  102. make[2]: Leaving directory `/home/ericn/yocto/build-qt4-n6x/tmp/work/nitrogen6x-poky-linux-gnueabi/imx-test/1_3.10.9-1.0.0-r0/imx-test-3.10.9-1.0.0/test/imx_adc'
  103. make -C max8660_pmic_test
  104. make[2]: Entering directory `/home/ericn/yocto/build-qt4-n6x/tmp/work/nitrogen6x-poky-linux-gnueabi/imx-test/1_3.10.9-1.0.0-r0/imx-test-3.10.9-1.0.0/test/max8660_pmic_test'
  105. make[2]: Nothing to be done for `all'.
  106. make[2]: Leaving directory `/home/ericn/yocto/build-qt4-n6x/tmp/work/nitrogen6x-poky-linux-gnueabi/imx-test/1_3.10.9-1.0.0-r0/imx-test-3.10.9-1.0.0/test/max8660_pmic_test'
  107. make -C memtool
  108. make[2]: Entering directory `/home/ericn/yocto/build-qt4-n6x/tmp/work/nitrogen6x-poky-linux-gnueabi/imx-test/1_3.10.9-1.0.0-r0/imx-test-3.10.9-1.0.0/test/memtool'
  109. arm-poky-linux-gnueabi-gcc -o /home/ericn/yocto/build-qt4-n6x/tmp/work/nitrogen6x-poky-linux-gnueabi/imx-test/1_3.10.9-1.0.0-r0/imx-test-3.10.9-1.0.0/platform/IMX6Q//memtool memtool.o mx6dl_modules.o mx6q_modules.o mx6sl_modules.o -Os
  110. /home/ericn/yocto/build-qt4-n6x/tmp/sysroots/x86_64-linux/usr/bin/cortexa9hf-vfp-neon-poky-linux-gnueabi/../../libexec/cortexa9hf-vfp-neon-poky-linux-gnueabi/gcc/arm-poky-linux-gnueabi/4.8.1/ld: cannot find crt1.o: No such file or directory
  111. /home/ericn/yocto/build-qt4-n6x/tmp/sysroots/x86_64-linux/usr/bin/cortexa9hf-vfp-neon-poky-linux-gnueabi/../../libexec/cortexa9hf-vfp-neon-poky-linux-gnueabi/gcc/arm-poky-linux-gnueabi/4.8.1/ld: cannot find crti.o: No such file or directory
  112. /home/ericn/yocto/build-qt4-n6x/tmp/sysroots/x86_64-linux/usr/bin/cortexa9hf-vfp-neon-poky-linux-gnueabi/../../libexec/cortexa9hf-vfp-neon-poky-linux-gnueabi/gcc/arm-poky-linux-gnueabi/4.8.1/ld: cannot find crtbegin.o: No such file or directory
  113. /home/ericn/yocto/build-qt4-n6x/tmp/sysroots/x86_64-linux/usr/bin/cortexa9hf-vfp-neon-poky-linux-gnueabi/../../libexec/cortexa9hf-vfp-neon-poky-linux-gnueabi/gcc/arm-poky-linux-gnueabi/4.8.1/ld: cannot find -lgcc
  114. /home/ericn/yocto/build-qt4-n6x/tmp/sysroots/x86_64-linux/usr/bin/cortexa9hf-vfp-neon-poky-linux-gnueabi/../../libexec/cortexa9hf-vfp-neon-poky-linux-gnueabi/gcc/arm-poky-linux-gnueabi/4.8.1/ld: cannot find -lgcc_s
  115. /home/ericn/yocto/build-qt4-n6x/tmp/sysroots/x86_64-linux/usr/bin/cortexa9hf-vfp-neon-poky-linux-gnueabi/../../libexec/cortexa9hf-vfp-neon-poky-linux-gnueabi/gcc/arm-poky-linux-gnueabi/4.8.1/ld: cannot find -lc
  116. /home/ericn/yocto/build-qt4-n6x/tmp/sysroots/x86_64-linux/usr/bin/cortexa9hf-vfp-neon-poky-linux-gnueabi/../../libexec/cortexa9hf-vfp-neon-poky-linux-gnueabi/gcc/arm-poky-linux-gnueabi/4.8.1/ld: cannot find -lgcc
  117. /home/ericn/yocto/build-qt4-n6x/tmp/sysroots/x86_64-linux/usr/bin/cortexa9hf-vfp-neon-poky-linux-gnueabi/../../libexec/cortexa9hf-vfp-neon-poky-linux-gnueabi/gcc/arm-poky-linux-gnueabi/4.8.1/ld: cannot find -lgcc_s
  118. /home/ericn/yocto/build-qt4-n6x/tmp/sysroots/x86_64-linux/usr/bin/cortexa9hf-vfp-neon-poky-linux-gnueabi/../../libexec/cortexa9hf-vfp-neon-poky-linux-gnueabi/gcc/arm-poky-linux-gnueabi/4.8.1/ld: cannot find crtend.o: No such file or directory
  119. /home/ericn/yocto/build-qt4-n6x/tmp/sysroots/x86_64-linux/usr/bin/cortexa9hf-vfp-neon-poky-linux-gnueabi/../../libexec/cortexa9hf-vfp-neon-poky-linux-gnueabi/gcc/arm-poky-linux-gnueabi/4.8.1/ld: cannot find crtn.o: No such file or directory
  120. collect2: error: ld returned 1 exit status
  121. make[2]: *** [/home/ericn/yocto/build-qt4-n6x/tmp/work/nitrogen6x-poky-linux-gnueabi/imx-test/1_3.10.9-1.0.0-r0/imx-test-3.10.9-1.0.0/platform/IMX6Q//memtool] Error 1
  122. make[2]: Leaving directory `/home/ericn/yocto/build-qt4-n6x/tmp/work/nitrogen6x-poky-linux-gnueabi/imx-test/1_3.10.9-1.0.0-r0/imx-test-3.10.9-1.0.0/test/memtool'
  123. make[1]: [memtool] Error 2 (ignored)
  124. make -C mxc_als_test
  125. make[2]: Entering directory `/home/ericn/yocto/build-qt4-n6x/tmp/work/nitrogen6x-poky-linux-gnueabi/imx-test/1_3.10.9-1.0.0-r0/imx-test-3.10.9-1.0.0/test/mxc_als_test'
  126. make[2]: Nothing to be done for `all'.
  127. make[2]: Leaving directory `/home/ericn/yocto/build-qt4-n6x/tmp/work/nitrogen6x-poky-linux-gnueabi/imx-test/1_3.10.9-1.0.0-r0/imx-test-3.10.9-1.0.0/test/mxc_als_test'
  128. make -C mxc_asrc_test
  129. make[2]: Entering directory `/home/ericn/yocto/build-qt4-n6x/tmp/work/nitrogen6x-poky-linux-gnueabi/imx-test/1_3.10.9-1.0.0-r0/imx-test-3.10.9-1.0.0/test/mxc_asrc_test'
  130. cp audio8k16S.wav /home/ericn/yocto/build-qt4-n6x/tmp/work/nitrogen6x-poky-linux-gnueabi/imx-test/1_3.10.9-1.0.0-r0/imx-test-3.10.9-1.0.0/platform/IMX6Q/
  131. make[2]: Leaving directory `/home/ericn/yocto/build-qt4-n6x/tmp/work/nitrogen6x-poky-linux-gnueabi/imx-test/1_3.10.9-1.0.0-r0/imx-test-3.10.9-1.0.0/test/mxc_asrc_test'
  132. make -C mxc_cec_test
  133. make[2]: Entering directory `/home/ericn/yocto/build-qt4-n6x/tmp/work/nitrogen6x-poky-linux-gnueabi/imx-test/1_3.10.9-1.0.0-r0/imx-test-3.10.9-1.0.0/test/mxc_cec_test'
  134. make[2]: Nothing to be done for `all'.
  135. make[2]: Leaving directory `/home/ericn/yocto/build-qt4-n6x/tmp/work/nitrogen6x-poky-linux-gnueabi/imx-test/1_3.10.9-1.0.0-r0/imx-test-3.10.9-1.0.0/test/mxc_cec_test'
  136. make -C mxc_clock_test
  137. make[2]: Entering directory `/home/ericn/yocto/build-qt4-n6x/tmp/work/nitrogen6x-poky-linux-gnueabi/imx-test/1_3.10.9-1.0.0-r0/imx-test-3.10.9-1.0.0/test/mxc_clock_test'
  138. make[2]: Nothing to be done for `all'.
  139. make[2]: Leaving directory `/home/ericn/yocto/build-qt4-n6x/tmp/work/nitrogen6x-poky-linux-gnueabi/imx-test/1_3.10.9-1.0.0-r0/imx-test-3.10.9-1.0.0/test/mxc_clock_test'
  140. make -C mxc_dryice_test
  141. make[2]: Entering directory `/home/ericn/yocto/build-qt4-n6x/tmp/work/nitrogen6x-poky-linux-gnueabi/imx-test/1_3.10.9-1.0.0-r0/imx-test-3.10.9-1.0.0/test/mxc_dryice_test'
  142. make[2]: Nothing to be done for `all'.
  143. make[2]: Leaving directory `/home/ericn/yocto/build-qt4-n6x/tmp/work/nitrogen6x-poky-linux-gnueabi/imx-test/1_3.10.9-1.0.0-r0/imx-test-3.10.9-1.0.0/test/mxc_dryice_test'
  144. make -C mxc_fb_test
  145. make[2]: Entering directory `/home/ericn/yocto/build-qt4-n6x/tmp/work/nitrogen6x-poky-linux-gnueabi/imx-test/1_3.10.9-1.0.0-r0/imx-test-3.10.9-1.0.0/test/mxc_fb_test'
  146. make[2]: Nothing to be done for `all'.
  147. make[2]: Leaving directory `/home/ericn/yocto/build-qt4-n6x/tmp/work/nitrogen6x-poky-linux-gnueabi/imx-test/1_3.10.9-1.0.0-r0/imx-test-3.10.9-1.0.0/test/mxc_fb_test'
  148. make -C mxc_firi_test
  149. make[2]: Entering directory `/home/ericn/yocto/build-qt4-n6x/tmp/work/nitrogen6x-poky-linux-gnueabi/imx-test/1_3.10.9-1.0.0-r0/imx-test-3.10.9-1.0.0/test/mxc_firi_test'
  150. make[2]: Nothing to be done for `all'.
  151. make[2]: Leaving directory `/home/ericn/yocto/build-qt4-n6x/tmp/work/nitrogen6x-poky-linux-gnueabi/imx-test/1_3.10.9-1.0.0-r0/imx-test-3.10.9-1.0.0/test/mxc_firi_test'
  152. make -C mxc_hdd_test
  153. make[2]: Entering directory `/home/ericn/yocto/build-qt4-n6x/tmp/work/nitrogen6x-poky-linux-gnueabi/imx-test/1_3.10.9-1.0.0-r0/imx-test-3.10.9-1.0.0/test/mxc_hdd_test'
  154. make[2]: Nothing to be done for `all'.
  155. make[2]: Leaving directory `/home/ericn/yocto/build-qt4-n6x/tmp/work/nitrogen6x-poky-linux-gnueabi/imx-test/1_3.10.9-1.0.0-r0/imx-test-3.10.9-1.0.0/test/mxc_hdd_test'
  156. make -C mxc_i2c_slave_test
  157. make[2]: Entering directory `/home/ericn/yocto/build-qt4-n6x/tmp/work/nitrogen6x-poky-linux-gnueabi/imx-test/1_3.10.9-1.0.0-r0/imx-test-3.10.9-1.0.0/test/mxc_i2c_slave_test'
  158. make[2]: Nothing to be done for `all'.
  159. make[2]: Leaving directory `/home/ericn/yocto/build-qt4-n6x/tmp/work/nitrogen6x-poky-linux-gnueabi/imx-test/1_3.10.9-1.0.0-r0/imx-test-3.10.9-1.0.0/test/mxc_i2c_slave_test'
  160. make -C mxc_i2c_test
  161. make[2]: Entering directory `/home/ericn/yocto/build-qt4-n6x/tmp/work/nitrogen6x-poky-linux-gnueabi/imx-test/1_3.10.9-1.0.0-r0/imx-test-3.10.9-1.0.0/test/mxc_i2c_test'
  162. make[2]: Nothing to be done for `all'.
  163. make[2]: Leaving directory `/home/ericn/yocto/build-qt4-n6x/tmp/work/nitrogen6x-poky-linux-gnueabi/imx-test/1_3.10.9-1.0.0-r0/imx-test-3.10.9-1.0.0/test/mxc_i2c_test'
  164. make -C mxc_iim_test
  165. make[2]: Entering directory `/home/ericn/yocto/build-qt4-n6x/tmp/work/nitrogen6x-poky-linux-gnueabi/imx-test/1_3.10.9-1.0.0-r0/imx-test-3.10.9-1.0.0/test/mxc_iim_test'
  166. make[2]: Nothing to be done for `all'.
  167. make[2]: Leaving directory `/home/ericn/yocto/build-qt4-n6x/tmp/work/nitrogen6x-poky-linux-gnueabi/imx-test/1_3.10.9-1.0.0-r0/imx-test-3.10.9-1.0.0/test/mxc_iim_test'
  168. make -C mxc_ipudev_test
  169. make[2]: Entering directory `/home/ericn/yocto/build-qt4-n6x/tmp/work/nitrogen6x-poky-linux-gnueabi/imx-test/1_3.10.9-1.0.0-r0/imx-test-3.10.9-1.0.0/test/mxc_ipudev_test'
  170. make[2]: `/home/ericn/yocto/build-qt4-n6x/tmp/work/nitrogen6x-poky-linux-gnueabi/imx-test/1_3.10.9-1.0.0-r0/imx-test-3.10.9-1.0.0/platform/IMX6Q//mxc_ipudev_test.out' is up to date.
  171. make[2]: Leaving directory `/home/ericn/yocto/build-qt4-n6x/tmp/work/nitrogen6x-poky-linux-gnueabi/imx-test/1_3.10.9-1.0.0-r0/imx-test-3.10.9-1.0.0/test/mxc_ipudev_test'
  172. make -C mxc_keyb_test
  173. make[2]: Entering directory `/home/ericn/yocto/build-qt4-n6x/tmp/work/nitrogen6x-poky-linux-gnueabi/imx-test/1_3.10.9-1.0.0-r0/imx-test-3.10.9-1.0.0/test/mxc_keyb_test'
  174. make[2]: Nothing to be done for `all'.
  175. make[2]: Leaving directory `/home/ericn/yocto/build-qt4-n6x/tmp/work/nitrogen6x-poky-linux-gnueabi/imx-test/1_3.10.9-1.0.0-r0/imx-test-3.10.9-1.0.0/test/mxc_keyb_test'
  176. make -C mxc_l2switch
  177. make[2]: Entering directory `/home/ericn/yocto/build-qt4-n6x/tmp/work/nitrogen6x-poky-linux-gnueabi/imx-test/1_3.10.9-1.0.0-r0/imx-test-3.10.9-1.0.0/test/mxc_l2switch'
  178. make[2]: Nothing to be done for `all'.
  179. make[2]: Leaving directory `/home/ericn/yocto/build-qt4-n6x/tmp/work/nitrogen6x-poky-linux-gnueabi/imx-test/1_3.10.9-1.0.0-r0/imx-test-3.10.9-1.0.0/test/mxc_l2switch'
  180. make -C mxc_mbx_test
  181. make[2]: Entering directory `/home/ericn/yocto/build-qt4-n6x/tmp/work/nitrogen6x-poky-linux-gnueabi/imx-test/1_3.10.9-1.0.0-r0/imx-test-3.10.9-1.0.0/test/mxc_mbx_test'
  182. make[2]: Nothing to be done for `all'.
  183. make[2]: Leaving directory `/home/ericn/yocto/build-qt4-n6x/tmp/work/nitrogen6x-poky-linux-gnueabi/imx-test/1_3.10.9-1.0.0-r0/imx-test-3.10.9-1.0.0/test/mxc_mbx_test'
  184. make -C mxc_mlb_test
  185. make[2]: Entering directory `/home/ericn/yocto/build-qt4-n6x/tmp/work/nitrogen6x-poky-linux-gnueabi/imx-test/1_3.10.9-1.0.0-r0/imx-test-3.10.9-1.0.0/test/mxc_mlb_test'
  186. make[2]: Nothing to be done for `all'.
  187. make[2]: Leaving directory `/home/ericn/yocto/build-qt4-n6x/tmp/work/nitrogen6x-poky-linux-gnueabi/imx-test/1_3.10.9-1.0.0-r0/imx-test-3.10.9-1.0.0/test/mxc_mlb_test'
  188. make -C mxc_mmc_test
  189. make[2]: Entering directory `/home/ericn/yocto/build-qt4-n6x/tmp/work/nitrogen6x-poky-linux-gnueabi/imx-test/1_3.10.9-1.0.0-r0/imx-test-3.10.9-1.0.0/test/mxc_mmc_test'
  190. make[2]: Nothing to be done for `all'.
  191. make[2]: Leaving directory `/home/ericn/yocto/build-qt4-n6x/tmp/work/nitrogen6x-poky-linux-gnueabi/imx-test/1_3.10.9-1.0.0-r0/imx-test-3.10.9-1.0.0/test/mxc_mmc_test'
  192. make -C mxc_mpeg4_enc_test
  193. make[2]: Entering directory `/home/ericn/yocto/build-qt4-n6x/tmp/work/nitrogen6x-poky-linux-gnueabi/imx-test/1_3.10.9-1.0.0-r0/imx-test-3.10.9-1.0.0/test/mxc_mpeg4_enc_test'
  194.      Building /home/ericn/yocto/build-qt4-n6x/tmp/work/nitrogen6x-poky-linux-gnueabi/imx-test/1_3.10.9-1.0.0-r0/imx-test-3.10.9-1.0.0/platform/IMX6Q//cam2mpeg4_vga.out
  195. In file included from /home/ericn/yocto/build-qt4-n6x/tmp/sysroots/nitrogen6x/usr/src/kernel/include/linux/videodev2.h:66:0,
  196.                  from cam2mpeg4_vga.c:17:
  197. /home/ericn/yocto/build-qt4-n6x/tmp/sysroots/nitrogen6x/usr/src/kernel/include/linux/types.h:13:2: warning: #warning "Attempt to use kernel headers from user space, see http://kernelnewbies.org/KernelHeaders" [-Wcpp]
  198.  #warning "Attempt to use kernel headers from user space, see http://kernelnewbies.org/KernelHeaders"
  199.   ^
  200. make[2]: Leaving directory `/home/ericn/yocto/build-qt4-n6x/tmp/work/nitrogen6x-poky-linux-gnueabi/imx-test/1_3.10.9-1.0.0-r0/imx-test-3.10.9-1.0.0/test/mxc_mpeg4_enc_test'
  201. make -C mxc_oprofile_test
  202. make[2]: Entering directory `/home/ericn/yocto/build-qt4-n6x/tmp/work/nitrogen6x-poky-linux-gnueabi/imx-test/1_3.10.9-1.0.0-r0/imx-test-3.10.9-1.0.0/test/mxc_oprofile_test'
  203. make[2]: Nothing to be done for `all'.
  204. make[2]: Leaving directory `/home/ericn/yocto/build-qt4-n6x/tmp/work/nitrogen6x-poky-linux-gnueabi/imx-test/1_3.10.9-1.0.0-r0/imx-test-3.10.9-1.0.0/test/mxc_oprofile_test'
  205. make -C mxc_owire_test
  206. make[2]: Entering directory `/home/ericn/yocto/build-qt4-n6x/tmp/work/nitrogen6x-poky-linux-gnueabi/imx-test/1_3.10.9-1.0.0-r0/imx-test-3.10.9-1.0.0/test/mxc_owire_test'
  207. make[2]: Nothing to be done for `all'.
  208. make[2]: Leaving directory `/home/ericn/yocto/build-qt4-n6x/tmp/work/nitrogen6x-poky-linux-gnueabi/imx-test/1_3.10.9-1.0.0-r0/imx-test-3.10.9-1.0.0/test/mxc_owire_test'
  209. make -C mxc_pf_test
  210. make[2]: Entering directory `/home/ericn/yocto/build-qt4-n6x/tmp/work/nitrogen6x-poky-linux-gnueabi/imx-test/1_3.10.9-1.0.0-r0/imx-test-3.10.9-1.0.0/test/mxc_pf_test'
  211. make[2]: Nothing to be done for `all'.
  212. make[2]: Leaving directory `/home/ericn/yocto/build-qt4-n6x/tmp/work/nitrogen6x-poky-linux-gnueabi/imx-test/1_3.10.9-1.0.0-r0/imx-test-3.10.9-1.0.0/test/mxc_pf_test'
  213. make -C mxc_pmic_test
  214. make[2]: Entering directory `/home/ericn/yocto/build-qt4-n6x/tmp/work/nitrogen6x-poky-linux-gnueabi/imx-test/1_3.10.9-1.0.0-r0/imx-test-3.10.9-1.0.0/test/mxc_pmic_test'
  215. make[2]: Nothing to be done for `all'.
  216. make[2]: Leaving directory `/home/ericn/yocto/build-qt4-n6x/tmp/work/nitrogen6x-poky-linux-gnueabi/imx-test/1_3.10.9-1.0.0-r0/imx-test-3.10.9-1.0.0/test/mxc_pmic_test'
  217. make -C mxc_rng_test
  218. make[2]: Entering directory `/home/ericn/yocto/build-qt4-n6x/tmp/work/nitrogen6x-poky-linux-gnueabi/imx-test/1_3.10.9-1.0.0-r0/imx-test-3.10.9-1.0.0/test/mxc_rng_test'
  219. make[2]: Nothing to be done for `all'.
  220. make[2]: Leaving directory `/home/ericn/yocto/build-qt4-n6x/tmp/work/nitrogen6x-poky-linux-gnueabi/imx-test/1_3.10.9-1.0.0-r0/imx-test-3.10.9-1.0.0/test/mxc_rng_test'
  221. make -C mxc_rtc
  222. make[2]: Entering directory `/home/ericn/yocto/build-qt4-n6x/tmp/work/nitrogen6x-poky-linux-gnueabi/imx-test/1_3.10.9-1.0.0-r0/imx-test-3.10.9-1.0.0/test/mxc_rtc'
  223. make[2]: Nothing to be done for `all'.
  224. make[2]: Leaving directory `/home/ericn/yocto/build-qt4-n6x/tmp/work/nitrogen6x-poky-linux-gnueabi/imx-test/1_3.10.9-1.0.0-r0/imx-test-3.10.9-1.0.0/test/mxc_rtc'
  225. make -C mxc_sahara_test
  226. make[2]: Entering directory `/home/ericn/yocto/build-qt4-n6x/tmp/work/nitrogen6x-poky-linux-gnueabi/imx-test/1_3.10.9-1.0.0-r0/imx-test-3.10.9-1.0.0/test/mxc_sahara_test'
  227. make[2]: Nothing to be done for `all'.
  228. make[2]: Leaving directory `/home/ericn/yocto/build-qt4-n6x/tmp/work/nitrogen6x-poky-linux-gnueabi/imx-test/1_3.10.9-1.0.0-r0/imx-test-3.10.9-1.0.0/test/mxc_sahara_test'
  229. make -C mxc_scc
  230. make[2]: Entering directory `/home/ericn/yocto/build-qt4-n6x/tmp/work/nitrogen6x-poky-linux-gnueabi/imx-test/1_3.10.9-1.0.0-r0/imx-test-3.10.9-1.0.0/test/mxc_scc'
  231. make[2]: Nothing to be done for `all'.
  232. make[2]: Leaving directory `/home/ericn/yocto/build-qt4-n6x/tmp/work/nitrogen6x-poky-linux-gnueabi/imx-test/1_3.10.9-1.0.0-r0/imx-test-3.10.9-1.0.0/test/mxc_scc'
  233. make -C mxc_scc2
  234. make[2]: Entering directory `/home/ericn/yocto/build-qt4-n6x/tmp/work/nitrogen6x-poky-linux-gnueabi/imx-test/1_3.10.9-1.0.0-r0/imx-test-3.10.9-1.0.0/test/mxc_scc2'
  235. make[2]: Nothing to be done for `all'.
  236. make[2]: Leaving directory `/home/ericn/yocto/build-qt4-n6x/tmp/work/nitrogen6x-poky-linux-gnueabi/imx-test/1_3.10.9-1.0.0-r0/imx-test-3.10.9-1.0.0/test/mxc_scc2'
  237. make -C mxc_sdma_test
  238. make[2]: Entering directory `/home/ericn/yocto/build-qt4-n6x/tmp/work/nitrogen6x-poky-linux-gnueabi/imx-test/1_3.10.9-1.0.0-r0/imx-test-3.10.9-1.0.0/test/mxc_sdma_test'
  239. make[2]: Nothing to be done for `all'.
  240. make[2]: Leaving directory `/home/ericn/yocto/build-qt4-n6x/tmp/work/nitrogen6x-poky-linux-gnueabi/imx-test/1_3.10.9-1.0.0-r0/imx-test-3.10.9-1.0.0/test/mxc_sdma_test'
  241. make -C mxc_sim_test
  242. make[2]: Entering directory `/home/ericn/yocto/build-qt4-n6x/tmp/work/nitrogen6x-poky-linux-gnueabi/imx-test/1_3.10.9-1.0.0-r0/imx-test-3.10.9-1.0.0/test/mxc_sim_test'
  243. make[2]: Nothing to be done for `all'.
  244. make[2]: Leaving directory `/home/ericn/yocto/build-qt4-n6x/tmp/work/nitrogen6x-poky-linux-gnueabi/imx-test/1_3.10.9-1.0.0-r0/imx-test-3.10.9-1.0.0/test/mxc_sim_test'
  245. make -C mxc_sound_test
  246. make[2]: Entering directory `/home/ericn/yocto/build-qt4-n6x/tmp/work/nitrogen6x-poky-linux-gnueabi/imx-test/1_3.10.9-1.0.0-r0/imx-test-3.10.9-1.0.0/test/mxc_sound_test'
  247. make[2]: Nothing to be done for `all'.
  248. make[2]: Leaving directory `/home/ericn/yocto/build-qt4-n6x/tmp/work/nitrogen6x-poky-linux-gnueabi/imx-test/1_3.10.9-1.0.0-r0/imx-test-3.10.9-1.0.0/test/mxc_sound_test'
  249. make -C mxc_spi_test
  250. make[2]: Entering directory `/home/ericn/yocto/build-qt4-n6x/tmp/work/nitrogen6x-poky-linux-gnueabi/imx-test/1_3.10.9-1.0.0-r0/imx-test-3.10.9-1.0.0/test/mxc_spi_test'
  251. make[2]: Nothing to be done for `all'.
  252. make[2]: Leaving directory `/home/ericn/yocto/build-qt4-n6x/tmp/work/nitrogen6x-poky-linux-gnueabi/imx-test/1_3.10.9-1.0.0-r0/imx-test-3.10.9-1.0.0/test/mxc_spi_test'
  253. make -C mxc_tuner_test
  254. make[2]: Entering directory `/home/ericn/yocto/build-qt4-n6x/tmp/work/nitrogen6x-poky-linux-gnueabi/imx-test/1_3.10.9-1.0.0-r0/imx-test-3.10.9-1.0.0/test/mxc_tuner_test'
  255. make[2]: Nothing to be done for `all'.
  256. make[2]: Leaving directory `/home/ericn/yocto/build-qt4-n6x/tmp/work/nitrogen6x-poky-linux-gnueabi/imx-test/1_3.10.9-1.0.0-r0/imx-test-3.10.9-1.0.0/test/mxc_tuner_test'
  257. make -C mxc_uart_test
  258. make[2]: Entering directory `/home/ericn/yocto/build-qt4-n6x/tmp/work/nitrogen6x-poky-linux-gnueabi/imx-test/1_3.10.9-1.0.0-r0/imx-test-3.10.9-1.0.0/test/mxc_uart_test'
  259. make[2]: Nothing to be done for `all'.
  260. make[2]: Leaving directory `/home/ericn/yocto/build-qt4-n6x/tmp/work/nitrogen6x-poky-linux-gnueabi/imx-test/1_3.10.9-1.0.0-r0/imx-test-3.10.9-1.0.0/test/mxc_uart_test'
  261. make -C mxc_usb_test
  262. make[2]: Entering directory `/home/ericn/yocto/build-qt4-n6x/tmp/work/nitrogen6x-poky-linux-gnueabi/imx-test/1_3.10.9-1.0.0-r0/imx-test-3.10.9-1.0.0/test/mxc_usb_test'
  263. make[2]: Nothing to be done for `all'.
  264. make[2]: Leaving directory `/home/ericn/yocto/build-qt4-n6x/tmp/work/nitrogen6x-poky-linux-gnueabi/imx-test/1_3.10.9-1.0.0-r0/imx-test-3.10.9-1.0.0/test/mxc_usb_test'
  265. make -C mxc_v4l2_test
  266. make[2]: Entering directory `/home/ericn/yocto/build-qt4-n6x/tmp/work/nitrogen6x-poky-linux-gnueabi/imx-test/1_3.10.9-1.0.0-r0/imx-test-3.10.9-1.0.0/test/mxc_v4l2_test'
  267. make[2]: Nothing to be done for `all'.
  268. make[2]: Leaving directory `/home/ericn/yocto/build-qt4-n6x/tmp/work/nitrogen6x-poky-linux-gnueabi/imx-test/1_3.10.9-1.0.0-r0/imx-test-3.10.9-1.0.0/test/mxc_v4l2_test'
  269. make -C mxc_vpu_test
  270. make[2]: Entering directory `/home/ericn/yocto/build-qt4-n6x/tmp/work/nitrogen6x-poky-linux-gnueabi/imx-test/1_3.10.9-1.0.0-r0/imx-test-3.10.9-1.0.0/test/mxc_vpu_test'
  271. arm-poky-linux-gnueabi-gcc -o mxc_vpu_test.out main.o dec.o enc.o capture.o display.o fb.o utils.o loopback.o transcode.o  -lvpu -lipu -lrt -lpthread
  272. /home/ericn/yocto/build-qt4-n6x/tmp/sysroots/x86_64-linux/usr/bin/cortexa9hf-vfp-neon-poky-linux-gnueabi/../../libexec/cortexa9hf-vfp-neon-poky-linux-gnueabi/gcc/arm-poky-linux-gnueabi/4.8.1/ld: cannot find crt1.o: No such file or directory
  273. /home/ericn/yocto/build-qt4-n6x/tmp/sysroots/x86_64-linux/usr/bin/cortexa9hf-vfp-neon-poky-linux-gnueabi/../../libexec/cortexa9hf-vfp-neon-poky-linux-gnueabi/gcc/arm-poky-linux-gnueabi/4.8.1/ld: cannot find crti.o: No such file or directory
  274. /home/ericn/yocto/build-qt4-n6x/tmp/sysroots/x86_64-linux/usr/bin/cortexa9hf-vfp-neon-poky-linux-gnueabi/../../libexec/cortexa9hf-vfp-neon-poky-linux-gnueabi/gcc/arm-poky-linux-gnueabi/4.8.1/ld: cannot find crtbegin.o: No such file or directory
  275. /home/ericn/yocto/build-qt4-n6x/tmp/sysroots/x86_64-linux/usr/bin/cortexa9hf-vfp-neon-poky-linux-gnueabi/../../libexec/cortexa9hf-vfp-neon-poky-linux-gnueabi/gcc/arm-poky-linux-gnueabi/4.8.1/ld: cannot find -lvpu
  276. /home/ericn/yocto/build-qt4-n6x/tmp/sysroots/x86_64-linux/usr/bin/cortexa9hf-vfp-neon-poky-linux-gnueabi/../../libexec/cortexa9hf-vfp-neon-poky-linux-gnueabi/gcc/arm-poky-linux-gnueabi/4.8.1/ld: cannot find -lipu
  277. /home/ericn/yocto/build-qt4-n6x/tmp/sysroots/x86_64-linux/usr/bin/cortexa9hf-vfp-neon-poky-linux-gnueabi/../../libexec/cortexa9hf-vfp-neon-poky-linux-gnueabi/gcc/arm-poky-linux-gnueabi/4.8.1/ld: cannot find -lrt
  278. /home/ericn/yocto/build-qt4-n6x/tmp/sysroots/x86_64-linux/usr/bin/cortexa9hf-vfp-neon-poky-linux-gnueabi/../../libexec/cortexa9hf-vfp-neon-poky-linux-gnueabi/gcc/arm-poky-linux-gnueabi/4.8.1/ld: cannot find -lpthread
  279. /home/ericn/yocto/build-qt4-n6x/tmp/sysroots/x86_64-linux/usr/bin/cortexa9hf-vfp-neon-poky-linux-gnueabi/../../libexec/cortexa9hf-vfp-neon-poky-linux-gnueabi/gcc/arm-poky-linux-gnueabi/4.8.1/ld: cannot find -lgcc
  280. /home/ericn/yocto/build-qt4-n6x/tmp/sysroots/x86_64-linux/usr/bin/cortexa9hf-vfp-neon-poky-linux-gnueabi/../../libexec/cortexa9hf-vfp-neon-poky-linux-gnueabi/gcc/arm-poky-linux-gnueabi/4.8.1/ld: cannot find -lgcc_s
  281. /home/ericn/yocto/build-qt4-n6x/tmp/sysroots/x86_64-linux/usr/bin/cortexa9hf-vfp-neon-poky-linux-gnueabi/../../libexec/cortexa9hf-vfp-neon-poky-linux-gnueabi/gcc/arm-poky-linux-gnueabi/4.8.1/ld: cannot find -lc
  282. /home/ericn/yocto/build-qt4-n6x/tmp/sysroots/x86_64-linux/usr/bin/cortexa9hf-vfp-neon-poky-linux-gnueabi/../../libexec/cortexa9hf-vfp-neon-poky-linux-gnueabi/gcc/arm-poky-linux-gnueabi/4.8.1/ld: cannot find -lgcc
  283. /home/ericn/yocto/build-qt4-n6x/tmp/sysroots/x86_64-linux/usr/bin/cortexa9hf-vfp-neon-poky-linux-gnueabi/../../libexec/cortexa9hf-vfp-neon-poky-linux-gnueabi/gcc/arm-poky-linux-gnueabi/4.8.1/ld: cannot find -lgcc_s
  284. /home/ericn/yocto/build-qt4-n6x/tmp/sysroots/x86_64-linux/usr/bin/cortexa9hf-vfp-neon-poky-linux-gnueabi/../../libexec/cortexa9hf-vfp-neon-poky-linux-gnueabi/gcc/arm-poky-linux-gnueabi/4.8.1/ld: cannot find crtend.o: No such file or directory
  285. /home/ericn/yocto/build-qt4-n6x/tmp/sysroots/x86_64-linux/usr/bin/cortexa9hf-vfp-neon-poky-linux-gnueabi/../../libexec/cortexa9hf-vfp-neon-poky-linux-gnueabi/gcc/arm-poky-linux-gnueabi/4.8.1/ld: cannot find crtn.o: No such file or directory
  286. collect2: error: ld returned 1 exit status
  287. make[2]: *** [mxc_vpu_test.out] Error 1
  288. make[2]: Leaving directory `/home/ericn/yocto/build-qt4-n6x/tmp/work/nitrogen6x-poky-linux-gnueabi/imx-test/1_3.10.9-1.0.0-r0/imx-test-3.10.9-1.0.0/test/mxc_vpu_test'
  289. make[1]: [mxc_vpu_test] Error 2 (ignored)
  290. make -C mxc_x11_test
  291. make[2]: Entering directory `/home/ericn/yocto/build-qt4-n6x/tmp/work/nitrogen6x-poky-linux-gnueabi/imx-test/1_3.10.9-1.0.0-r0/imx-test-3.10.9-1.0.0/test/mxc_x11_test'
  292. make[2]: Nothing to be done for `all'.
  293. make[2]: Leaving directory `/home/ericn/yocto/build-qt4-n6x/tmp/work/nitrogen6x-poky-linux-gnueabi/imx-test/1_3.10.9-1.0.0-r0/imx-test-3.10.9-1.0.0/test/mxc_x11_test'
  294. make -C pm
  295. make[2]: Entering directory `/home/ericn/yocto/build-qt4-n6x/tmp/work/nitrogen6x-poky-linux-gnueabi/imx-test/1_3.10.9-1.0.0-r0/imx-test-3.10.9-1.0.0/test/pm'
  296. make[2]: Nothing to be done for `all'.
  297. make[2]: Leaving directory `/home/ericn/yocto/build-qt4-n6x/tmp/work/nitrogen6x-poky-linux-gnueabi/imx-test/1_3.10.9-1.0.0-r0/imx-test-3.10.9-1.0.0/test/pm'
  298. make -C pxp_lib_test
  299. make[2]: Entering directory `/home/ericn/yocto/build-qt4-n6x/tmp/work/nitrogen6x-poky-linux-gnueabi/imx-test/1_3.10.9-1.0.0-r0/imx-test-3.10.9-1.0.0/test/pxp_lib_test'
  300. make[2]: `/home/ericn/yocto/build-qt4-n6x/tmp/work/nitrogen6x-poky-linux-gnueabi/imx-test/1_3.10.9-1.0.0-r0/imx-test-3.10.9-1.0.0/platform/IMX6Q//pxp_test.out' is up to date.
  301. make[2]: Leaving directory `/home/ericn/yocto/build-qt4-n6x/tmp/work/nitrogen6x-poky-linux-gnueabi/imx-test/1_3.10.9-1.0.0-r0/imx-test-3.10.9-1.0.0/test/pxp_lib_test'
  302. make -C pxp_v4l2_test
  303. make[2]: Entering directory `/home/ericn/yocto/build-qt4-n6x/tmp/work/nitrogen6x-poky-linux-gnueabi/imx-test/1_3.10.9-1.0.0-r0/imx-test-3.10.9-1.0.0/test/pxp_v4l2_test'
  304. make[2]: Nothing to be done for `all'.
  305. make[2]: Leaving directory `/home/ericn/yocto/build-qt4-n6x/tmp/work/nitrogen6x-poky-linux-gnueabi/imx-test/1_3.10.9-1.0.0-r0/imx-test-3.10.9-1.0.0/test/pxp_v4l2_test'
  306. make -C wdog
  307. make[2]: Entering directory `/home/ericn/yocto/build-qt4-n6x/tmp/work/nitrogen6x-poky-linux-gnueabi/imx-test/1_3.10.9-1.0.0-r0/imx-test-3.10.9-1.0.0/test/wdog'
  308. make[2]: Nothing to be done for `all'.
  309. make[2]: Leaving directory `/home/ericn/yocto/build-qt4-n6x/tmp/work/nitrogen6x-poky-linux-gnueabi/imx-test/1_3.10.9-1.0.0-r0/imx-test-3.10.9-1.0.0/test/wdog'
  310. make[1]: Leaving directory `/home/ericn/yocto/build-qt4-n6x/tmp/work/nitrogen6x-poky-linux-gnueabi/imx-test/1_3.10.9-1.0.0-r0/imx-test-3.10.9-1.0.0/test'
  311.  
  312. Building test modules...
  313. make -C /home/ericn/yocto/build-qt4-n6x/tmp/work/nitrogen6x-poky-linux-gnueabi/imx-test/1_3.10.9-1.0.0-r0/imx-test-3.10.9-1.0.0/module_test OBJDIR=/home/ericn/yocto/build-qt4-n6x/tmp/work/nitrogen6x-poky-linux-gnueabi/imx-test/1_3.10.9-1.0.0-r0/imx-test-3.10.9-1.0.0/platform/IMX6Q//modules
  314. make[1]: Entering directory `/home/ericn/yocto/build-qt4-n6x/tmp/work/nitrogen6x-poky-linux-gnueabi/imx-test/1_3.10.9-1.0.0-r0/imx-test-3.10.9-1.0.0/module_test'
  315. make -C /home/ericn/yocto/build-qt4-n6x/tmp/sysroots/nitrogen6x/usr/src/kernel M=`pwd` KBUILD_OUTPUT=/home/ericn/yocto/build-qt4-n6x/tmp/sysroots/nitrogen6x/usr/src/kernel ARCH=arm CROSS_COMPILE=arm-poky-linux-gnueabi-  modules
  316. make[2]: Entering directory `/home/ericn/yocto/build-qt4-n6x/tmp/sysroots/nitrogen6x/usr/src/kernel'
  317. make -C /home/ericn/yocto/build-qt4-n6x/tmp/sysroots/nitrogen6x/usr/src/kernel \
  318.         KBUILD_SRC=/home/ericn/yocto/build-qt4-n6x/tmp/sysroots/nitrogen6x/usr/src/kernel \
  319.         KBUILD_EXTMOD="/home/ericn/yocto/build-qt4-n6x/tmp/work/nitrogen6x-poky-linux-gnueabi/imx-test/1_3.10.9-1.0.0-r0/imx-test-3.10.9-1.0.0/module_test" -f /home/ericn/yocto/build-qt4-n6x/tmp/sysroots/nitrogen6x/usr/src/kernel/Makefile \
  320.         modules
  321. test -e include/generated/autoconf.h -a -e include/config/auto.conf || (                \
  322.         echo;                                                           \
  323.         echo "  ERROR: Kernel configuration is invalid.";               \
  324.         echo "         include/generated/autoconf.h or include/config/auto.conf are missing.";\
  325.         echo "         Run 'make oldconfig && make prepare' on kernel src to fix it.";  \
  326.         echo;                                                           \
  327.         /bin/false)
  328. mkdir -p /home/ericn/yocto/build-qt4-n6x/tmp/work/nitrogen6x-poky-linux-gnueabi/imx-test/1_3.10.9-1.0.0-r0/imx-test-3.10.9-1.0.0/module_test/.tmp_versions ; rm -f /home/ericn/yocto/build-qt4-n6x/tmp/work/nitrogen6x-poky-linux-gnueabi/imx-test/1_3.10.9-1.0.0-r0/imx-test-3.10.9-1.0.0/module_test/.tmp_versions/*
  329. make -f /home/ericn/yocto/build-qt4-n6x/tmp/sysroots/nitrogen6x/usr/src/kernel/scripts/Makefile.build obj=/home/ericn/yocto/build-qt4-n6x/tmp/work/nitrogen6x-poky-linux-gnueabi/imx-test/1_3.10.9-1.0.0-r0/imx-test-3.10.9-1.0.0/module_test
  330. (cat /dev/null; ) > /home/ericn/yocto/build-qt4-n6x/tmp/work/nitrogen6x-poky-linux-gnueabi/imx-test/1_3.10.9-1.0.0-r0/imx-test-3.10.9-1.0.0/module_test/modules.order
  331. make -f /home/ericn/yocto/build-qt4-n6x/tmp/sysroots/nitrogen6x/usr/src/kernel/scripts/Makefile.modpost
  332.   scripts/mod/modpost -m  -i /home/ericn/yocto/build-qt4-n6x/tmp/sysroots/nitrogen6x/usr/src/kernel/Module.symvers -I /home/ericn/yocto/build-qt4-n6x/tmp/work/nitrogen6x-poky-linux-gnueabi/imx-test/1_3.10.9-1.0.0-r0/imx-test-3.10.9-1.0.0/module_test/Module.symvers  -o /home/ericn/yocto/build-qt4-n6x/tmp/work/nitrogen6x-poky-linux-gnueabi/imx-test/1_3.10.9-1.0.0-r0/imx-test-3.10.9-1.0.0/module_test/Module.symvers -S -w -c -s
  333. /bin/sh: scripts/mod/modpost: No such file or directory
  334. make[4]: *** [__modpost] Error 127
  335. make[3]: *** [modules] Error 2
  336. make[2]: *** [sub-make] Error 2
  337. make[2]: Leaving directory `/home/ericn/yocto/build-qt4-n6x/tmp/sysroots/nitrogen6x/usr/src/kernel'
  338. make[1]: *** [all] Error 2
  339. make[1]: Leaving directory `/home/ericn/yocto/build-qt4-n6x/tmp/work/nitrogen6x-poky-linux-gnueabi/imx-test/1_3.10.9-1.0.0-r0/imx-test-3.10.9-1.0.0/module_test'
  340. make: *** [module_test] Error 2
  341. WARNING: /home/ericn/yocto/build-qt4-n6x/tmp/work/nitrogen6x-poky-linux-gnueabi/imx-test/1_3.10.9-1.0.0-r0/temp/run.do_compile.23631:1 exit 2 from
  342.   LDFLAGS="" make PLATFORM=IMX6Q LINUXPATH=/home/ericn/yocto/build-qt4-n6x/tmp/sysroots/nitrogen6x/usr/src/kernel KBUILD_OUTPUT=/home/ericn/yocto/build-qt4-n6x/tmp/sysroots/nitrogen6x/usr/src/kernel CROSS_COMPILE=arm-poky-linux-gnueabi- V=1 INC="-I/home/ericn/yocto/build-qt4-n6x/tmp/sysroots/nitrogen6x/usr/include -I/home/ericn/yocto/build-qt4-n6x/tmp/work/nitrogen6x-poky-linux-gnueabi/imx-test/1_3.10.9-1.0.0-r0/imx-test-3.10.9-1.0.0/include -I/home/ericn/yocto/build-qt4-n6x/tmp/sysroots/nitrogen6x/usr/src/kernel/include/uapi -I/home/ericn/yocto/build-qt4-n6x/tmp/sysroots/nitrogen6x/usr/src/kernel/include -I/home/ericn/yocto/build-qt4-n6x/tmp/sysroots/nitrogen6x/usr/src/kernel/arch/arm/include -I/home/ericn/yocto/build-qt4-n6x/tmp/sysroots/nitrogen6x/usr/src/kernel/drivers/mxc/security/rng/include -I/home/ericn/yocto/build-qt4-n6x/tmp/sysroots/nitrogen6x/usr/src/kernel/drivers/mxc/security/sahara2/include"
  343. ERROR: Function failed: do_compile (log file is located at /home/ericn/yocto/build-qt4-n6x/tmp/work/nitrogen6x-poky-linux-gnueabi/imx-test/1_3.10.9-1.0.0-r0/temp/log.do_compile.23631)
RAW Paste Data
We use cookies for various purposes including analytics. By continuing to use Pastebin, you agree to our use of cookies as described in the Cookies Policy. OK, I Understand
 
Top