Guest User

Untitled

a guest
Feb 17th, 2026
194
0
Never
Not a member of Pastebin yet? Sign Up, it unlocks many cool features!
text 30.20 KB | None | 0 0
  1. ==> Making package: linux-lts61 6.1.163-1 (Tue 17 Feb 2026 10:52:40 AM EET)
  2. ==> Checking runtime dependencies...
  3. ==> Checking buildtime dependencies...
  4. ==> Retrieving sources...
  5. -> Downloading linux-6.1.tar.xz...
  6. % Total % Received % Xferd Average Speed Time Time Time Current
  7. Dload Upload Total Spent Left Speed
  8. 100 128.4M 100 128.4M 0 0 8.33M 0 00:15 00:15 10.78M
  9. -> Downloading linux-6.1.tar.sign...
  10. % Total % Received % Xferd Average Speed Time Time Time Current
  11. Dload Upload Total Spent Left Speed
  12. 100 983 100 983 0 0 7937 0 0
  13. -> Downloading patch-6.1.163.xz...
  14. % Total % Received % Xferd Average Speed Time Time Time Current
  15. Dload Upload Total Spent Left Speed
  16. 100 6.73M 100 6.73M 0 0 8.55M 0 0
  17. -> Found 0001-ZEN-Add-sysctl-and-CONFIG-to-disallow-unprivileged-C.patch
  18. -> Found 0004-Sphinx-7.2.2-8.0-PosixPath.patch
  19. -> Found 0005-depmod-remove-depmod_hack_needed.patch
  20. -> Found 0006-kernel-6.1-depmod-disable-for-packaging.patch
  21. -> Found 0007-Sphinx-docutils-0.22-deprecated-SafeString-ErrorString.patch
  22. -> Found 0008-perl-5.41-precedence-warning-kernel-doc.patch
  23. -> Found config
  24. ==> Validating source files with md5sums...
  25. linux-6.1.tar.xz ... Passed
  26. linux-6.1.tar.sign ... Skipped
  27. patch-6.1.163.xz ... Passed
  28. 0001-ZEN-Add-sysctl-and-CONFIG-to-disallow-unprivileged-C.patch ... Passed
  29. 0004-Sphinx-7.2.2-8.0-PosixPath.patch ... Passed
  30. 0005-depmod-remove-depmod_hack_needed.patch ... Passed
  31. 0006-kernel-6.1-depmod-disable-for-packaging.patch ... Passed
  32. 0007-Sphinx-docutils-0.22-deprecated-SafeString-ErrorString.patch ... Passed
  33. 0008-perl-5.41-precedence-warning-kernel-doc.patch ... Passed
  34. config ... Passed
  35. ==> Validating source files with sha256sums...
  36. linux-6.1.tar.xz ... Passed
  37. linux-6.1.tar.sign ... Skipped
  38. patch-6.1.163.xz ... Passed
  39. 0001-ZEN-Add-sysctl-and-CONFIG-to-disallow-unprivileged-C.patch ... Passed
  40. 0004-Sphinx-7.2.2-8.0-PosixPath.patch ... Passed
  41. 0005-depmod-remove-depmod_hack_needed.patch ... Passed
  42. 0006-kernel-6.1-depmod-disable-for-packaging.patch ... Passed
  43. 0007-Sphinx-docutils-0.22-deprecated-SafeString-ErrorString.patch ... Passed
  44. 0008-perl-5.41-precedence-warning-kernel-doc.patch ... Passed
  45. config ... Passed
  46. ==> Verifying source file signatures with gpg...
  47. linux-6.1.tar ... Passed
  48. ==> Extracting sources...
  49. -> Extracting linux-6.1.tar.xz with bsdtar
  50. -> Extracting patch-6.1.163.xz with xz
  51. ==> Starting prepare()...
  52. Setting version...
  53. -> Applying patch patch-6.1.163...
  54. -> Applying patch 0001-ZEN-Add-sysctl-and-CONFIG-to-disallow-unprivileged-C.patch...
  55. patching file include/linux/user_namespace.h
  56. Hunk #1 succeeded at 149 (offset 1 line).
  57. Hunk #2 succeeded at 184 (offset 1 line).
  58. patching file init/Kconfig
  59. Hunk #1 succeeded at 1257 (offset 9 lines).
  60. patching file kernel/fork.c
  61. Hunk #1 succeeded at 99 with fuzz 2 (offset 1 line).
  62. Hunk #2 succeeded at 2114 (offset 96 lines).
  63. Hunk #3 succeeded at 3268 (offset 87 lines).
  64. patching file kernel/sysctl.c
  65. patching file kernel/user_namespace.c
  66. -> Applying patch 0004-Sphinx-7.2.2-8.0-PosixPath.patch...
  67. patching file Documentation/sphinx/kerneldoc.py
  68. patching file Documentation/sphinx/kfigure.py
  69. -> Applying patch 0005-depmod-remove-depmod_hack_needed.patch...
  70. patching file scripts/depmod.sh
  71. -> Applying patch 0006-kernel-6.1-depmod-disable-for-packaging.patch...
  72. patching file Makefile
  73. Hunk #1 succeeded at 1942 (offset 16 lines).
  74. -> Applying patch 0007-Sphinx-docutils-0.22-deprecated-SafeString-ErrorString.patch...
  75. patching file Documentation/sphinx/kernel_abi.py
  76. patching file Documentation/sphinx/kernel_feat.py
  77. Hunk #1 succeeded at 40 with fuzz 1 (offset 2 lines).
  78. patching file Documentation/sphinx/kernel_include.py
  79. patching file Documentation/sphinx/maintainers_include.py
  80. -> Applying patch 0008-perl-5.41-precedence-warning-kernel-doc.patch...
  81. patching file scripts/kernel-doc
  82. Setting config...
  83. HOSTCC scripts/basic/fixdep
  84. HOSTCC scripts/kconfig/conf.o
  85. HOSTCC scripts/kconfig/confdata.o
  86. HOSTCC scripts/kconfig/expr.o
  87. LEX scripts/kconfig/lexer.lex.c
  88. YACC scripts/kconfig/parser.tab.[ch]
  89. HOSTCC scripts/kconfig/lexer.lex.o
  90. HOSTCC scripts/kconfig/menu.o
  91. HOSTCC scripts/kconfig/parser.tab.o
  92. HOSTCC scripts/kconfig/preprocess.o
  93. HOSTCC scripts/kconfig/symbol.o
  94. HOSTCC scripts/kconfig/util.o
  95. HOSTLD scripts/kconfig/conf
  96. #
  97. # configuration written to .config
  98. #
  99. --- ../config 2026-01-10 16:35:40.316777554 +0200
  100. +++ .config 2026-02-17 10:53:24.616838906 +0200
  101. @@ -1,23 +1,24 @@
  102. #
  103. # Automatically generated file; DO NOT EDIT.
  104. -# Linux/x86 6.1.71 Kernel Configuration
  105. +# Linux/x86 6.1.163 Kernel Configuration
  106. #
  107. -CONFIG_CC_VERSION_TEXT="gcc (GCC) 13.2.1 20230801"
  108. +CONFIG_CC_VERSION_TEXT="gcc (GCC) 15.2.1 20260209"
  109. CONFIG_CC_IS_GCC=y
  110. -CONFIG_GCC_VERSION=130201
  111. +CONFIG_GCC_VERSION=150201
  112. CONFIG_CLANG_VERSION=0
  113. CONFIG_AS_IS_GNU=y
  114. -CONFIG_AS_VERSION=24100
  115. +CONFIG_AS_VERSION=24600
  116. CONFIG_LD_IS_BFD=y
  117. -CONFIG_LD_VERSION=24100
  118. +CONFIG_LD_VERSION=24600
  119. CONFIG_LLD_VERSION=0
  120. +CONFIG_RUST_IS_AVAILABLE=y
  121. CONFIG_CC_CAN_LINK=y
  122. CONFIG_CC_CAN_LINK_STATIC=y
  123. CONFIG_CC_HAS_ASM_GOTO_OUTPUT=y
  124. CONFIG_CC_HAS_ASM_GOTO_TIED_OUTPUT=y
  125. CONFIG_CC_HAS_ASM_INLINE=y
  126. CONFIG_CC_HAS_NO_PROFILE_FN_ATTR=y
  127. -CONFIG_PAHOLE_VERSION=125
  128. +CONFIG_PAHOLE_VERSION=131
  129. CONFIG_IRQ_WORK=y
  130. CONFIG_BUILDTIME_TABLE_SORT=y
  131. CONFIG_THREAD_INFO_IN_TASK=y
  132. @@ -123,7 +124,6 @@
  133. CONFIG_BPF_JIT_ALWAYS_ON=y
  134. CONFIG_BPF_JIT_DEFAULT_ON=y
  135. CONFIG_BPF_UNPRIV_DEFAULT_OFF=y
  136. -CONFIG_USERMODE_DRIVER=y
  137. CONFIG_BPF_PRELOAD=y
  138. CONFIG_BPF_PRELOAD_UMD=m
  139. CONFIG_BPF_LSM=y
  140. @@ -203,7 +203,7 @@
  141. CONFIG_ARCH_WANT_BATCHED_UNMAP_TLB_FLUSH=y
  142. CONFIG_CC_HAS_INT128=y
  143. CONFIG_CC_IMPLICIT_FALLTHROUGH="-Wimplicit-fallthrough=5"
  144. -CONFIG_GCC11_NO_ARRAY_BOUNDS=y
  145. +CONFIG_GCC10_NO_ARRAY_BOUNDS=y
  146. CONFIG_CC_NO_ARRAY_BOUNDS=y
  147. CONFIG_ARCH_SUPPORTS_INT128=y
  148. CONFIG_NUMA_BALANCING=y
  149. @@ -452,7 +452,6 @@
  150. CONFIG_X86_CPA_STATISTICS=y
  151. CONFIG_X86_MEM_ENCRYPT=y
  152. CONFIG_AMD_MEM_ENCRYPT=y
  153. -# CONFIG_AMD_MEM_ENCRYPT_ACTIVE_BY_DEFAULT is not set
  154. CONFIG_NUMA=y
  155. CONFIG_AMD_NUMA=y
  156. CONFIG_X86_64_ACPI_NUMA=y
  157. @@ -483,6 +482,7 @@
  158. CONFIG_X86_SGX=y
  159. CONFIG_EFI=y
  160. CONFIG_EFI_STUB=y
  161. +CONFIG_EFI_HANDOVER_PROTOCOL=y
  162. CONFIG_EFI_MIXED=y
  163. # CONFIG_HZ_100 is not set
  164. # CONFIG_HZ_250 is not set
  165. @@ -521,7 +521,7 @@
  166.  
  167. CONFIG_CC_HAS_SLS=y
  168. CONFIG_CC_HAS_RETURN_THUNK=y
  169. -CONFIG_SPECULATION_MITIGATIONS=y
  170. +CONFIG_CPU_MITIGATIONS=y
  171. CONFIG_PAGE_TABLE_ISOLATION=y
  172. CONFIG_RETPOLINE=y
  173. CONFIG_RETHUNK=y
  174. @@ -531,6 +531,11 @@
  175. CONFIG_CPU_SRSO=y
  176. CONFIG_SLS=y
  177. # CONFIG_GDS_FORCE_MITIGATION is not set
  178. +CONFIG_MITIGATION_RFDS=y
  179. +CONFIG_MITIGATION_SPECTRE_BHI=y
  180. +CONFIG_MITIGATION_ITS=y
  181. +CONFIG_MITIGATION_TSA=y
  182. +CONFIG_MITIGATION_VMSCAPE=y
  183. CONFIG_ARCH_HAS_ADD_PAGES=y
  184. CONFIG_ARCH_MHP_MEMMAP_ON_MEMORY_ENABLE=y
  185.  
  186. @@ -740,6 +745,7 @@
  187. CONFIG_AS_SHA1_NI=y
  188. CONFIG_AS_SHA256_NI=y
  189. CONFIG_AS_TPAUSE=y
  190. +CONFIG_ARCH_CONFIGURES_CPU_MITIGATIONS=y
  191.  
  192. #
  193. # General architecture-dependent options
  194. @@ -1030,12 +1036,12 @@
  195. # CONFIG_ZSWAP_COMPRESSOR_DEFAULT_LZ4HC is not set
  196. # CONFIG_ZSWAP_COMPRESSOR_DEFAULT_ZSTD is not set
  197. CONFIG_ZSWAP_COMPRESSOR_DEFAULT="lz4"
  198. -# CONFIG_ZSWAP_ZPOOL_DEFAULT_ZBUD is not set
  199. -CONFIG_ZSWAP_ZPOOL_DEFAULT_Z3FOLD=y
  200. +CONFIG_ZSWAP_ZPOOL_DEFAULT_ZBUD=y
  201. +# CONFIG_ZSWAP_ZPOOL_DEFAULT_Z3FOLD_DEPRECATED is not set
  202. # CONFIG_ZSWAP_ZPOOL_DEFAULT_ZSMALLOC is not set
  203. -CONFIG_ZSWAP_ZPOOL_DEFAULT="z3fold"
  204. +CONFIG_ZSWAP_ZPOOL_DEFAULT="zbud"
  205. CONFIG_ZBUD=y
  206. -CONFIG_Z3FOLD=y
  207. +# CONFIG_Z3FOLD_DEPRECATED is not set
  208. CONFIG_ZSMALLOC=y
  209. # CONFIG_ZSMALLOC_STAT is not set
  210.  
  211. @@ -1080,6 +1086,7 @@
  212. CONFIG_ARCH_ENABLE_HUGEPAGE_MIGRATION=y
  213. CONFIG_ARCH_ENABLE_THP_MIGRATION=y
  214. CONFIG_CONTIG_ALLOC=y
  215. +CONFIG_PCP_BATCH_SCALE_MAX=5
  216. CONFIG_PHYS_ADDR_T_64BIT=y
  217. CONFIG_MMU_NOTIFIER=y
  218. CONFIG_KSM=y
  219. @@ -1164,7 +1171,6 @@
  220. CONFIG_PACKET=y
  221. CONFIG_PACKET_DIAG=m
  222. CONFIG_UNIX=y
  223. -CONFIG_UNIX_SCM=y
  224. CONFIG_AF_UNIX_OOB=y
  225. CONFIG_UNIX_DIAG=m
  226. CONFIG_TLS=m
  227. @@ -1739,10 +1745,8 @@
  228. #
  229. # Queueing/Scheduling
  230. #
  231. -CONFIG_NET_SCH_CBQ=m
  232. CONFIG_NET_SCH_HTB=m
  233. CONFIG_NET_SCH_HFSC=m
  234. -CONFIG_NET_SCH_ATM=m
  235. CONFIG_NET_SCH_PRIO=m
  236. CONFIG_NET_SCH_MULTIQ=m
  237. CONFIG_NET_SCH_RED=m
  238. @@ -1754,7 +1758,6 @@
  239. CONFIG_NET_SCH_ETF=m
  240. CONFIG_NET_SCH_TAPRIO=m
  241. CONFIG_NET_SCH_GRED=m
  242. -CONFIG_NET_SCH_DSMARK=m
  243. CONFIG_NET_SCH_NETEM=m
  244. CONFIG_NET_SCH_DRR=m
  245. CONFIG_NET_SCH_MQPRIO=m
  246. @@ -2099,8 +2102,6 @@
  247. #
  248. # Device Drivers
  249. #
  250. -CONFIG_HAVE_EISA=y
  251. -# CONFIG_EISA is not set
  252. CONFIG_HAVE_PCI=y
  253. CONFIG_PCI=y
  254. CONFIG_PCI_DOMAINS=y
  255. @@ -3235,9 +3236,6 @@
  256. CONFIG_ICE_HWTS=y
  257. CONFIG_FM10K=m
  258. CONFIG_IGC=m
  259. -CONFIG_NET_VENDOR_WANGXUN=y
  260. -CONFIG_NGBE=m
  261. -CONFIG_TXGBE=m
  262. CONFIG_JME=m
  263. CONFIG_NET_VENDOR_ADI=y
  264. CONFIG_ADIN1110=m
  265. @@ -3416,6 +3414,9 @@
  266. CONFIG_VIA_RHINE=m
  267. CONFIG_VIA_RHINE_MMIO=y
  268. CONFIG_VIA_VELOCITY=m
  269. +CONFIG_NET_VENDOR_WANGXUN=y
  270. +CONFIG_NGBE=m
  271. +CONFIG_TXGBE=m
  272. CONFIG_NET_VENDOR_WIZNET=y
  273. CONFIG_WIZNET_W5100=m
  274. CONFIG_WIZNET_W5300=m
  275. @@ -4228,7 +4229,6 @@
  276. CONFIG_TOUCHSCREEN_EDT_FT5X06=m
  277. CONFIG_TOUCHSCREEN_TOUCHRIGHT=m
  278. CONFIG_TOUCHSCREEN_TOUCHWIN=m
  279. -CONFIG_TOUCHSCREEN_TI_AM335X_TSC=m
  280. CONFIG_TOUCHSCREEN_UCB1400=m
  281. CONFIG_TOUCHSCREEN_PIXCIR=m
  282. CONFIG_TOUCHSCREEN_WDT87XX_I2C=m
  283. @@ -5520,7 +5520,6 @@
  284. CONFIG_MFD_SM501_GPIO=y
  285. CONFIG_MFD_SKY81452=m
  286. CONFIG_MFD_SYSCON=y
  287. -CONFIG_MFD_TI_AM335X_TSCADC=m
  288. CONFIG_MFD_LP3943=m
  289. CONFIG_MFD_LP8788=y
  290. CONFIG_MFD_TI_LMU=m
  291. @@ -6603,7 +6602,6 @@
  292. CONFIG_DRM_VGEM=m
  293. CONFIG_DRM_VKMS=m
  294. CONFIG_DRM_VMWGFX=m
  295. -CONFIG_DRM_VMWGFX_FBCON=y
  296. CONFIG_DRM_VMWGFX_MKSSTATS=y
  297. CONFIG_DRM_GMA500=m
  298. CONFIG_DRM_UDL=m
  299. @@ -8660,7 +8658,6 @@
  300. CONFIG_RTLLIB_CRYPTO_WEP=m
  301. CONFIG_RTL8192E=m
  302. CONFIG_RTL8723BS=m
  303. -CONFIG_R8712U=m
  304. CONFIG_R8188EU=m
  305. CONFIG_RTS5208=m
  306. CONFIG_VT6655=m
  307. @@ -9248,7 +9245,6 @@
  308. CONFIG_TI_ADS8688=m
  309. CONFIG_TI_ADS124S08=m
  310. CONFIG_TI_ADS131E08=m
  311. -CONFIG_TI_AM335X_ADC=m
  312. CONFIG_TI_TLC4541=m
  313. CONFIG_TI_TSC2046=m
  314. CONFIG_TWL4030_MADC=m
  315. @@ -10196,7 +10192,7 @@
  316. # CONFIG_NFS_DISABLE_UDP_SUPPORT is not set
  317. # CONFIG_NFS_V4_2_READ_PLUS is not set
  318. CONFIG_NFSD=m
  319. -CONFIG_NFSD_V2_ACL=y
  320. +# CONFIG_NFSD_V2 is not set
  321. CONFIG_NFSD_V3_ACL=y
  322. CONFIG_NFSD_V4=y
  323. CONFIG_NFSD_PNFS=y
  324. @@ -10323,6 +10319,9 @@
  325. CONFIG_KEY_DH_OPERATIONS=y
  326. CONFIG_KEY_NOTIFICATIONS=y
  327. CONFIG_SECURITY_DMESG_RESTRICT=y
  328. +CONFIG_PROC_MEM_ALWAYS_FORCE=y
  329. +# CONFIG_PROC_MEM_FORCE_PTRACE is not set
  330. +# CONFIG_PROC_MEM_NO_FORCE is not set
  331. CONFIG_SECURITY=y
  332. CONFIG_SECURITYFS=y
  333. CONFIG_SECURITY_NETWORK=y
  334. @@ -10907,6 +10906,7 @@
  335. # CONFIG_DEBUG_INFO_SPLIT is not set
  336. CONFIG_DEBUG_INFO_BTF=y
  337. CONFIG_PAHOLE_HAS_SPLIT_BTF=y
  338. +CONFIG_PAHOLE_HAS_LANG_EXCLUDE=y
  339. CONFIG_DEBUG_INFO_BTF_MODULES=y
  340. # CONFIG_MODULE_ALLOW_BTF_MISMATCH is not set
  341. # CONFIG_GDB_SCRIPTS is not set
  342. @@ -10983,6 +10983,7 @@
  343. CONFIG_HAVE_ARCH_KASAN=y
  344. CONFIG_HAVE_ARCH_KASAN_VMALLOC=y
  345. CONFIG_CC_HAS_KASAN_GENERIC=y
  346. +CONFIG_CC_HAS_KASAN_SW_TAGS=y
  347. CONFIG_CC_HAS_WORKING_NOSANITIZE_ADDRESS=y
  348. # CONFIG_KASAN is not set
  349. CONFIG_HAVE_ARCH_KFENCE=y
  350. Prepared linux-lts61 version 6.1.163-1-lts61
  351. ==> Starting build()...
  352. SPHINX htmldocs --> file:///home/user/.cache/yay/linux-lts61/src/linux-6.1/Documentation/output
  353. PARSE include/uapi/linux/dvb/ca.h
  354. PARSE include/uapi/linux/dvb/dmx.h
  355. PARSE include/uapi/linux/dvb/frontend.h
  356. PARSE include/uapi/linux/dvb/net.h
  357. PARSE include/uapi/linux/videodev2.h
  358. PARSE include/uapi/linux/media.h
  359. PARSE include/uapi/linux/cec.h
  360. PARSE include/uapi/linux/lirc.h
  361. SYSHDR arch/x86/include/generated/uapi/asm/unistd_32.h
  362. SYSHDR arch/x86/include/generated/uapi/asm/unistd_64.h
  363. SYSHDR arch/x86/include/generated/uapi/asm/unistd_x32.h
  364. SYSTBL arch/x86/include/generated/asm/syscalls_32.h
  365. SYSHDR arch/x86/include/generated/asm/unistd_32_ia32.h
  366. SYSHDR arch/x86/include/generated/asm/unistd_64_x32.h
  367. SYSTBL arch/x86/include/generated/asm/syscalls_64.h
  368. HYPERCALLS arch/x86/include/generated/asm/xen-hypercalls.h
  369. Using classic theme
  370. WRAP arch/x86/include/generated/uapi/asm/bpf_perf_event.h
  371. WRAP arch/x86/include/generated/uapi/asm/errno.h
  372. WRAP arch/x86/include/generated/uapi/asm/fcntl.h
  373. WRAP arch/x86/include/generated/uapi/asm/ioctl.h
  374. WRAP arch/x86/include/generated/uapi/asm/ioctls.h
  375. WRAP arch/x86/include/generated/uapi/asm/ipcbuf.h
  376. WRAP arch/x86/include/generated/uapi/asm/param.h
  377. WRAP arch/x86/include/generated/uapi/asm/poll.h
  378. WRAP arch/x86/include/generated/uapi/asm/socket.h
  379. WRAP arch/x86/include/generated/uapi/asm/resource.h
  380. WRAP arch/x86/include/generated/uapi/asm/sockios.h
  381. WRAP arch/x86/include/generated/uapi/asm/termios.h
  382. WRAP arch/x86/include/generated/uapi/asm/termbits.h
  383. WRAP arch/x86/include/generated/uapi/asm/types.h
  384. HOSTCC arch/x86/tools/relocs_32.o
  385. HOSTCC arch/x86/tools/relocs_64.o
  386. HOSTCC arch/x86/tools/relocs_common.o
  387. UPD include/config/kernel.release
  388. /home/user/.cache/yay/linux-lts61/src/linux-6.1/Documentation/sphinx/kerneldoc.py:133: SyntaxWarning: "\." is an invalid escape sequence. Such sequences will not work in the future. Did you mean "\\."? A raw string is also an option.
  389. line_regex = re.compile("^\.\. LINENO ([0-9]+)$")
  390. /home/user/.cache/yay/linux-lts61/src/linux-6.1/Documentation/sphinx/maintainers_include.py:81: SyntaxWarning: "\s" is an invalid escape sequence. Such sequences will not work in the future. Did you mean "\\s"? A raw string is also an option.
  391. pat = '(Documentation/([^\s\?\*]*)\.rst)'
  392. /home/user/.cache/yay/linux-lts61/src/linux-6.1/Documentation/sphinx/maintainers_include.py:94: SyntaxWarning: "\s" is an invalid escape sequence. Such sequences will not work in the future. Did you mean "\\s"? A raw string is also an option.
  393. m = re.search("\s(\S):\s", line)
  394. /home/user/.cache/yay/linux-lts61/src/linux-6.1/Documentation/sphinx/maintainers_include.py:98: SyntaxWarning: "\*" is an invalid escape sequence. Such sequences will not work in the future. Did you mean "\\*"? A raw string is also an option.
  395. m = re.search("\*([^\*]+)\*", line)
  396. /home/user/.cache/yay/linux-lts61/src/linux-6.1/Documentation/sphinx/maintainers_include.py:116: SyntaxWarning: "\s" is an invalid escape sequence. Such sequences will not work in the future. Did you mean "\\s"? A raw string is also an option.
  397. heading = re.sub("\s+", " ", line)
  398. /home/user/.cache/yay/linux-lts61/src/linux-6.1/Documentation/sphinx/kernel_abi.py:106: SyntaxWarning: "\." is an invalid escape sequence. Such sequences will not work in the future. Did you mean "\\."? A raw string is also an option.
  399. line_regex = re.compile("^\.\. LINENO (\S+)\#([0-9]+)$")
  400. /home/user/.cache/yay/linux-lts61/src/linux-6.1/Documentation/sphinx/kernel_feat.py:108: SyntaxWarning: "\." is an invalid escape sequence. Such sequences will not work in the future. Did you mean "\\."? A raw string is also an option.
  401. line_regex = re.compile("^\.\. FILE (\S+)$")
  402. WRAP arch/x86/include/generated/asm/early_ioremap.h
  403. WRAP arch/x86/include/generated/asm/export.h
  404. WRAP arch/x86/include/generated/asm/mcs_spinlock.h
  405. WRAP arch/x86/include/generated/asm/irq_regs.h
  406. WRAP arch/x86/include/generated/asm/kmap_size.h
  407. WRAP arch/x86/include/generated/asm/rwonce.h
  408. WRAP arch/x86/include/generated/asm/module.lds.h
  409. WRAP arch/x86/include/generated/asm/mmiowb.h
  410. WRAP arch/x86/include/generated/asm/local64.h
  411. WRAP arch/x86/include/generated/asm/unaligned.h
  412. UPD include/generated/uapi/linux/version.h
  413. HOSTLD arch/x86/tools/relocs
  414. UPD include/generated/utsrelease.h
  415. UPD include/generated/compile.h
  416. HOSTCC scripts/bin2c
  417. HOSTCC scripts/kallsyms
  418. HOSTCC scripts/sorttable
  419. HOSTCC scripts/asn1_compiler
  420. HOSTCC scripts/selinux/genheaders/genheaders
  421. HOSTCC scripts/selinux/mdp/mdp
  422. HOSTCC scripts/sign-file
  423. DESCEND objtool
  424. DESCEND bpf/resolve_btfids
  425. gcc -o /home/user/.cache/yay/linux-lts61/src/linux-6.1/tools/objtool/fixdep /home/user/.cache/yay/linux-lts61/src/linux-6.1/tools/objtool/fixdep-in.o
  426. /home/user/.cache/yay/linux-lts61/src/linux-6.1/scripts/bpf_doc.py --header \
  427. --file /home/user/.cache/yay/linux-lts61/src/linux-6.1/tools/include/uapi/linux/bpf.h > /home/user/.cache/yay/linux-lts61/src/linux-6.1/tools/bpf/resolve_btfids/libbpf/bpf_helper_defs.h
  428. gcc -o /home/user/.cache/yay/linux-lts61/src/linux-6.1/tools/bpf/resolve_btfids/fixdep /home/user/.cache/yay/linux-lts61/src/linux-6.1/tools/bpf/resolve_btfids/fixdep-in.o
  429. /home/user/.cache/yay/linux-lts61/src/linux-6.1/scripts/bpf_doc.py:62: SyntaxWarning: "\w" is an invalid escape sequence. Such sequences will not work in the future. Did you mean "\\w"? A raw string is also an option.
  430. arg_re = re.compile('((\w+ )*?(\w+|...))( (\**)(\w+))?$')
  431. /home/user/.cache/yay/linux-lts61/src/linux-6.1/scripts/bpf_doc.py:64: SyntaxWarning: "\*" is an invalid escape sequence. Such sequences will not work in the future. Did you mean "\\*"? A raw string is also an option.
  432. proto_re = re.compile('(.+) (\**)(\w+)\(((([^,]+)(, )?){1,5})\)$')
  433. /home/user/.cache/yay/linux-lts61/src/linux-6.1/scripts/bpf_doc.py:116: SyntaxWarning: "\*" is an invalid escape sequence. Such sequences will not work in the future. Did you mean "\\*"? A raw string is also an option.
  434. p = re.compile(' \* ?(BPF\w+)$')
  435. /home/user/.cache/yay/linux-lts61/src/linux-6.1/scripts/bpf_doc.py:120: SyntaxWarning: "\*" is an invalid escape sequence. Such sequences will not work in the future. Did you mean "\\*"? A raw string is also an option.
  436. end_re = re.compile(' \* ?NOTES$')
  437. /home/user/.cache/yay/linux-lts61/src/linux-6.1/scripts/bpf_doc.py:135: SyntaxWarning: "\*" is an invalid escape sequence. Such sequences will not work in the future. Did you mean "\\*"? A raw string is also an option.
  438. p = re.compile(' \* ?((.+) \**\w+\((((const )?(struct )?(\w+|\.\.\.)( \**\w+)?)(, )?){1,5}\))$')
  439. /home/user/.cache/yay/linux-lts61/src/linux-6.1/scripts/bpf_doc.py:143: SyntaxWarning: "\*" is an invalid escape sequence. Such sequences will not work in the future. Did you mean "\\*"? A raw string is also an option.
  440. p = re.compile(' \* ?(?:\t| {5,8})Description$')
  441. /home/user/.cache/yay/linux-lts61/src/linux-6.1/scripts/bpf_doc.py:156: SyntaxWarning: "\*" is an invalid escape sequence. Such sequences will not work in the future. Did you mean "\\*"? A raw string is also an option.
  442. p = re.compile(' \* ?(?:\t| {5,8})(?:\t| {8})(.*)')
  443. /home/user/.cache/yay/linux-lts61/src/linux-6.1/scripts/bpf_doc.py:169: SyntaxWarning: "\*" is an invalid escape sequence. Such sequences will not work in the future. Did you mean "\\*"? A raw string is also an option.
  444. p = re.compile(' \* ?(?:\t| {5,8})Return$')
  445. /home/user/.cache/yay/linux-lts61/src/linux-6.1/scripts/bpf_doc.py:182: SyntaxWarning: "\*" is an invalid escape sequence. Such sequences will not work in the future. Did you mean "\\*"? A raw string is also an option.
  446. p = re.compile(' \* ?(?:\t| {5,8})(?:\t| {8})(.*)')
  447. /home/user/.cache/yay/linux-lts61/src/linux-6.1/scripts/bpf_doc.py:221: SyntaxWarning: "\s" is an invalid escape sequence. Such sequences will not work in the future. Did you mean "\\s"? A raw string is also an option.
  448. bpf_p = re.compile('\s*(BPF\w+)+')
  449. /home/user/.cache/yay/linux-lts61/src/linux-6.1/scripts/bpf_doc.py:226: SyntaxWarning: "\s" is an invalid escape sequence. Such sequences will not work in the future. Did you mean "\\s"? A raw string is also an option.
  450. assign_p = re.compile('\s*(BPF\w+)\s*=\s*(BPF\w+)')
  451. /home/user/.cache/yay/linux-lts61/src/linux-6.1/scripts/bpf_doc.py:241: SyntaxWarning: "\w" is an invalid escape sequence. Such sequences will not work in the future. Did you mean "\\w"? A raw string is also an option.
  452. self.enum_syscalls = re.findall('(BPF\w+)+', bpf_cmd_str)
  453. /home/user/.cache/yay/linux-lts61/src/linux-6.1/scripts/bpf_doc.py:264: SyntaxWarning: "\s" is an invalid escape sequence. Such sequences will not work in the future. Did you mean "\\s"? A raw string is also an option.
  454. p = re.compile('\s*FN\((\w+)\)|\\\\')
  455. /home/user/.cache/yay/linux-lts61/src/linux-6.1/scripts/bpf_doc.py:277: SyntaxWarning: "\(" is an invalid escape sequence. Such sequences will not work in the future. Did you mean "\\("? A raw string is also an option.
  456. self.define_unique_helpers = re.findall('FN\(\w+\)', fn_defines_str)
  457. /home/user/.cache/yay/linux-lts61/src/linux-6.1/scripts/bpf_doc.py:410: SyntaxWarning: "\*" is an invalid escape sequence. Such sequences will not work in the future. Did you mean "\\*"? A raw string is also an option.
  458. '/{}/,/\*\//:include/uapi/linux/bpf.h'.format(delimiter)]
  459. /home/user/.cache/yay/linux-lts61/src/linux-6.1/scripts/bpf_doc.py:501: SyntaxWarning: "\ " is an invalid escape sequence. Such sequences will not work in the future. Did you mean "\\ "? A raw string is also an option.
  460. license string passed (via **attr**) to the **bpf**\ () system call, and this
  461. /home/user/.cache/yay/linux-lts61/src/linux-6.1/scripts/bpf_doc.py:583: SyntaxWarning: "\ " is an invalid escape sequence. Such sequences will not work in the future. Did you mean "\\ "? A raw string is also an option.
  462. one_arg += ' {}**\ '.format(a['star'].replace('*', '\\*'))
  463. \
  464. if [ ! -d ''/home/user/.cache/yay/linux-lts61/src/linux-6.1/tools/bpf/resolve_btfids/libbpf/'/include/bpf' ]; then install -d -m 755 ''/home/user/.cache/yay/linux-lts61/src/linux-6.1/tools/bpf/resolve_btfids/libbpf/'/include/bpf'; fi; install -m 644 bpf.h ''/home/user/.cache/yay/linux-lts61/src/linux-6.1/tools/bpf/resolve_btfids/libbpf/'/include/bpf'
  465. \
  466. if [ ! -d ''/home/user/.cache/yay/linux-lts61/src/linux-6.1/tools/bpf/resolve_btfids/libbpf/'/include/bpf' ]; then install -d -m 755 ''/home/user/.cache/yay/linux-lts61/src/linux-6.1/tools/bpf/resolve_btfids/libbpf/'/include/bpf'; fi; install -m 644 libbpf.h ''/home/user/.cache/yay/linux-lts61/src/linux-6.1/tools/bpf/resolve_btfids/libbpf/'/include/bpf'
  467. \
  468. if [ ! -d ''/home/user/.cache/yay/linux-lts61/src/linux-6.1/tools/bpf/resolve_btfids/libbpf/'/include/bpf' ]; then install -d -m 755 ''/home/user/.cache/yay/linux-lts61/src/linux-6.1/tools/bpf/resolve_btfids/libbpf/'/include/bpf'; fi; install -m 644 btf.h ''/home/user/.cache/yay/linux-lts61/src/linux-6.1/tools/bpf/resolve_btfids/libbpf/'/include/bpf'
  469. \
  470. if [ ! -d ''/home/user/.cache/yay/linux-lts61/src/linux-6.1/tools/bpf/resolve_btfids/libbpf/'/include/bpf' ]; then install -d -m 755 ''/home/user/.cache/yay/linux-lts61/src/linux-6.1/tools/bpf/resolve_btfids/libbpf/'/include/bpf'; fi; install -m 644 libbpf_common.h ''/home/user/.cache/yay/linux-lts61/src/linux-6.1/tools/bpf/resolve_btfids/libbpf/'/include/bpf'
  471. \
  472. if [ ! -d ''/home/user/.cache/yay/linux-lts61/src/linux-6.1/tools/bpf/resolve_btfids/libbpf/'/include/bpf' ]; then install -d -m 755 ''/home/user/.cache/yay/linux-lts61/src/linux-6.1/tools/bpf/resolve_btfids/libbpf/'/include/bpf'; fi; install -m 644 libbpf_legacy.h ''/home/user/.cache/yay/linux-lts61/src/linux-6.1/tools/bpf/resolve_btfids/libbpf/'/include/bpf'
  473. \
  474. if [ ! -d ''/home/user/.cache/yay/linux-lts61/src/linux-6.1/tools/bpf/resolve_btfids/libbpf/'/include/bpf' ]; then install -d -m 755 ''/home/user/.cache/yay/linux-lts61/src/linux-6.1/tools/bpf/resolve_btfids/libbpf/'/include/bpf'; fi; install -m 644 bpf_helpers.h ''/home/user/.cache/yay/linux-lts61/src/linux-6.1/tools/bpf/resolve_btfids/libbpf/'/include/bpf'
  475. \
  476. if [ ! -d ''/home/user/.cache/yay/linux-lts61/src/linux-6.1/tools/bpf/resolve_btfids/libbpf/'/include/bpf' ]; then install -d -m 755 ''/home/user/.cache/yay/linux-lts61/src/linux-6.1/tools/bpf/resolve_btfids/libbpf/'/include/bpf'; fi; install -m 644 bpf_tracing.h ''/home/user/.cache/yay/linux-lts61/src/linux-6.1/tools/bpf/resolve_btfids/libbpf/'/include/bpf'
  477. \
  478. if [ ! -d ''/home/user/.cache/yay/linux-lts61/src/linux-6.1/tools/bpf/resolve_btfids/libbpf/'/include/bpf' ]; then install -d -m 755 ''/home/user/.cache/yay/linux-lts61/src/linux-6.1/tools/bpf/resolve_btfids/libbpf/'/include/bpf'; fi; install -m 644 bpf_endian.h ''/home/user/.cache/yay/linux-lts61/src/linux-6.1/tools/bpf/resolve_btfids/libbpf/'/include/bpf'
  479. \
  480. if [ ! -d ''/home/user/.cache/yay/linux-lts61/src/linux-6.1/tools/bpf/resolve_btfids/libbpf/'/include/bpf' ]; then install -d -m 755 ''/home/user/.cache/yay/linux-lts61/src/linux-6.1/tools/bpf/resolve_btfids/libbpf/'/include/bpf'; fi; install -m 644 bpf_core_read.h ''/home/user/.cache/yay/linux-lts61/src/linux-6.1/tools/bpf/resolve_btfids/libbpf/'/include/bpf'
  481. \
  482. if [ ! -d ''/home/user/.cache/yay/linux-lts61/src/linux-6.1/tools/bpf/resolve_btfids/libbpf/'/include/bpf' ]; then install -d -m 755 ''/home/user/.cache/yay/linux-lts61/src/linux-6.1/tools/bpf/resolve_btfids/libbpf/'/include/bpf'; fi; install -m 644 skel_internal.h ''/home/user/.cache/yay/linux-lts61/src/linux-6.1/tools/bpf/resolve_btfids/libbpf/'/include/bpf'
  483. \
  484. if [ ! -d ''/home/user/.cache/yay/linux-lts61/src/linux-6.1/tools/bpf/resolve_btfids/libbpf/'/include/bpf' ]; then install -d -m 755 ''/home/user/.cache/yay/linux-lts61/src/linux-6.1/tools/bpf/resolve_btfids/libbpf/'/include/bpf'; fi; install -m 644 libbpf_version.h ''/home/user/.cache/yay/linux-lts61/src/linux-6.1/tools/bpf/resolve_btfids/libbpf/'/include/bpf'
  485. \
  486. if [ ! -d ''/home/user/.cache/yay/linux-lts61/src/linux-6.1/tools/bpf/resolve_btfids/libbpf/'/include/bpf' ]; then install -d -m 755 ''/home/user/.cache/yay/linux-lts61/src/linux-6.1/tools/bpf/resolve_btfids/libbpf/'/include/bpf'; fi; install -m 644 usdt.bpf.h ''/home/user/.cache/yay/linux-lts61/src/linux-6.1/tools/bpf/resolve_btfids/libbpf/'/include/bpf'
  487. \
  488. if [ ! -d ''/home/user/.cache/yay/linux-lts61/src/linux-6.1/tools/bpf/resolve_btfids/libbpf/'/include/bpf' ]; then install -d -m 755 ''/home/user/.cache/yay/linux-lts61/src/linux-6.1/tools/bpf/resolve_btfids/libbpf/'/include/bpf'; fi; install -m 644 /home/user/.cache/yay/linux-lts61/src/linux-6.1/tools/bpf/resolve_btfids/libbpf/bpf_helper_defs.h ''/home/user/.cache/yay/linux-lts61/src/linux-6.1/tools/bpf/resolve_btfids/libbpf/'/include/bpf'
  489. libbpf.c: In function ‘resolve_full_path’:
  490. libbpf.c:10756:35: error: assignment discards ‘const’ qualifier from pointer target type [-Werror=discarded-qualifiers]
  491. 10756 | next_path = strchr(s, ':');
  492. | ^
  493. CC scripts/mod/empty.o
  494. HOSTCC scripts/mod/mk_elfconfig
  495. CC scripts/mod/devicetable-offsets.s
  496. MKELF scripts/mod/elfconfig.h
  497. UPD scripts/mod/devicetable-offsets.h
  498. HOSTCC scripts/mod/sumversion.o
  499. HOSTCC scripts/mod/modpost.o
  500. \
  501. if [ ! -d '/home/user/.cache/yay/linux-lts61/src/linux-6.1/tools/bpf/resolve_btfids/libsubcmd//include/subcmd/' ]; then install -d -m 755 '/home/user/.cache/yay/linux-lts61/src/linux-6.1/tools/bpf/resolve_btfids/libsubcmd//include/subcmd/'; fi; install exec-cmd.h -m 644 '/home/user/.cache/yay/linux-lts61/src/linux-6.1/tools/bpf/resolve_btfids/libsubcmd//include/subcmd/'
  502. rm -f /home/user/.cache/yay/linux-lts61/src/linux-6.1/tools/objtool/libsubcmd.a && ar rcs /home/user/.cache/yay/linux-lts61/src/linux-6.1/tools/objtool/libsubcmd.a /home/user/.cache/yay/linux-lts61/src/linux-6.1/tools/objtool/libsubcmd-in.o
  503. \
  504. if [ ! -d '/home/user/.cache/yay/linux-lts61/src/linux-6.1/tools/bpf/resolve_btfids/libsubcmd//include/subcmd/' ]; then install -d -m 755 '/home/user/.cache/yay/linux-lts61/src/linux-6.1/tools/bpf/resolve_btfids/libsubcmd//include/subcmd/'; fi; install help.h -m 644 '/home/user/.cache/yay/linux-lts61/src/linux-6.1/tools/bpf/resolve_btfids/libsubcmd//include/subcmd/'
  505. \
  506. if [ ! -d '/home/user/.cache/yay/linux-lts61/src/linux-6.1/tools/bpf/resolve_btfids/libsubcmd//include/subcmd/' ]; then install -d -m 755 '/home/user/.cache/yay/linux-lts61/src/linux-6.1/tools/bpf/resolve_btfids/libsubcmd//include/subcmd/'; fi; install pager.h -m 644 '/home/user/.cache/yay/linux-lts61/src/linux-6.1/tools/bpf/resolve_btfids/libsubcmd//include/subcmd/'
  507. HOSTCC scripts/mod/file2alias.o
  508. \
  509. if [ ! -d '/home/user/.cache/yay/linux-lts61/src/linux-6.1/tools/bpf/resolve_btfids/libsubcmd//include/subcmd/' ]; then install -d -m 755 '/home/user/.cache/yay/linux-lts61/src/linux-6.1/tools/bpf/resolve_btfids/libsubcmd//include/subcmd/'; fi; install parse-options.h -m 644 '/home/user/.cache/yay/linux-lts61/src/linux-6.1/tools/bpf/resolve_btfids/libsubcmd//include/subcmd/'
  510. \
  511. if [ ! -d '/home/user/.cache/yay/linux-lts61/src/linux-6.1/tools/bpf/resolve_btfids/libsubcmd//include/subcmd/' ]; then install -d -m 755 '/home/user/.cache/yay/linux-lts61/src/linux-6.1/tools/bpf/resolve_btfids/libsubcmd//include/subcmd/'; fi; install run-command.h -m 644 '/home/user/.cache/yay/linux-lts61/src/linux-6.1/tools/bpf/resolve_btfids/libsubcmd//include/subcmd/'
  512. rm -f /home/user/.cache/yay/linux-lts61/src/linux-6.1/tools/bpf/resolve_btfids/libsubcmd/libsubcmd.a && ar rcs /home/user/.cache/yay/linux-lts61/src/linux-6.1/tools/bpf/resolve_btfids/libsubcmd/libsubcmd.a /home/user/.cache/yay/linux-lts61/src/linux-6.1/tools/bpf/resolve_btfids/libsubcmd/libsubcmd-in.o
  513. HOSTLD scripts/mod/modpost
  514. UPD include/generated/timeconst.h
  515. CC kernel/bounds.s
  516. CHKSHA1 include/linux/atomic/atomic-arch-fallback.h
  517. CHKSHA1 include/linux/atomic/atomic-instrumented.h
  518. CHKSHA1 include/linux/atomic/atomic-long.h
  519. UPD include/generated/bounds.h
  520. CC arch/x86/kernel/asm-offsets.s
  521. UPD include/generated/asm-offsets.h
  522. CALL scripts/checksyscalls.sh
  523. gcc /home/user/.cache/yay/linux-lts61/src/linux-6.1/tools/objtool/objtool-in.o -lelf /home/user/.cache/yay/linux-lts61/src/linux-6.1/tools/objtool/libsubcmd.a -o /home/user/.cache/yay/linux-lts61/src/linux-6.1/tools/objtool/objtool
  524. cc1: all warnings being treated as errors
  525. make[4]: *** [/home/user/.cache/yay/linux-lts61/src/linux-6.1/tools/build/Makefile.build:96: /home/user/.cache/yay/linux-lts61/src/linux-6.1/tools/bpf/resolve_btfids/libbpf/staticobjs/libbpf.o] Error 1
  526. make[3]: *** [Makefile:157: /home/user/.cache/yay/linux-lts61/src/linux-6.1/tools/bpf/resolve_btfids/libbpf/staticobjs/libbpf-in.o] Error 2
  527. make[2]: *** [Makefile:63: /home/user/.cache/yay/linux-lts61/src/linux-6.1/tools/bpf/resolve_btfids//libbpf/libbpf.a] Error 2
  528. make[1]: *** [Makefile:76: bpf/resolve_btfids] Error 2
  529. make: *** [Makefile:1456: tools/bpf/resolve_btfids] Error 2
  530. ==> ERROR: A failure occurred in build().
  531. Aborting...
Advertisement
Add Comment
Please, Sign In to add comment