Guest User

Untitled

a guest
Feb 23rd, 2021
34
0
Never
Not a member of Pastebin yet? Sign Up, it unlocks many cool features!
text 73.10 KB | None | 0 0
  1. irynah@irynah-Vostro-3560:/media/irynah/DATA/0NEW-108G/0PROJECTS/OpenMRS-projects/openmrs-contrib-uitestframework$ mvn clean install -X
  2. Apache Maven 3.6.0
  3. Maven home: /usr/share/maven
  4. Java version: 1.8.0_282, vendor: Private Build, runtime: /usr/lib/jvm/java-8-openjdk-amd64/jre
  5. Default locale: en_GB, platform encoding: UTF-8
  6. OS name: "linux", version: "5.4.0-65-generic", arch: "amd64", family: "unix"
  7. [DEBUG] Created new class realm maven.api
  8. [DEBUG] Importing foreign packages into class realm maven.api
  9. [DEBUG] Imported: javax.annotation.* < plexus.core
  10. [DEBUG] Imported: javax.annotation.security.* < plexus.core
  11. [DEBUG] Imported: javax.enterprise.inject.* < plexus.core
  12. [DEBUG] Imported: javax.enterprise.util.* < plexus.core
  13. [DEBUG] Imported: javax.inject.* < plexus.core
  14. [DEBUG] Imported: org.apache.maven.* < plexus.core
  15. [DEBUG] Imported: org.apache.maven.artifact < plexus.core
  16. [DEBUG] Imported: org.apache.maven.classrealm < plexus.core
  17. [DEBUG] Imported: org.apache.maven.cli < plexus.core
  18. [DEBUG] Imported: org.apache.maven.configuration < plexus.core
  19. [DEBUG] Imported: org.apache.maven.exception < plexus.core
  20. [DEBUG] Imported: org.apache.maven.execution < plexus.core
  21. [DEBUG] Imported: org.apache.maven.execution.scope < plexus.core
  22. [DEBUG] Imported: org.apache.maven.lifecycle < plexus.core
  23. [DEBUG] Imported: org.apache.maven.model < plexus.core
  24. [DEBUG] Imported: org.apache.maven.monitor < plexus.core
  25. [DEBUG] Imported: org.apache.maven.plugin < plexus.core
  26. [DEBUG] Imported: org.apache.maven.profiles < plexus.core
  27. [DEBUG] Imported: org.apache.maven.project < plexus.core
  28. [DEBUG] Imported: org.apache.maven.reporting < plexus.core
  29. [DEBUG] Imported: org.apache.maven.repository < plexus.core
  30. [DEBUG] Imported: org.apache.maven.rtinfo < plexus.core
  31. [DEBUG] Imported: org.apache.maven.settings < plexus.core
  32. [DEBUG] Imported: org.apache.maven.toolchain < plexus.core
  33. [DEBUG] Imported: org.apache.maven.usability < plexus.core
  34. [DEBUG] Imported: org.apache.maven.wagon.* < plexus.core
  35. [DEBUG] Imported: org.apache.maven.wagon.authentication < plexus.core
  36. [DEBUG] Imported: org.apache.maven.wagon.authorization < plexus.core
  37. [DEBUG] Imported: org.apache.maven.wagon.events < plexus.core
  38. [DEBUG] Imported: org.apache.maven.wagon.observers < plexus.core
  39. [DEBUG] Imported: org.apache.maven.wagon.proxy < plexus.core
  40. [DEBUG] Imported: org.apache.maven.wagon.repository < plexus.core
  41. [DEBUG] Imported: org.apache.maven.wagon.resource < plexus.core
  42. [DEBUG] Imported: org.codehaus.classworlds < plexus.core
  43. [DEBUG] Imported: org.codehaus.plexus.* < plexus.core
  44. [DEBUG] Imported: org.codehaus.plexus.classworlds < plexus.core
  45. [DEBUG] Imported: org.codehaus.plexus.component < plexus.core
  46. [DEBUG] Imported: org.codehaus.plexus.configuration < plexus.core
  47. [DEBUG] Imported: org.codehaus.plexus.container < plexus.core
  48. [DEBUG] Imported: org.codehaus.plexus.context < plexus.core
  49. [DEBUG] Imported: org.codehaus.plexus.lifecycle < plexus.core
  50. [DEBUG] Imported: org.codehaus.plexus.logging < plexus.core
  51. [DEBUG] Imported: org.codehaus.plexus.personality < plexus.core
  52. [DEBUG] Imported: org.codehaus.plexus.util.xml.Xpp3Dom < plexus.core
  53. [DEBUG] Imported: org.codehaus.plexus.util.xml.pull.XmlPullParser < plexus.core
  54. [DEBUG] Imported: org.codehaus.plexus.util.xml.pull.XmlPullParserException < plexus.core
  55. [DEBUG] Imported: org.codehaus.plexus.util.xml.pull.XmlSerializer < plexus.core
  56. [DEBUG] Imported: org.eclipse.aether.* < plexus.core
  57. [DEBUG] Imported: org.eclipse.aether.artifact < plexus.core
  58. [DEBUG] Imported: org.eclipse.aether.collection < plexus.core
  59. [DEBUG] Imported: org.eclipse.aether.deployment < plexus.core
  60. [DEBUG] Imported: org.eclipse.aether.graph < plexus.core
  61. [DEBUG] Imported: org.eclipse.aether.impl < plexus.core
  62. [DEBUG] Imported: org.eclipse.aether.installation < plexus.core
  63. [DEBUG] Imported: org.eclipse.aether.internal.impl < plexus.core
  64. [DEBUG] Imported: org.eclipse.aether.metadata < plexus.core
  65. [DEBUG] Imported: org.eclipse.aether.repository < plexus.core
  66. [DEBUG] Imported: org.eclipse.aether.resolution < plexus.core
  67. [DEBUG] Imported: org.eclipse.aether.spi < plexus.core
  68. [DEBUG] Imported: org.eclipse.aether.transfer < plexus.core
  69. [DEBUG] Imported: org.eclipse.aether.version < plexus.core
  70. [DEBUG] Imported: org.fusesource.jansi.* < plexus.core
  71. [DEBUG] Imported: org.slf4j.* < plexus.core
  72. [DEBUG] Imported: org.slf4j.helpers.* < plexus.core
  73. [DEBUG] Imported: org.slf4j.spi.* < plexus.core
  74. [DEBUG] Populating class realm maven.api
  75. [INFO] Error stacktraces are turned on.
  76. [DEBUG] Message scheme: color
  77. [DEBUG] Message styles: debug info warning error success failure strong mojo project
  78. [DEBUG] Reading global settings from /usr/share/maven/conf/settings.xml
  79. [DEBUG] Reading user settings from /home/irynah/.m2/settings.xml
  80. [DEBUG] Reading global toolchains from /usr/share/maven/conf/toolchains.xml
  81. [DEBUG] Reading user toolchains from /home/irynah/.m2/toolchains.xml
  82. [DEBUG] Using local repository at /home/irynah/.m2/repository
  83. [DEBUG] Using manager EnhancedLocalRepositoryManager with priority 10.0 for /home/irynah/.m2/repository
  84. [DEBUG] Failed to decrypt password for server bintray-sdk: org.sonatype.plexus.components.sec.dispatcher.SecDispatcherException: java.io.FileNotFoundException: /home/irynah/.m2/settings-security.xml (No such file or directory)
  85. org.sonatype.plexus.components.sec.dispatcher.SecDispatcherException: org.sonatype.plexus.components.sec.dispatcher.SecDispatcherException: java.io.FileNotFoundException: /home/irynah/.m2/settings-security.xml (No such file or directory)
  86. at org.sonatype.plexus.components.sec.dispatcher.DefaultSecDispatcher.decrypt (DefaultSecDispatcher.java:121)
  87. at org.apache.maven.settings.crypto.DefaultSettingsDecrypter.decrypt (DefaultSettingsDecrypter.java:107)
  88. at org.apache.maven.settings.crypto.DefaultSettingsDecrypter.decrypt (DefaultSettingsDecrypter.java:63)
  89. at org.apache.maven.internal.aether.DefaultRepositorySystemSessionFactory.newRepositorySession (DefaultRepositorySystemSessionFactory.java:167)
  90. at org.apache.maven.DefaultMaven.newRepositorySession (DefaultMaven.java:350)
  91. at org.apache.maven.DefaultMaven.doExecute (DefaultMaven.java:185)
  92. at org.apache.maven.DefaultMaven.execute (DefaultMaven.java:105)
  93. at org.apache.maven.cli.MavenCli.execute (MavenCli.java:956)
  94. at org.apache.maven.cli.MavenCli.doMain (MavenCli.java:288)
  95. at org.apache.maven.cli.MavenCli.main (MavenCli.java:192)
  96. at sun.reflect.NativeMethodAccessorImpl.invoke0 (Native Method)
  97. at sun.reflect.NativeMethodAccessorImpl.invoke (NativeMethodAccessorImpl.java:62)
  98. at sun.reflect.DelegatingMethodAccessorImpl.invoke (DelegatingMethodAccessorImpl.java:43)
  99. at java.lang.reflect.Method.invoke (Method.java:498)
  100. at org.codehaus.plexus.classworlds.launcher.Launcher.launchEnhanced (Launcher.java:289)
  101. at org.codehaus.plexus.classworlds.launcher.Launcher.launch (Launcher.java:229)
  102. at org.codehaus.plexus.classworlds.launcher.Launcher.mainWithExitCode (Launcher.java:415)
  103. at org.codehaus.plexus.classworlds.launcher.Launcher.main (Launcher.java:356)
  104. Caused by: org.sonatype.plexus.components.sec.dispatcher.SecDispatcherException: java.io.FileNotFoundException: /home/irynah/.m2/settings-security.xml (No such file or directory)
  105. at org.sonatype.plexus.components.sec.dispatcher.SecUtil.read (SecUtil.java:69)
  106. at org.sonatype.plexus.components.sec.dispatcher.DefaultSecDispatcher.getSec (DefaultSecDispatcher.java:206)
  107. at org.sonatype.plexus.components.sec.dispatcher.DefaultSecDispatcher.decrypt (DefaultSecDispatcher.java:90)
  108. at org.apache.maven.settings.crypto.DefaultSettingsDecrypter.decrypt (DefaultSettingsDecrypter.java:107)
  109. at org.apache.maven.settings.crypto.DefaultSettingsDecrypter.decrypt (DefaultSettingsDecrypter.java:63)
  110. at org.apache.maven.internal.aether.DefaultRepositorySystemSessionFactory.newRepositorySession (DefaultRepositorySystemSessionFactory.java:167)
  111. at org.apache.maven.DefaultMaven.newRepositorySession (DefaultMaven.java:350)
  112. at org.apache.maven.DefaultMaven.doExecute (DefaultMaven.java:185)
  113. at org.apache.maven.DefaultMaven.execute (DefaultMaven.java:105)
  114. at org.apache.maven.cli.MavenCli.execute (MavenCli.java:956)
  115. at org.apache.maven.cli.MavenCli.doMain (MavenCli.java:288)
  116. at org.apache.maven.cli.MavenCli.main (MavenCli.java:192)
  117. at sun.reflect.NativeMethodAccessorImpl.invoke0 (Native Method)
  118. at sun.reflect.NativeMethodAccessorImpl.invoke (NativeMethodAccessorImpl.java:62)
  119. at sun.reflect.DelegatingMethodAccessorImpl.invoke (DelegatingMethodAccessorImpl.java:43)
  120. at java.lang.reflect.Method.invoke (Method.java:498)
  121. at org.codehaus.plexus.classworlds.launcher.Launcher.launchEnhanced (Launcher.java:289)
  122. at org.codehaus.plexus.classworlds.launcher.Launcher.launch (Launcher.java:229)
  123. at org.codehaus.plexus.classworlds.launcher.Launcher.mainWithExitCode (Launcher.java:415)
  124. at org.codehaus.plexus.classworlds.launcher.Launcher.main (Launcher.java:356)
  125. Caused by: java.io.FileNotFoundException: /home/irynah/.m2/settings-security.xml (No such file or directory)
  126. at java.io.FileInputStream.open0 (Native Method)
  127. at java.io.FileInputStream.open (FileInputStream.java:195)
  128. at java.io.FileInputStream.<init> (FileInputStream.java:138)
  129. at org.sonatype.plexus.components.sec.dispatcher.SecUtil.toStream (SecUtil.java:100)
  130. at org.sonatype.plexus.components.sec.dispatcher.SecUtil.read (SecUtil.java:56)
  131. at org.sonatype.plexus.components.sec.dispatcher.DefaultSecDispatcher.getSec (DefaultSecDispatcher.java:206)
  132. at org.sonatype.plexus.components.sec.dispatcher.DefaultSecDispatcher.decrypt (DefaultSecDispatcher.java:90)
  133. at org.apache.maven.settings.crypto.DefaultSettingsDecrypter.decrypt (DefaultSettingsDecrypter.java:107)
  134. at org.apache.maven.settings.crypto.DefaultSettingsDecrypter.decrypt (DefaultSettingsDecrypter.java:63)
  135. at org.apache.maven.internal.aether.DefaultRepositorySystemSessionFactory.newRepositorySession (DefaultRepositorySystemSessionFactory.java:167)
  136. at org.apache.maven.DefaultMaven.newRepositorySession (DefaultMaven.java:350)
  137. at org.apache.maven.DefaultMaven.doExecute (DefaultMaven.java:185)
  138. at org.apache.maven.DefaultMaven.execute (DefaultMaven.java:105)
  139. at org.apache.maven.cli.MavenCli.execute (MavenCli.java:956)
  140. at org.apache.maven.cli.MavenCli.doMain (MavenCli.java:288)
  141. at org.apache.maven.cli.MavenCli.main (MavenCli.java:192)
  142. at sun.reflect.NativeMethodAccessorImpl.invoke0 (Native Method)
  143. at sun.reflect.NativeMethodAccessorImpl.invoke (NativeMethodAccessorImpl.java:62)
  144. at sun.reflect.DelegatingMethodAccessorImpl.invoke (DelegatingMethodAccessorImpl.java:43)
  145. at java.lang.reflect.Method.invoke (Method.java:498)
  146. at org.codehaus.plexus.classworlds.launcher.Launcher.launchEnhanced (Launcher.java:289)
  147. at org.codehaus.plexus.classworlds.launcher.Launcher.launch (Launcher.java:229)
  148. at org.codehaus.plexus.classworlds.launcher.Launcher.mainWithExitCode (Launcher.java:415)
  149. at org.codehaus.plexus.classworlds.launcher.Launcher.main (Launcher.java:356)
  150. [INFO] Scanning for projects...
  151. [DEBUG] Extension realms for project org.openmrs.contrib:uitestframework:jar:2.4.0-SNAPSHOT: (none)
  152. [DEBUG] Looking up lifecycle mappings for packaging jar from ClassRealm[plexus.core, parent: null]
  153. [WARNING]
  154. [WARNING] Some problems were encountered while building the effective model for org.openmrs.contrib:uitestframework:jar:2.4.0-SNAPSHOT
  155. [WARNING] 'build.plugins.plugin.version' for org.apache.maven.plugins:maven-compiler-plugin is missing. @ line 126, column 12
  156. [WARNING]
  157. [WARNING] It is highly recommended to fix these problems because they threaten the stability of your build.
  158. [WARNING]
  159. [WARNING] For this reason, future Maven versions might no longer support building such malformed projects.
  160. [WARNING]
  161. [DEBUG] === REACTOR BUILD PLAN ================================================
  162. [DEBUG] Project: org.openmrs.contrib:uitestframework:jar:2.4.0-SNAPSHOT
  163. [DEBUG] Tasks: [clean, install]
  164. [DEBUG] Style: Regular
  165. [DEBUG] =======================================================================
  166. [INFO]
  167. [INFO] ----------------< org.openmrs.contrib:uitestframework >-----------------
  168. [INFO] Building UI Test Framework 2.4.0-SNAPSHOT
  169. [INFO] --------------------------------[ jar ]---------------------------------
  170. [DEBUG] Lifecycle default -> [validate, initialize, generate-sources, process-sources, generate-resources, process-resources, compile, process-classes, generate-test-sources, process-test-sources, generate-test-resources, process-test-resources, test-compile, process-test-classes, test, prepare-package, package, pre-integration-test, integration-test, post-integration-test, verify, install, deploy]
  171. [DEBUG] Lifecycle clean -> [pre-clean, clean, post-clean]
  172. [DEBUG] Lifecycle site -> [pre-site, site, post-site, site-deploy]
  173. [DEBUG] Lifecycle default -> [validate, initialize, generate-sources, process-sources, generate-resources, process-resources, compile, process-classes, generate-test-sources, process-test-sources, generate-test-resources, process-test-resources, test-compile, process-test-classes, test, prepare-package, package, pre-integration-test, integration-test, post-integration-test, verify, install, deploy]
  174. [DEBUG] Lifecycle clean -> [pre-clean, clean, post-clean]
  175. [DEBUG] Lifecycle site -> [pre-site, site, post-site, site-deploy]
  176. [DEBUG] Lifecycle default -> [validate, initialize, generate-sources, process-sources, generate-resources, process-resources, compile, process-classes, generate-test-sources, process-test-sources, generate-test-resources, process-test-resources, test-compile, process-test-classes, test, prepare-package, package, pre-integration-test, integration-test, post-integration-test, verify, install, deploy]
  177. [DEBUG] Lifecycle clean -> [pre-clean, clean, post-clean]
  178. [DEBUG] Lifecycle site -> [pre-site, site, post-site, site-deploy]
  179. [DEBUG] Lifecycle default -> [validate, initialize, generate-sources, process-sources, generate-resources, process-resources, compile, process-classes, generate-test-sources, process-test-sources, generate-test-resources, process-test-resources, test-compile, process-test-classes, test, prepare-package, package, pre-integration-test, integration-test, post-integration-test, verify, install, deploy]
  180. [DEBUG] Lifecycle clean -> [pre-clean, clean, post-clean]
  181. [DEBUG] Lifecycle site -> [pre-site, site, post-site, site-deploy]
  182. [DEBUG] Lifecycle default -> [validate, initialize, generate-sources, process-sources, generate-resources, process-resources, compile, process-classes, generate-test-sources, process-test-sources, generate-test-resources, process-test-resources, test-compile, process-test-classes, test, prepare-package, package, pre-integration-test, integration-test, post-integration-test, verify, install, deploy]
  183. [DEBUG] Lifecycle clean -> [pre-clean, clean, post-clean]
  184. [DEBUG] Lifecycle site -> [pre-site, site, post-site, site-deploy]
  185. [DEBUG] Lifecycle default -> [validate, initialize, generate-sources, process-sources, generate-resources, process-resources, compile, process-classes, generate-test-sources, process-test-sources, generate-test-resources, process-test-resources, test-compile, process-test-classes, test, prepare-package, package, pre-integration-test, integration-test, post-integration-test, verify, install, deploy]
  186. [DEBUG] Lifecycle clean -> [pre-clean, clean, post-clean]
  187. [DEBUG] Lifecycle site -> [pre-site, site, post-site, site-deploy]
  188. [DEBUG] Lifecycle default -> [validate, initialize, generate-sources, process-sources, generate-resources, process-resources, compile, process-classes, generate-test-sources, process-test-sources, generate-test-resources, process-test-resources, test-compile, process-test-classes, test, prepare-package, package, pre-integration-test, integration-test, post-integration-test, verify, install, deploy]
  189. [DEBUG] Lifecycle clean -> [pre-clean, clean, post-clean]
  190. [DEBUG] Lifecycle site -> [pre-site, site, post-site, site-deploy]
  191. [DEBUG] Lifecycle default -> [validate, initialize, generate-sources, process-sources, generate-resources, process-resources, compile, process-classes, generate-test-sources, process-test-sources, generate-test-resources, process-test-resources, test-compile, process-test-classes, test, prepare-package, package, pre-integration-test, integration-test, post-integration-test, verify, install, deploy]
  192. [DEBUG] Lifecycle clean -> [pre-clean, clean, post-clean]
  193. [DEBUG] Lifecycle site -> [pre-site, site, post-site, site-deploy]
  194. [DEBUG] Lifecycle default -> [validate, initialize, generate-sources, process-sources, generate-resources, process-resources, compile, process-classes, generate-test-sources, process-test-sources, generate-test-resources, process-test-resources, test-compile, process-test-classes, test, prepare-package, package, pre-integration-test, integration-test, post-integration-test, verify, install, deploy]
  195. [DEBUG] Lifecycle clean -> [pre-clean, clean, post-clean]
  196. [DEBUG] Lifecycle site -> [pre-site, site, post-site, site-deploy]
  197. [DEBUG] Lifecycle default -> [validate, initialize, generate-sources, process-sources, generate-resources, process-resources, compile, process-classes, generate-test-sources, process-test-sources, generate-test-resources, process-test-resources, test-compile, process-test-classes, test, prepare-package, package, pre-integration-test, integration-test, post-integration-test, verify, install, deploy]
  198. [DEBUG] Lifecycle clean -> [pre-clean, clean, post-clean]
  199. [DEBUG] Lifecycle site -> [pre-site, site, post-site, site-deploy]
  200. [DEBUG] === PROJECT BUILD PLAN ================================================
  201. [DEBUG] Project: org.openmrs.contrib:uitestframework:2.4.0-SNAPSHOT
  202. [DEBUG] Dependencies (collect): []
  203. [DEBUG] Dependencies (resolve): [compile, runtime, test]
  204. [DEBUG] Repositories (dependencies): [openmrs-repo (http://mavenrepo.openmrs.org/nexus/content/repositories/public, default, releases+snapshots), archetype (http://mavenrepo.openmrs.org/nexus/content/repositories/public, default, releases+snapshots), openmrs-repo-thirdparty (http://mavenrepo.openmrs.org/nexus/content/repositories/thirdparty, default, releases+snapshots), openmrs-bintray-repo (https://dl.bintray.com/openmrs/maven/, default, releases+snapshots), central (https://repo.maven.apache.org/maven2, default, releases)]
  205. [DEBUG] Repositories (plugins) : [openmrs-repo (http://mavenrepo.openmrs.org/nexus/content/repositories/public, default, releases), openmrs-bintray-repo (https://dl.bintray.com/openmrs/maven/, default, releases+snapshots), central (https://repo.maven.apache.org/maven2, default, releases)]
  206. [DEBUG] -----------------------------------------------------------------------
  207. [DEBUG] Goal: org.apache.maven.plugins:maven-clean-plugin:2.5:clean (default-clean)
  208. [DEBUG] Style: Regular
  209. [DEBUG] Configuration: <?xml version="1.0" encoding="UTF-8"?>
  210. <configuration>
  211. <directory default-value="${project.build.directory}"/>
  212. <excludeDefaultDirectories default-value="false">${clean.excludeDefaultDirectories}</excludeDefaultDirectories>
  213. <failOnError default-value="true">${maven.clean.failOnError}</failOnError>
  214. <followSymLinks default-value="false">${clean.followSymLinks}</followSymLinks>
  215. <outputDirectory default-value="${project.build.outputDirectory}"/>
  216. <reportDirectory default-value="${project.reporting.outputDirectory}"/>
  217. <retryOnError default-value="true">${maven.clean.retryOnError}</retryOnError>
  218. <skip default-value="false">${clean.skip}</skip>
  219. <testOutputDirectory default-value="${project.build.testOutputDirectory}"/>
  220. <verbose>${clean.verbose}</verbose>
  221. </configuration>
  222. [DEBUG] -----------------------------------------------------------------------
  223. [DEBUG] Goal: org.apache.maven.plugins:maven-resources-plugin:2.6:resources (default-resources)
  224. [DEBUG] Style: Regular
  225. [DEBUG] Configuration: <?xml version="1.0" encoding="UTF-8"?>
  226. <configuration>
  227. <buildFilters default-value="${project.build.filters}"/>
  228. <encoding default-value="${project.build.sourceEncoding}">${encoding}</encoding>
  229. <escapeString>${maven.resources.escapeString}</escapeString>
  230. <escapeWindowsPaths default-value="true">${maven.resources.escapeWindowsPaths}</escapeWindowsPaths>
  231. <includeEmptyDirs default-value="false">${maven.resources.includeEmptyDirs}</includeEmptyDirs>
  232. <outputDirectory default-value="${project.build.outputDirectory}"/>
  233. <overwrite default-value="false">${maven.resources.overwrite}</overwrite>
  234. <project default-value="${project}"/>
  235. <resources default-value="${project.resources}"/>
  236. <session default-value="${session}"/>
  237. <supportMultiLineFiltering default-value="false">${maven.resources.supportMultiLineFiltering}</supportMultiLineFiltering>
  238. <useBuildFilters default-value="true"/>
  239. <useDefaultDelimiters default-value="true"/>
  240. </configuration>
  241. [DEBUG] -----------------------------------------------------------------------
  242. [DEBUG] Goal: org.apache.maven.plugins:maven-compiler-plugin:3.1:compile (default-compile)
  243. [DEBUG] Style: Regular
  244. [DEBUG] Configuration: <?xml version="1.0" encoding="UTF-8"?>
  245. <configuration>
  246. <basedir default-value="${basedir}"/>
  247. <buildDirectory default-value="${project.build.directory}"/>
  248. <classpathElements default-value="${project.compileClasspathElements}"/>
  249. <compileSourceRoots default-value="${project.compileSourceRoots}"/>
  250. <compilerId default-value="javac">${maven.compiler.compilerId}</compilerId>
  251. <compilerReuseStrategy default-value="${reuseCreated}">${maven.compiler.compilerReuseStrategy}</compilerReuseStrategy>
  252. <compilerVersion>${maven.compiler.compilerVersion}</compilerVersion>
  253. <debug default-value="true">${maven.compiler.debug}</debug>
  254. <debuglevel>${maven.compiler.debuglevel}</debuglevel>
  255. <encoding default-value="${project.build.sourceEncoding}">${encoding}</encoding>
  256. <executable>${maven.compiler.executable}</executable>
  257. <failOnError default-value="true">${maven.compiler.failOnError}</failOnError>
  258. <forceJavacCompilerUse default-value="false">${maven.compiler.forceJavacCompilerUse}</forceJavacCompilerUse>
  259. <fork default-value="false">${maven.compiler.fork}</fork>
  260. <generatedSourcesDirectory default-value="${project.build.directory}/generated-sources/annotations"/>
  261. <maxmem>${maven.compiler.maxmem}</maxmem>
  262. <meminitial>${maven.compiler.meminitial}</meminitial>
  263. <mojoExecution>${mojoExecution}</mojoExecution>
  264. <optimize default-value="false">${maven.compiler.optimize}</optimize>
  265. <outputDirectory default-value="${project.build.outputDirectory}"/>
  266. <projectArtifact default-value="${project.artifact}"/>
  267. <showDeprecation default-value="false">${maven.compiler.showDeprecation}</showDeprecation>
  268. <showWarnings default-value="false">${maven.compiler.showWarnings}</showWarnings>
  269. <skipMain>${maven.main.skip}</skipMain>
  270. <skipMultiThreadWarning default-value="false">${maven.compiler.skipMultiThreadWarning}</skipMultiThreadWarning>
  271. <source default-value="1.5">8</source>
  272. <staleMillis default-value="0">${lastModGranularityMs}</staleMillis>
  273. <target default-value="1.5">8</target>
  274. <useIncrementalCompilation default-value="true">${maven.compiler.useIncrementalCompilation}</useIncrementalCompilation>
  275. <verbose default-value="false">${maven.compiler.verbose}</verbose>
  276. <mavenSession default-value="${session}"/>
  277. <session default-value="${session}"/>
  278. </configuration>
  279. [DEBUG] -----------------------------------------------------------------------
  280. [DEBUG] Goal: org.apache.maven.plugins:maven-resources-plugin:2.6:testResources (default-testResources)
  281. [DEBUG] Style: Regular
  282. [DEBUG] Configuration: <?xml version="1.0" encoding="UTF-8"?>
  283. <configuration>
  284. <buildFilters default-value="${project.build.filters}"/>
  285. <encoding default-value="${project.build.sourceEncoding}">${encoding}</encoding>
  286. <escapeString>${maven.resources.escapeString}</escapeString>
  287. <escapeWindowsPaths default-value="true">${maven.resources.escapeWindowsPaths}</escapeWindowsPaths>
  288. <includeEmptyDirs default-value="false">${maven.resources.includeEmptyDirs}</includeEmptyDirs>
  289. <outputDirectory default-value="${project.build.testOutputDirectory}"/>
  290. <overwrite default-value="false">${maven.resources.overwrite}</overwrite>
  291. <project default-value="${project}"/>
  292. <resources default-value="${project.testResources}"/>
  293. <session default-value="${session}"/>
  294. <skip>${maven.test.skip}</skip>
  295. <supportMultiLineFiltering default-value="false">${maven.resources.supportMultiLineFiltering}</supportMultiLineFiltering>
  296. <useBuildFilters default-value="true"/>
  297. <useDefaultDelimiters default-value="true"/>
  298. </configuration>
  299. [DEBUG] -----------------------------------------------------------------------
  300. [DEBUG] Goal: org.apache.maven.plugins:maven-compiler-plugin:3.1:testCompile (default-testCompile)
  301. [DEBUG] Style: Regular
  302. [DEBUG] Configuration: <?xml version="1.0" encoding="UTF-8"?>
  303. <configuration>
  304. <basedir default-value="${basedir}"/>
  305. <buildDirectory default-value="${project.build.directory}"/>
  306. <classpathElements default-value="${project.testClasspathElements}"/>
  307. <compileSourceRoots default-value="${project.testCompileSourceRoots}"/>
  308. <compilerId default-value="javac">${maven.compiler.compilerId}</compilerId>
  309. <compilerReuseStrategy default-value="${reuseCreated}">${maven.compiler.compilerReuseStrategy}</compilerReuseStrategy>
  310. <compilerVersion>${maven.compiler.compilerVersion}</compilerVersion>
  311. <debug default-value="true">${maven.compiler.debug}</debug>
  312. <debuglevel>${maven.compiler.debuglevel}</debuglevel>
  313. <encoding default-value="${project.build.sourceEncoding}">${encoding}</encoding>
  314. <executable>${maven.compiler.executable}</executable>
  315. <failOnError default-value="true">${maven.compiler.failOnError}</failOnError>
  316. <forceJavacCompilerUse default-value="false">${maven.compiler.forceJavacCompilerUse}</forceJavacCompilerUse>
  317. <fork default-value="false">${maven.compiler.fork}</fork>
  318. <generatedTestSourcesDirectory default-value="${project.build.directory}/generated-test-sources/test-annotations"/>
  319. <maxmem>${maven.compiler.maxmem}</maxmem>
  320. <meminitial>${maven.compiler.meminitial}</meminitial>
  321. <mojoExecution>${mojoExecution}</mojoExecution>
  322. <optimize default-value="false">${maven.compiler.optimize}</optimize>
  323. <outputDirectory default-value="${project.build.testOutputDirectory}"/>
  324. <showDeprecation default-value="false">${maven.compiler.showDeprecation}</showDeprecation>
  325. <showWarnings default-value="false">${maven.compiler.showWarnings}</showWarnings>
  326. <skip>${maven.test.skip}</skip>
  327. <skipMultiThreadWarning default-value="false">${maven.compiler.skipMultiThreadWarning}</skipMultiThreadWarning>
  328. <source default-value="1.5">8</source>
  329. <staleMillis default-value="0">${lastModGranularityMs}</staleMillis>
  330. <target default-value="1.5">8</target>
  331. <testSource>${maven.compiler.testSource}</testSource>
  332. <testTarget>${maven.compiler.testTarget}</testTarget>
  333. <useIncrementalCompilation default-value="true">${maven.compiler.useIncrementalCompilation}</useIncrementalCompilation>
  334. <verbose default-value="false">${maven.compiler.verbose}</verbose>
  335. <mavenSession default-value="${session}"/>
  336. <session default-value="${session}"/>
  337. </configuration>
  338. [DEBUG] -----------------------------------------------------------------------
  339. [DEBUG] Goal: org.apache.maven.plugins:maven-surefire-plugin:2.12.4:test (default-test)
  340. [DEBUG] Style: Regular
  341. [DEBUG] Configuration: <?xml version="1.0" encoding="UTF-8"?>
  342. <configuration>
  343. <argLine>${argLine}</argLine>
  344. <basedir default-value="${basedir}"/>
  345. <childDelegation default-value="false">${childDelegation}</childDelegation>
  346. <classesDirectory default-value="${project.build.outputDirectory}"/>
  347. <debugForkedProcess>${maven.surefire.debug}</debugForkedProcess>
  348. <disableXmlReport default-value="false">${disableXmlReport}</disableXmlReport>
  349. <enableAssertions default-value="true">${enableAssertions}</enableAssertions>
  350. <excludedGroups>${excludedGroups}</excludedGroups>
  351. <failIfNoSpecifiedTests>${surefire.failIfNoSpecifiedTests}</failIfNoSpecifiedTests>
  352. <failIfNoTests>${failIfNoTests}</failIfNoTests>
  353. <forkMode default-value="once">${forkMode}</forkMode>
  354. <forkedProcessTimeoutInSeconds>${surefire.timeout}</forkedProcessTimeoutInSeconds>
  355. <groups>${groups}</groups>
  356. <junitArtifactName default-value="junit:junit">${junitArtifactName}</junitArtifactName>
  357. <jvm>${jvm}</jvm>
  358. <localRepository default-value="${localRepository}"/>
  359. <objectFactory>${objectFactory}</objectFactory>
  360. <parallel>${parallel}</parallel>
  361. <parallelMavenExecution default-value="${session.parallel}"/>
  362. <perCoreThreadCount default-value="true">${perCoreThreadCount}</perCoreThreadCount>
  363. <pluginArtifactMap>${plugin.artifactMap}</pluginArtifactMap>
  364. <pluginDescriptor default-value="${plugin}"/>
  365. <printSummary default-value="true">${surefire.printSummary}</printSummary>
  366. <projectArtifactMap>${project.artifactMap}</projectArtifactMap>
  367. <redirectTestOutputToFile default-value="false">${maven.test.redirectTestOutputToFile}</redirectTestOutputToFile>
  368. <remoteRepositories default-value="${project.pluginArtifactRepositories}"/>
  369. <reportFormat default-value="brief">${surefire.reportFormat}</reportFormat>
  370. <reportNameSuffix default-value="">${surefire.reportNameSuffix}</reportNameSuffix>
  371. <reportsDirectory default-value="${project.build.directory}/surefire-reports"/>
  372. <runOrder default-value="filesystem"/>
  373. <skip default-value="false">${maven.test.skip}</skip>
  374. <skipExec>${maven.test.skip.exec}</skipExec>
  375. <skipTests default-value="false">${skipTests}</skipTests>
  376. <test>${test}</test>
  377. <testClassesDirectory default-value="${project.build.testOutputDirectory}"/>
  378. <testFailureIgnore default-value="false">${maven.test.failure.ignore}</testFailureIgnore>
  379. <testNGArtifactName default-value="org.testng:testng">${testNGArtifactName}</testNGArtifactName>
  380. <testSourceDirectory default-value="${project.build.testSourceDirectory}"/>
  381. <threadCount>${threadCount}</threadCount>
  382. <trimStackTrace default-value="true">${trimStackTrace}</trimStackTrace>
  383. <useFile default-value="true">${surefire.useFile}</useFile>
  384. <useManifestOnlyJar default-value="true">${surefire.useManifestOnlyJar}</useManifestOnlyJar>
  385. <useSystemClassLoader default-value="true">${surefire.useSystemClassLoader}</useSystemClassLoader>
  386. <useUnlimitedThreads default-value="false">${useUnlimitedThreads}</useUnlimitedThreads>
  387. <workingDirectory>${basedir}</workingDirectory>
  388. <project default-value="${project}"/>
  389. <session default-value="${session}"/>
  390. </configuration>
  391. [DEBUG] -----------------------------------------------------------------------
  392. [DEBUG] Goal: org.apache.maven.plugins:maven-jar-plugin:2.4:jar (default-jar)
  393. [DEBUG] Style: Regular
  394. [DEBUG] Configuration: <?xml version="1.0" encoding="UTF-8"?>
  395. <configuration>
  396. <classesDirectory default-value="${project.build.outputDirectory}"/>
  397. <defaultManifestFile default-value="${project.build.outputDirectory}/META-INF/MANIFEST.MF"/>
  398. <finalName default-value="${project.build.finalName}">${jar.finalName}</finalName>
  399. <forceCreation default-value="false">${jar.forceCreation}</forceCreation>
  400. <outputDirectory default-value="${project.build.directory}"/>
  401. <project default-value="${project}"/>
  402. <session default-value="${session}"/>
  403. <skipIfEmpty default-value="false">${jar.skipIfEmpty}</skipIfEmpty>
  404. <useDefaultManifestFile default-value="false">${jar.useDefaultManifestFile}</useDefaultManifestFile>
  405. </configuration>
  406. [DEBUG] -----------------------------------------------------------------------
  407. [DEBUG] Goal: org.apache.maven.plugins:maven-install-plugin:2.4:install (default-install)
  408. [DEBUG] Style: Regular
  409. [DEBUG] Configuration: <?xml version="1.0" encoding="UTF-8"?>
  410. <configuration>
  411. <artifact default-value="${project.artifact}"/>
  412. <attachedArtifacts default-value="${project.attachedArtifacts}"/>
  413. <createChecksum default-value="false">${createChecksum}</createChecksum>
  414. <localRepository>${localRepository}</localRepository>
  415. <packaging default-value="${project.packaging}"/>
  416. <pomFile default-value="${project.file}"/>
  417. <skip default-value="false">${maven.install.skip}</skip>
  418. <updateReleaseInfo default-value="false">${updateReleaseInfo}</updateReleaseInfo>
  419. </configuration>
  420. [DEBUG] =======================================================================
  421. [DEBUG] Dependency collection stats: {ConflictMarker.analyzeTime=4842383, ConflictMarker.markTime=2263038, ConflictMarker.nodeCount=357, ConflictIdSorter.graphTime=3474874, ConflictIdSorter.topsortTime=1004890, ConflictIdSorter.conflictIdCount=106, ConflictIdSorter.conflictIdCycleCount=0, ConflictResolver.totalTime=27766149, ConflictResolver.conflictItemCount=257, DefaultDependencyCollector.collectTime=1276474910, DefaultDependencyCollector.transformTime=43350619}
  422. [DEBUG] org.openmrs.contrib:uitestframework:jar:2.4.0-SNAPSHOT
  423. [DEBUG] junit:junit:jar:4.13:compile
  424. [DEBUG] org.hamcrest:hamcrest-core:jar:1.3:compile
  425. [DEBUG] org.seleniumhq.selenium:selenium-java:jar:4.0.0-alpha-6:compile
  426. [DEBUG] org.seleniumhq.selenium:selenium-api:jar:4.0.0-alpha-6:compile
  427. [DEBUG] org.seleniumhq.selenium:selenium-chrome-driver:jar:4.0.0-alpha-6:compile
  428. [DEBUG] com.google.auto.service:auto-service-annotations:jar:1.0-rc6:compile
  429. [DEBUG] com.google.auto.service:auto-service:jar:1.0-rc6:compile
  430. [DEBUG] com.google.auto:auto-common:jar:0.10:compile
  431. [DEBUG] com.google.guava:guava:jar:29.0-jre:compile
  432. [DEBUG] com.google.guava:failureaccess:jar:1.0.1:compile
  433. [DEBUG] com.google.guava:listenablefuture:jar:9999.0-empty-to-avoid-conflict-with-guava:compile
  434. [DEBUG] com.google.code.findbugs:jsr305:jar:3.0.2:compile
  435. [DEBUG] org.checkerframework:checker-qual:jar:2.11.1:compile
  436. [DEBUG] com.google.errorprone:error_prone_annotations:jar:2.3.4:compile
  437. [DEBUG] com.google.j2objc:j2objc-annotations:jar:1.3:compile
  438. [DEBUG] org.seleniumhq.selenium:selenium-chromium-driver:jar:4.0.0-alpha-6:compile
  439. [DEBUG] org.seleniumhq.selenium:selenium-devtools:jar:4.0.0-alpha-6:compile
  440. [DEBUG] org.seleniumhq.selenium:selenium-http:jar:4.0.0-alpha-6:compile
  441. [DEBUG] org.seleniumhq.selenium:selenium-json:jar:4.0.0-alpha-6:compile
  442. [DEBUG] org.seleniumhq.selenium:selenium-edge-driver:jar:4.0.0-alpha-6:compile
  443. [DEBUG] org.seleniumhq.selenium:selenium-edgehtml-driver:jar:4.0.0-alpha-6:compile
  444. [DEBUG] org.seleniumhq.selenium:selenium-firefox-driver:jar:4.0.0-alpha-6:compile
  445. [DEBUG] org.seleniumhq.selenium:selenium-firefox-xpi-driver:jar:4.0.0-alpha-6:compile
  446. [DEBUG] org.seleniumhq.selenium:selenium-ie-driver:jar:4.0.0-alpha-6:compile
  447. [DEBUG] org.seleniumhq.selenium:selenium-opera-driver:jar:4.0.0-alpha-6:compile
  448. [DEBUG] org.seleniumhq.selenium:selenium-remote-driver:jar:4.0.0-alpha-6:compile
  449. [DEBUG] com.squareup.okhttp3:okhttp:jar:4.5.0:compile
  450. [DEBUG] org.jetbrains.kotlin:kotlin-stdlib:jar:1.3.70:compile
  451. [DEBUG] org.jetbrains:annotations:jar:13.0:compile
  452. [DEBUG] com.squareup.okio:okio:jar:2.6.0:compile
  453. [DEBUG] org.jetbrains.kotlin:kotlin-stdlib-common:jar:1.3.70:compile
  454. [DEBUG] com.typesafe.netty:netty-reactive-streams:jar:2.0.4:compile
  455. [DEBUG] io.netty:netty-handler:jar:4.1.43.Final:compile
  456. [DEBUG] org.reactivestreams:reactive-streams:jar:1.0.3:compile
  457. [DEBUG] io.grpc:grpc-context:jar:1.28.0:compile
  458. [DEBUG] io.netty:netty-buffer:jar:4.1.49.Final:compile
  459. [DEBUG] io.netty:netty-common:jar:4.1.49.Final:compile
  460. [DEBUG] io.netty:netty-codec-http:jar:4.1.49.Final:compile
  461. [DEBUG] io.netty:netty-codec:jar:4.1.49.Final:compile
  462. [DEBUG] io.netty:netty-transport-native-epoll:jar:4.1.49.Final:compile
  463. [DEBUG] io.netty:netty-transport-native-epoll:jar:linux-x86_64:4.1.49.Final:compile
  464. [DEBUG] io.netty:netty-transport-native-kqueue:jar:4.1.49.Final:compile
  465. [DEBUG] io.netty:netty-transport-native-kqueue:jar:osx-x86_64:4.1.49.Final:compile
  466. [DEBUG] io.netty:netty-transport-native-unix-common:jar:4.1.49.Final:compile
  467. [DEBUG] io.netty:netty-transport:jar:4.1.49.Final:compile
  468. [DEBUG] io.netty:netty-resolver:jar:4.1.49.Final:compile
  469. [DEBUG] io.opentelemetry:opentelemetry-api:jar:0.4.0:compile
  470. [DEBUG] io.opentelemetry:opentelemetry-context-prop:jar:0.4.0:compile
  471. [DEBUG] io.opentelemetry:opentelemetry-sdk:jar:0.4.0:compile
  472. [DEBUG] io.projectreactor.netty:reactor-netty:jar:0.9.6.RELEASE:compile
  473. [DEBUG] io.netty:netty-codec-http2:jar:4.1.48.Final:compile
  474. [DEBUG] io.netty:netty-handler-proxy:jar:4.1.48.Final:compile
  475. [DEBUG] io.projectreactor:reactor-core:jar:3.3.5.RELEASE:compile
  476. [DEBUG] net.bytebuddy:byte-buddy:jar:1.10.9:compile
  477. [DEBUG] org.apache.commons:commons-exec:jar:1.3:compile
  478. [DEBUG] org.asynchttpclient:async-http-client:jar:2.12.1:compile
  479. [DEBUG] org.asynchttpclient:async-http-client-netty-utils:jar:2.12.1:compile
  480. [DEBUG] io.netty:netty-codec-socks:jar:4.1.48.Final:compile
  481. [DEBUG] com.sun.activation:javax.activation:jar:1.2.0:compile
  482. [DEBUG] org.seleniumhq.selenium:selenium-safari-driver:jar:4.0.0-alpha-6:compile
  483. [DEBUG] org.seleniumhq.selenium:selenium-support:jar:4.0.0-alpha-6:compile
  484. [DEBUG] org.apache.commons:commons-vfs2:jar:2.0:compile
  485. [DEBUG] commons-logging:commons-logging:jar:1.1.1:compile
  486. [DEBUG] org.apache.maven.scm:maven-scm-api:jar:1.4:compile
  487. [DEBUG] org.codehaus.plexus:plexus-utils:jar:1.5.6:compile
  488. [DEBUG] org.apache.maven.scm:maven-scm-provider-svnexe:jar:1.4:compile
  489. [DEBUG] org.apache.maven.scm:maven-scm-provider-svn-commons:jar:1.4:compile
  490. [DEBUG] regexp:regexp:jar:1.3:compile
  491. [DEBUG] commons-io:commons-io:jar:2.6:compile
  492. [DEBUG] org.apache.commons:commons-lang3:jar:3.11:compile
  493. [DEBUG] log4j:log4j:jar:1.2.15:compile
  494. [DEBUG] javax.mail:mail:jar:1.4:compile
  495. [DEBUG] javax.activation:activation:jar:1.1:compile
  496. [DEBUG] javax.jms:jms:jar:1.1:compile
  497. [DEBUG] com.sun.jdmk:jmxtools:jar:1.2.1:compile
  498. [DEBUG] com.sun.jmx:jmxri:jar:1.2.1:compile
  499. [DEBUG] org.dbunit:dbunit:jar:2.4.9:compile
  500. [DEBUG] org.slf4j:slf4j-api:jar:1.5.6:compile
  501. [DEBUG] commons-collections:commons-collections:jar:3.2.1:compile
  502. [DEBUG] mysql:mysql-connector-java:jar:5.1.25:compile
  503. [DEBUG] org.glassfish.jersey.core:jersey-client:jar:3.0.0-M6:compile
  504. [DEBUG] jakarta.ws.rs:jakarta.ws.rs-api:jar:3.0.0-M1:compile
  505. [DEBUG] org.glassfish.jersey.core:jersey-common:jar:3.0.0-M6:compile
  506. [DEBUG] jakarta.annotation:jakarta.annotation-api:jar:2.0.0-RC1:compile
  507. [DEBUG] jakarta.activation:jakarta.activation-api:jar:2.0.0-RC3:compile
  508. [DEBUG] org.glassfish.hk2:osgi-resource-locator:jar:1.0.3:compile
  509. [DEBUG] jakarta.inject:jakarta.inject-api:jar:2.0.0-RC4:compile
  510. [DEBUG] org.glassfish.jersey.inject:jersey-hk2:jar:3.0.0-M6:compile
  511. [DEBUG] org.glassfish.hk2:hk2-locator:jar:3.0.0-M2:compile
  512. [DEBUG] org.glassfish.hk2.external:aopalliance-repackaged:jar:3.0.0-M2:compile
  513. [DEBUG] org.glassfish.hk2:hk2-api:jar:3.0.0-M2:compile
  514. [DEBUG] org.glassfish.hk2:hk2-utils:jar:3.0.0-M2:compile
  515. [DEBUG] org.javassist:javassist:jar:3.25.0-GA:compile
  516. [DEBUG] com.fasterxml.jackson.core:jackson-core:jar:2.2.3:compile
  517. [DEBUG] com.fasterxml.jackson.core:jackson-databind:jar:2.2.3:compile
  518. [DEBUG] com.fasterxml.jackson.core:jackson-annotations:jar:2.2.3:compile
  519. [DEBUG] com.saucelabs:sauce_junit:jar:2.1.18:compile
  520. [DEBUG] com.saucelabs:sauce_java_common:jar:2.1.18:compile
  521. [DEBUG] com.saucelabs:saucerest:jar:1.0.22:compile
  522. [DEBUG] com.googlecode.json-simple:json-simple:jar:1.1:compile
  523. [DEBUG] org.apache.httpcomponents:httpclient:jar:4.3.1:compile
  524. [DEBUG] org.apache.httpcomponents:httpcore:jar:4.3:compile
  525. [DEBUG] commons-codec:commons-codec:jar:1.6:compile
  526. [DEBUG] org.json:json:jar:20090211:compile
  527. [DEBUG] Using transporter WagonTransporter with priority -1.0 for http://mavenrepo.openmrs.org/nexus/content/repositories/public
  528. [DEBUG] Using connector BasicRepositoryConnector with priority 0.0 for http://mavenrepo.openmrs.org/nexus/content/repositories/public
  529. Downloading from openmrs-repo: http://mavenrepo.openmrs.org/nexus/content/repositories/public/com/sun/jmx/jmxri/1.2.1/jmxri-1.2.1.jar
  530. [DEBUG] Writing tracking file /home/irynah/.m2/repository/com/sun/jmx/jmxri/1.2.1/jmxri-1.2.1.jar.lastUpdated
  531. [DEBUG] Using transporter WagonTransporter with priority -1.0 for http://mavenrepo.openmrs.org/nexus/content/repositories/public
  532. [DEBUG] Using connector BasicRepositoryConnector with priority 0.0 for http://mavenrepo.openmrs.org/nexus/content/repositories/public
  533. Downloading from archetype: http://mavenrepo.openmrs.org/nexus/content/repositories/public/com/sun/jmx/jmxri/1.2.1/jmxri-1.2.1.jar
  534. [DEBUG] Writing tracking file /home/irynah/.m2/repository/com/sun/jmx/jmxri/1.2.1/jmxri-1.2.1.jar.lastUpdated
  535. [DEBUG] Using transporter WagonTransporter with priority -1.0 for http://mavenrepo.openmrs.org/nexus/content/repositories/thirdparty
  536. [DEBUG] Using connector BasicRepositoryConnector with priority 0.0 for http://mavenrepo.openmrs.org/nexus/content/repositories/thirdparty
  537. Downloading from openmrs-repo-thirdparty: http://mavenrepo.openmrs.org/nexus/content/repositories/thirdparty/com/sun/jmx/jmxri/1.2.1/jmxri-1.2.1.jar
  538. [DEBUG] Writing tracking file /home/irynah/.m2/repository/com/sun/jmx/jmxri/1.2.1/jmxri-1.2.1.jar.lastUpdated
  539. [INFO] ------------------------------------------------------------------------
  540. [INFO] BUILD FAILURE
  541. [INFO] ------------------------------------------------------------------------
  542. [INFO] Total time: 9.493 s
  543. [INFO] Finished at: 2021-02-23T09:32:59+03:00
  544. [INFO] ------------------------------------------------------------------------
  545. [ERROR] Failed to execute goal on project uitestframework: Could not resolve dependencies for project org.openmrs.contrib:uitestframework:jar:2.4.0-SNAPSHOT: Could not transfer artifact com.sun.jmx:jmxri:jar:1.2.1 from/to openmrs-repo (http://mavenrepo.openmrs.org/nexus/content/repositories/public): Connection reset -> [Help 1]
  546. org.apache.maven.lifecycle.LifecycleExecutionException: Failed to execute goal on project uitestframework: Could not resolve dependencies for project org.openmrs.contrib:uitestframework:jar:2.4.0-SNAPSHOT: Could not transfer artifact com.sun.jmx:jmxri:jar:1.2.1 from/to openmrs-repo (http://mavenrepo.openmrs.org/nexus/content/repositories/public): Connection reset
  547. at org.apache.maven.lifecycle.internal.LifecycleDependencyResolver.getDependencies (LifecycleDependencyResolver.java:269)
  548. at org.apache.maven.lifecycle.internal.LifecycleDependencyResolver.resolveProjectDependencies (LifecycleDependencyResolver.java:147)
  549. at org.apache.maven.lifecycle.internal.MojoExecutor.ensureDependenciesAreResolved (MojoExecutor.java:248)
  550. at org.apache.maven.lifecycle.internal.MojoExecutor.execute (MojoExecutor.java:202)
  551. at org.apache.maven.lifecycle.internal.MojoExecutor.execute (MojoExecutor.java:156)
  552. at org.apache.maven.lifecycle.internal.MojoExecutor.execute (MojoExecutor.java:148)
  553. at org.apache.maven.lifecycle.internal.LifecycleModuleBuilder.buildProject (LifecycleModuleBuilder.java:117)
  554. at org.apache.maven.lifecycle.internal.LifecycleModuleBuilder.buildProject (LifecycleModuleBuilder.java:81)
  555. at org.apache.maven.lifecycle.internal.builder.singlethreaded.SingleThreadedBuilder.build (SingleThreadedBuilder.java:56)
  556. at org.apache.maven.lifecycle.internal.LifecycleStarter.execute (LifecycleStarter.java:128)
  557. at org.apache.maven.DefaultMaven.doExecute (DefaultMaven.java:305)
  558. at org.apache.maven.DefaultMaven.doExecute (DefaultMaven.java:192)
  559. at org.apache.maven.DefaultMaven.execute (DefaultMaven.java:105)
  560. at org.apache.maven.cli.MavenCli.execute (MavenCli.java:956)
  561. at org.apache.maven.cli.MavenCli.doMain (MavenCli.java:288)
  562. at org.apache.maven.cli.MavenCli.main (MavenCli.java:192)
  563. at sun.reflect.NativeMethodAccessorImpl.invoke0 (Native Method)
  564. at sun.reflect.NativeMethodAccessorImpl.invoke (NativeMethodAccessorImpl.java:62)
  565. at sun.reflect.DelegatingMethodAccessorImpl.invoke (DelegatingMethodAccessorImpl.java:43)
  566. at java.lang.reflect.Method.invoke (Method.java:498)
  567. at org.codehaus.plexus.classworlds.launcher.Launcher.launchEnhanced (Launcher.java:289)
  568. at org.codehaus.plexus.classworlds.launcher.Launcher.launch (Launcher.java:229)
  569. at org.codehaus.plexus.classworlds.launcher.Launcher.mainWithExitCode (Launcher.java:415)
  570. at org.codehaus.plexus.classworlds.launcher.Launcher.main (Launcher.java:356)
  571. Caused by: org.apache.maven.project.DependencyResolutionException: Could not resolve dependencies for project org.openmrs.contrib:uitestframework:jar:2.4.0-SNAPSHOT: Could not transfer artifact com.sun.jmx:jmxri:jar:1.2.1 from/to openmrs-repo (http://mavenrepo.openmrs.org/nexus/content/repositories/public): Connection reset
  572. at org.apache.maven.project.DefaultProjectDependenciesResolver.resolve (DefaultProjectDependenciesResolver.java:209)
  573. at org.apache.maven.lifecycle.internal.LifecycleDependencyResolver.getDependencies (LifecycleDependencyResolver.java:243)
  574. at org.apache.maven.lifecycle.internal.LifecycleDependencyResolver.resolveProjectDependencies (LifecycleDependencyResolver.java:147)
  575. at org.apache.maven.lifecycle.internal.MojoExecutor.ensureDependenciesAreResolved (MojoExecutor.java:248)
  576. at org.apache.maven.lifecycle.internal.MojoExecutor.execute (MojoExecutor.java:202)
  577. at org.apache.maven.lifecycle.internal.MojoExecutor.execute (MojoExecutor.java:156)
  578. at org.apache.maven.lifecycle.internal.MojoExecutor.execute (MojoExecutor.java:148)
  579. at org.apache.maven.lifecycle.internal.LifecycleModuleBuilder.buildProject (LifecycleModuleBuilder.java:117)
  580. at org.apache.maven.lifecycle.internal.LifecycleModuleBuilder.buildProject (LifecycleModuleBuilder.java:81)
  581. at org.apache.maven.lifecycle.internal.builder.singlethreaded.SingleThreadedBuilder.build (SingleThreadedBuilder.java:56)
  582. at org.apache.maven.lifecycle.internal.LifecycleStarter.execute (LifecycleStarter.java:128)
  583. at org.apache.maven.DefaultMaven.doExecute (DefaultMaven.java:305)
  584. at org.apache.maven.DefaultMaven.doExecute (DefaultMaven.java:192)
  585. at org.apache.maven.DefaultMaven.execute (DefaultMaven.java:105)
  586. at org.apache.maven.cli.MavenCli.execute (MavenCli.java:956)
  587. at org.apache.maven.cli.MavenCli.doMain (MavenCli.java:288)
  588. at org.apache.maven.cli.MavenCli.main (MavenCli.java:192)
  589. at sun.reflect.NativeMethodAccessorImpl.invoke0 (Native Method)
  590. at sun.reflect.NativeMethodAccessorImpl.invoke (NativeMethodAccessorImpl.java:62)
  591. at sun.reflect.DelegatingMethodAccessorImpl.invoke (DelegatingMethodAccessorImpl.java:43)
  592. at java.lang.reflect.Method.invoke (Method.java:498)
  593. at org.codehaus.plexus.classworlds.launcher.Launcher.launchEnhanced (Launcher.java:289)
  594. at org.codehaus.plexus.classworlds.launcher.Launcher.launch (Launcher.java:229)
  595. at org.codehaus.plexus.classworlds.launcher.Launcher.mainWithExitCode (Launcher.java:415)
  596. at org.codehaus.plexus.classworlds.launcher.Launcher.main (Launcher.java:356)
  597. Caused by: org.eclipse.aether.resolution.DependencyResolutionException: Could not transfer artifact com.sun.jmx:jmxri:jar:1.2.1 from/to openmrs-repo (http://mavenrepo.openmrs.org/nexus/content/repositories/public): Connection reset
  598. at org.eclipse.aether.internal.impl.DefaultRepositorySystem.resolveDependencies (DefaultRepositorySystem.java:342)
  599. at org.apache.maven.project.DefaultProjectDependenciesResolver.resolve (DefaultProjectDependenciesResolver.java:202)
  600. at org.apache.maven.lifecycle.internal.LifecycleDependencyResolver.getDependencies (LifecycleDependencyResolver.java:243)
  601. at org.apache.maven.lifecycle.internal.LifecycleDependencyResolver.resolveProjectDependencies (LifecycleDependencyResolver.java:147)
  602. at org.apache.maven.lifecycle.internal.MojoExecutor.ensureDependenciesAreResolved (MojoExecutor.java:248)
  603. at org.apache.maven.lifecycle.internal.MojoExecutor.execute (MojoExecutor.java:202)
  604. at org.apache.maven.lifecycle.internal.MojoExecutor.execute (MojoExecutor.java:156)
  605. at org.apache.maven.lifecycle.internal.MojoExecutor.execute (MojoExecutor.java:148)
  606. at org.apache.maven.lifecycle.internal.LifecycleModuleBuilder.buildProject (LifecycleModuleBuilder.java:117)
  607. at org.apache.maven.lifecycle.internal.LifecycleModuleBuilder.buildProject (LifecycleModuleBuilder.java:81)
  608. at org.apache.maven.lifecycle.internal.builder.singlethreaded.SingleThreadedBuilder.build (SingleThreadedBuilder.java:56)
  609. at org.apache.maven.lifecycle.internal.LifecycleStarter.execute (LifecycleStarter.java:128)
  610. at org.apache.maven.DefaultMaven.doExecute (DefaultMaven.java:305)
  611. at org.apache.maven.DefaultMaven.doExecute (DefaultMaven.java:192)
  612. at org.apache.maven.DefaultMaven.execute (DefaultMaven.java:105)
  613. at org.apache.maven.cli.MavenCli.execute (MavenCli.java:956)
  614. at org.apache.maven.cli.MavenCli.doMain (MavenCli.java:288)
  615. at org.apache.maven.cli.MavenCli.main (MavenCli.java:192)
  616. at sun.reflect.NativeMethodAccessorImpl.invoke0 (Native Method)
  617. at sun.reflect.NativeMethodAccessorImpl.invoke (NativeMethodAccessorImpl.java:62)
  618. at sun.reflect.DelegatingMethodAccessorImpl.invoke (DelegatingMethodAccessorImpl.java:43)
  619. at java.lang.reflect.Method.invoke (Method.java:498)
  620. at org.codehaus.plexus.classworlds.launcher.Launcher.launchEnhanced (Launcher.java:289)
  621. at org.codehaus.plexus.classworlds.launcher.Launcher.launch (Launcher.java:229)
  622. at org.codehaus.plexus.classworlds.launcher.Launcher.mainWithExitCode (Launcher.java:415)
  623. at org.codehaus.plexus.classworlds.launcher.Launcher.main (Launcher.java:356)
  624. Caused by: org.eclipse.aether.resolution.ArtifactResolutionException: Could not transfer artifact com.sun.jmx:jmxri:jar:1.2.1 from/to openmrs-repo (http://mavenrepo.openmrs.org/nexus/content/repositories/public): Connection reset
  625. at org.eclipse.aether.internal.impl.DefaultArtifactResolver.resolve (DefaultArtifactResolver.java:413)
  626. at org.eclipse.aether.internal.impl.DefaultArtifactResolver.resolveArtifacts (DefaultArtifactResolver.java:215)
  627. at org.eclipse.aether.internal.impl.DefaultRepositorySystem.resolveDependencies (DefaultRepositorySystem.java:325)
  628. at org.apache.maven.project.DefaultProjectDependenciesResolver.resolve (DefaultProjectDependenciesResolver.java:202)
  629. at org.apache.maven.lifecycle.internal.LifecycleDependencyResolver.getDependencies (LifecycleDependencyResolver.java:243)
  630. at org.apache.maven.lifecycle.internal.LifecycleDependencyResolver.resolveProjectDependencies (LifecycleDependencyResolver.java:147)
  631. at org.apache.maven.lifecycle.internal.MojoExecutor.ensureDependenciesAreResolved (MojoExecutor.java:248)
  632. at org.apache.maven.lifecycle.internal.MojoExecutor.execute (MojoExecutor.java:202)
  633. at org.apache.maven.lifecycle.internal.MojoExecutor.execute (MojoExecutor.java:156)
  634. at org.apache.maven.lifecycle.internal.MojoExecutor.execute (MojoExecutor.java:148)
  635. at org.apache.maven.lifecycle.internal.LifecycleModuleBuilder.buildProject (LifecycleModuleBuilder.java:117)
  636. at org.apache.maven.lifecycle.internal.LifecycleModuleBuilder.buildProject (LifecycleModuleBuilder.java:81)
  637. at org.apache.maven.lifecycle.internal.builder.singlethreaded.SingleThreadedBuilder.build (SingleThreadedBuilder.java:56)
  638. at org.apache.maven.lifecycle.internal.LifecycleStarter.execute (LifecycleStarter.java:128)
  639. at org.apache.maven.DefaultMaven.doExecute (DefaultMaven.java:305)
  640. at org.apache.maven.DefaultMaven.doExecute (DefaultMaven.java:192)
  641. at org.apache.maven.DefaultMaven.execute (DefaultMaven.java:105)
  642. at org.apache.maven.cli.MavenCli.execute (MavenCli.java:956)
  643. at org.apache.maven.cli.MavenCli.doMain (MavenCli.java:288)
  644. at org.apache.maven.cli.MavenCli.main (MavenCli.java:192)
  645. at sun.reflect.NativeMethodAccessorImpl.invoke0 (Native Method)
  646. at sun.reflect.NativeMethodAccessorImpl.invoke (NativeMethodAccessorImpl.java:62)
  647. at sun.reflect.DelegatingMethodAccessorImpl.invoke (DelegatingMethodAccessorImpl.java:43)
  648. at java.lang.reflect.Method.invoke (Method.java:498)
  649. at org.codehaus.plexus.classworlds.launcher.Launcher.launchEnhanced (Launcher.java:289)
  650. at org.codehaus.plexus.classworlds.launcher.Launcher.launch (Launcher.java:229)
  651. at org.codehaus.plexus.classworlds.launcher.Launcher.mainWithExitCode (Launcher.java:415)
  652. at org.codehaus.plexus.classworlds.launcher.Launcher.main (Launcher.java:356)
  653. Caused by: org.eclipse.aether.transfer.ArtifactTransferException: Could not transfer artifact com.sun.jmx:jmxri:jar:1.2.1 from/to openmrs-repo (http://mavenrepo.openmrs.org/nexus/content/repositories/public): Connection reset
  654. at org.eclipse.aether.connector.basic.ArtifactTransportListener.transferFailed (ArtifactTransportListener.java:52)
  655. at org.eclipse.aether.connector.basic.BasicRepositoryConnector$TaskRunner.run (BasicRepositoryConnector.java:368)
  656. at org.eclipse.aether.util.concurrency.RunnableErrorForwarder$1.run (RunnableErrorForwarder.java:75)
  657. at org.eclipse.aether.connector.basic.BasicRepositoryConnector$DirectExecutor.execute (BasicRepositoryConnector.java:642)
  658. at org.eclipse.aether.connector.basic.BasicRepositoryConnector.get (BasicRepositoryConnector.java:262)
  659. at org.eclipse.aether.internal.impl.DefaultArtifactResolver.performDownloads (DefaultArtifactResolver.java:489)
  660. at org.eclipse.aether.internal.impl.DefaultArtifactResolver.resolve (DefaultArtifactResolver.java:390)
  661. at org.eclipse.aether.internal.impl.DefaultArtifactResolver.resolveArtifacts (DefaultArtifactResolver.java:215)
  662. at org.eclipse.aether.internal.impl.DefaultRepositorySystem.resolveDependencies (DefaultRepositorySystem.java:325)
  663. at org.apache.maven.project.DefaultProjectDependenciesResolver.resolve (DefaultProjectDependenciesResolver.java:202)
  664. at org.apache.maven.lifecycle.internal.LifecycleDependencyResolver.getDependencies (LifecycleDependencyResolver.java:243)
  665. at org.apache.maven.lifecycle.internal.LifecycleDependencyResolver.resolveProjectDependencies (LifecycleDependencyResolver.java:147)
  666. at org.apache.maven.lifecycle.internal.MojoExecutor.ensureDependenciesAreResolved (MojoExecutor.java:248)
  667. at org.apache.maven.lifecycle.internal.MojoExecutor.execute (MojoExecutor.java:202)
  668. at org.apache.maven.lifecycle.internal.MojoExecutor.execute (MojoExecutor.java:156)
  669. at org.apache.maven.lifecycle.internal.MojoExecutor.execute (MojoExecutor.java:148)
  670. at org.apache.maven.lifecycle.internal.LifecycleModuleBuilder.buildProject (LifecycleModuleBuilder.java:117)
  671. at org.apache.maven.lifecycle.internal.LifecycleModuleBuilder.buildProject (LifecycleModuleBuilder.java:81)
  672. at org.apache.maven.lifecycle.internal.builder.singlethreaded.SingleThreadedBuilder.build (SingleThreadedBuilder.java:56)
  673. at org.apache.maven.lifecycle.internal.LifecycleStarter.execute (LifecycleStarter.java:128)
  674. at org.apache.maven.DefaultMaven.doExecute (DefaultMaven.java:305)
  675. at org.apache.maven.DefaultMaven.doExecute (DefaultMaven.java:192)
  676. at org.apache.maven.DefaultMaven.execute (DefaultMaven.java:105)
  677. at org.apache.maven.cli.MavenCli.execute (MavenCli.java:956)
  678. at org.apache.maven.cli.MavenCli.doMain (MavenCli.java:288)
  679. at org.apache.maven.cli.MavenCli.main (MavenCli.java:192)
  680. at sun.reflect.NativeMethodAccessorImpl.invoke0 (Native Method)
  681. at sun.reflect.NativeMethodAccessorImpl.invoke (NativeMethodAccessorImpl.java:62)
  682. at sun.reflect.DelegatingMethodAccessorImpl.invoke (DelegatingMethodAccessorImpl.java:43)
  683. at java.lang.reflect.Method.invoke (Method.java:498)
  684. at org.codehaus.plexus.classworlds.launcher.Launcher.launchEnhanced (Launcher.java:289)
  685. at org.codehaus.plexus.classworlds.launcher.Launcher.launch (Launcher.java:229)
  686. at org.codehaus.plexus.classworlds.launcher.Launcher.mainWithExitCode (Launcher.java:415)
  687. at org.codehaus.plexus.classworlds.launcher.Launcher.main (Launcher.java:356)
  688. Caused by: org.apache.maven.wagon.TransferFailedException: Connection reset
  689. at org.apache.maven.wagon.providers.http.wagon.shared.AbstractHttpClientWagon.fillInputData (AbstractHttpClientWagon.java:1082)
  690. at org.apache.maven.wagon.providers.http.wagon.shared.AbstractHttpClientWagon.fillInputData (AbstractHttpClientWagon.java:976)
  691. at org.apache.maven.wagon.StreamWagon.getInputStream (StreamWagon.java:126)
  692. at org.apache.maven.wagon.StreamWagon.getIfNewer (StreamWagon.java:88)
  693. at org.apache.maven.wagon.StreamWagon.get (StreamWagon.java:61)
  694. at org.eclipse.aether.transport.wagon.WagonTransporter$GetTaskRunner.run (WagonTransporter.java:567)
  695. at org.eclipse.aether.transport.wagon.WagonTransporter.execute (WagonTransporter.java:435)
  696. at org.eclipse.aether.transport.wagon.WagonTransporter.get (WagonTransporter.java:412)
  697. at org.eclipse.aether.connector.basic.BasicRepositoryConnector$GetTaskRunner.runTask (BasicRepositoryConnector.java:456)
  698. at org.eclipse.aether.connector.basic.BasicRepositoryConnector$TaskRunner.run (BasicRepositoryConnector.java:363)
  699. at org.eclipse.aether.util.concurrency.RunnableErrorForwarder$1.run (RunnableErrorForwarder.java:75)
  700. at org.eclipse.aether.connector.basic.BasicRepositoryConnector$DirectExecutor.execute (BasicRepositoryConnector.java:642)
  701. at org.eclipse.aether.connector.basic.BasicRepositoryConnector.get (BasicRepositoryConnector.java:262)
  702. at org.eclipse.aether.internal.impl.DefaultArtifactResolver.performDownloads (DefaultArtifactResolver.java:489)
  703. at org.eclipse.aether.internal.impl.DefaultArtifactResolver.resolve (DefaultArtifactResolver.java:390)
  704. at org.eclipse.aether.internal.impl.DefaultArtifactResolver.resolveArtifacts (DefaultArtifactResolver.java:215)
  705. at org.eclipse.aether.internal.impl.DefaultRepositorySystem.resolveDependencies (DefaultRepositorySystem.java:325)
  706. at org.apache.maven.project.DefaultProjectDependenciesResolver.resolve (DefaultProjectDependenciesResolver.java:202)
  707. at org.apache.maven.lifecycle.internal.LifecycleDependencyResolver.getDependencies (LifecycleDependencyResolver.java:243)
  708. at org.apache.maven.lifecycle.internal.LifecycleDependencyResolver.resolveProjectDependencies (LifecycleDependencyResolver.java:147)
  709. at org.apache.maven.lifecycle.internal.MojoExecutor.ensureDependenciesAreResolved (MojoExecutor.java:248)
  710. at org.apache.maven.lifecycle.internal.MojoExecutor.execute (MojoExecutor.java:202)
  711. at org.apache.maven.lifecycle.internal.MojoExecutor.execute (MojoExecutor.java:156)
  712. at org.apache.maven.lifecycle.internal.MojoExecutor.execute (MojoExecutor.java:148)
  713. at org.apache.maven.lifecycle.internal.LifecycleModuleBuilder.buildProject (LifecycleModuleBuilder.java:117)
  714. at org.apache.maven.lifecycle.internal.LifecycleModuleBuilder.buildProject (LifecycleModuleBuilder.java:81)
  715. at org.apache.maven.lifecycle.internal.builder.singlethreaded.SingleThreadedBuilder.build (SingleThreadedBuilder.java:56)
  716. at org.apache.maven.lifecycle.internal.LifecycleStarter.execute (LifecycleStarter.java:128)
  717. at org.apache.maven.DefaultMaven.doExecute (DefaultMaven.java:305)
  718. at org.apache.maven.DefaultMaven.doExecute (DefaultMaven.java:192)
  719. at org.apache.maven.DefaultMaven.execute (DefaultMaven.java:105)
  720. at org.apache.maven.cli.MavenCli.execute (MavenCli.java:956)
  721. at org.apache.maven.cli.MavenCli.doMain (MavenCli.java:288)
  722. at org.apache.maven.cli.MavenCli.main (MavenCli.java:192)
  723. at sun.reflect.NativeMethodAccessorImpl.invoke0 (Native Method)
  724. at sun.reflect.NativeMethodAccessorImpl.invoke (NativeMethodAccessorImpl.java:62)
  725. at sun.reflect.DelegatingMethodAccessorImpl.invoke (DelegatingMethodAccessorImpl.java:43)
  726. at java.lang.reflect.Method.invoke (Method.java:498)
  727. at org.codehaus.plexus.classworlds.launcher.Launcher.launchEnhanced (Launcher.java:289)
  728. at org.codehaus.plexus.classworlds.launcher.Launcher.launch (Launcher.java:229)
  729. at org.codehaus.plexus.classworlds.launcher.Launcher.mainWithExitCode (Launcher.java:415)
  730. at org.codehaus.plexus.classworlds.launcher.Launcher.main (Launcher.java:356)
  731. Caused by: javax.net.ssl.SSLException: Connection reset
  732. at sun.security.ssl.Alert.createSSLException (Alert.java:127)
  733. at sun.security.ssl.TransportContext.fatal (TransportContext.java:324)
  734. at sun.security.ssl.TransportContext.fatal (TransportContext.java:267)
  735. at sun.security.ssl.TransportContext.fatal (TransportContext.java:262)
  736. at sun.security.ssl.SSLTransport.decode (SSLTransport.java:135)
  737. at sun.security.ssl.SSLSocketImpl.decode (SSLSocketImpl.java:1143)
  738. at sun.security.ssl.SSLSocketImpl.readHandshakeRecord (SSLSocketImpl.java:1054)
  739. at sun.security.ssl.SSLSocketImpl.startHandshake (SSLSocketImpl.java:394)
  740. at org.apache.maven.wagon.providers.http.httpclient.conn.ssl.SSLConnectionSocketFactory.createLayeredSocket (SSLConnectionSocketFactory.java:396)
  741. at org.apache.maven.wagon.providers.http.httpclient.conn.ssl.SSLConnectionSocketFactory.connectSocket (SSLConnectionSocketFactory.java:355)
  742. at org.apache.maven.wagon.providers.http.httpclient.impl.conn.DefaultHttpClientConnectionOperator.connect (DefaultHttpClientConnectionOperator.java:142)
  743. at org.apache.maven.wagon.providers.http.httpclient.impl.conn.PoolingHttpClientConnectionManager.connect (PoolingHttpClientConnectionManager.java:359)
  744. at org.apache.maven.wagon.providers.http.httpclient.impl.execchain.MainClientExec.establishRoute (MainClientExec.java:381)
  745. at org.apache.maven.wagon.providers.http.httpclient.impl.execchain.MainClientExec.execute (MainClientExec.java:237)
  746. at org.apache.maven.wagon.providers.http.httpclient.impl.execchain.ProtocolExec.execute (ProtocolExec.java:185)
  747. at org.apache.maven.wagon.providers.http.httpclient.impl.execchain.RetryExec.execute (RetryExec.java:89)
  748. at org.apache.maven.wagon.providers.http.httpclient.impl.execchain.RedirectExec.execute (RedirectExec.java:111)
  749. at org.apache.maven.wagon.providers.http.httpclient.impl.client.InternalHttpClient.doExecute (InternalHttpClient.java:185)
  750. at org.apache.maven.wagon.providers.http.httpclient.impl.client.CloseableHttpClient.execute (CloseableHttpClient.java:83)
  751. at org.apache.maven.wagon.providers.http.wagon.shared.AbstractHttpClientWagon.execute (AbstractHttpClientWagon.java:838)
  752. at org.apache.maven.wagon.providers.http.wagon.shared.AbstractHttpClientWagon.fillInputData (AbstractHttpClientWagon.java:999)
  753. at org.apache.maven.wagon.providers.http.wagon.shared.AbstractHttpClientWagon.fillInputData (AbstractHttpClientWagon.java:976)
  754. at org.apache.maven.wagon.StreamWagon.getInputStream (StreamWagon.java:126)
  755. at org.apache.maven.wagon.StreamWagon.getIfNewer (StreamWagon.java:88)
  756. at org.apache.maven.wagon.StreamWagon.get (StreamWagon.java:61)
  757. at org.eclipse.aether.transport.wagon.WagonTransporter$GetTaskRunner.run (WagonTransporter.java:567)
  758. at org.eclipse.aether.transport.wagon.WagonTransporter.execute (WagonTransporter.java:435)
  759. at org.eclipse.aether.transport.wagon.WagonTransporter.get (WagonTransporter.java:412)
  760. at org.eclipse.aether.connector.basic.BasicRepositoryConnector$GetTaskRunner.runTask (BasicRepositoryConnector.java:456)
  761. at org.eclipse.aether.connector.basic.BasicRepositoryConnector$TaskRunner.run (BasicRepositoryConnector.java:363)
  762. at org.eclipse.aether.util.concurrency.RunnableErrorForwarder$1.run (RunnableErrorForwarder.java:75)
  763. at org.eclipse.aether.connector.basic.BasicRepositoryConnector$DirectExecutor.execute (BasicRepositoryConnector.java:642)
  764. at org.eclipse.aether.connector.basic.BasicRepositoryConnector.get (BasicRepositoryConnector.java:262)
  765. at org.eclipse.aether.internal.impl.DefaultArtifactResolver.performDownloads (DefaultArtifactResolver.java:489)
  766. at org.eclipse.aether.internal.impl.DefaultArtifactResolver.resolve (DefaultArtifactResolver.java:390)
  767. at org.eclipse.aether.internal.impl.DefaultArtifactResolver.resolveArtifacts (DefaultArtifactResolver.java:215)
  768. at org.eclipse.aether.internal.impl.DefaultRepositorySystem.resolveDependencies (DefaultRepositorySystem.java:325)
  769. at org.apache.maven.project.DefaultProjectDependenciesResolver.resolve (DefaultProjectDependenciesResolver.java:202)
  770. at org.apache.maven.lifecycle.internal.LifecycleDependencyResolver.getDependencies (LifecycleDependencyResolver.java:243)
  771. at org.apache.maven.lifecycle.internal.LifecycleDependencyResolver.resolveProjectDependencies (LifecycleDependencyResolver.java:147)
  772. at org.apache.maven.lifecycle.internal.MojoExecutor.ensureDependenciesAreResolved (MojoExecutor.java:248)
  773. at org.apache.maven.lifecycle.internal.MojoExecutor.execute (MojoExecutor.java:202)
  774. at org.apache.maven.lifecycle.internal.MojoExecutor.execute (MojoExecutor.java:156)
  775. at org.apache.maven.lifecycle.internal.MojoExecutor.execute (MojoExecutor.java:148)
  776. at org.apache.maven.lifecycle.internal.LifecycleModuleBuilder.buildProject (LifecycleModuleBuilder.java:117)
  777. at org.apache.maven.lifecycle.internal.LifecycleModuleBuilder.buildProject (LifecycleModuleBuilder.java:81)
  778. at org.apache.maven.lifecycle.internal.builder.singlethreaded.SingleThreadedBuilder.build (SingleThreadedBuilder.java:56)
  779. at org.apache.maven.lifecycle.internal.LifecycleStarter.execute (LifecycleStarter.java:128)
  780. at org.apache.maven.DefaultMaven.doExecute (DefaultMaven.java:305)
  781. at org.apache.maven.DefaultMaven.doExecute (DefaultMaven.java:192)
  782. at org.apache.maven.DefaultMaven.execute (DefaultMaven.java:105)
  783. at org.apache.maven.cli.MavenCli.execute (MavenCli.java:956)
  784. at org.apache.maven.cli.MavenCli.doMain (MavenCli.java:288)
  785. at org.apache.maven.cli.MavenCli.main (MavenCli.java:192)
  786. at sun.reflect.NativeMethodAccessorImpl.invoke0 (Native Method)
  787. at sun.reflect.NativeMethodAccessorImpl.invoke (NativeMethodAccessorImpl.java:62)
  788. at sun.reflect.DelegatingMethodAccessorImpl.invoke (DelegatingMethodAccessorImpl.java:43)
  789. at java.lang.reflect.Method.invoke (Method.java:498)
  790. at org.codehaus.plexus.classworlds.launcher.Launcher.launchEnhanced (Launcher.java:289)
  791. at org.codehaus.plexus.classworlds.launcher.Launcher.launch (Launcher.java:229)
  792. at org.codehaus.plexus.classworlds.launcher.Launcher.mainWithExitCode (Launcher.java:415)
  793. at org.codehaus.plexus.classworlds.launcher.Launcher.main (Launcher.java:356)
  794. Caused by: java.net.SocketException: Connection reset
  795. at java.net.SocketInputStream.read (SocketInputStream.java:210)
  796. at java.net.SocketInputStream.read (SocketInputStream.java:141)
  797. at sun.security.ssl.SSLSocketInputRecord.read (SSLSocketInputRecord.java:457)
  798. at sun.security.ssl.SSLSocketInputRecord.decode (SSLSocketInputRecord.java:165)
  799. at sun.security.ssl.SSLTransport.decode (SSLTransport.java:108)
  800. at sun.security.ssl.SSLSocketImpl.decode (SSLSocketImpl.java:1143)
  801. at sun.security.ssl.SSLSocketImpl.readHandshakeRecord (SSLSocketImpl.java:1054)
  802. at sun.security.ssl.SSLSocketImpl.startHandshake (SSLSocketImpl.java:394)
  803. at org.apache.maven.wagon.providers.http.httpclient.conn.ssl.SSLConnectionSocketFactory.createLayeredSocket (SSLConnectionSocketFactory.java:396)
  804. at org.apache.maven.wagon.providers.http.httpclient.conn.ssl.SSLConnectionSocketFactory.connectSocket (SSLConnectionSocketFactory.java:355)
  805. at org.apache.maven.wagon.providers.http.httpclient.impl.conn.DefaultHttpClientConnectionOperator.connect (DefaultHttpClientConnectionOperator.java:142)
  806. at org.apache.maven.wagon.providers.http.httpclient.impl.conn.PoolingHttpClientConnectionManager.connect (PoolingHttpClientConnectionManager.java:359)
  807. at org.apache.maven.wagon.providers.http.httpclient.impl.execchain.MainClientExec.establishRoute (MainClientExec.java:381)
  808. at org.apache.maven.wagon.providers.http.httpclient.impl.execchain.MainClientExec.execute (MainClientExec.java:237)
  809. at org.apache.maven.wagon.providers.http.httpclient.impl.execchain.ProtocolExec.execute (ProtocolExec.java:185)
  810. at org.apache.maven.wagon.providers.http.httpclient.impl.execchain.RetryExec.execute (RetryExec.java:89)
  811. at org.apache.maven.wagon.providers.http.httpclient.impl.execchain.RedirectExec.execute (RedirectExec.java:111)
  812. at org.apache.maven.wagon.providers.http.httpclient.impl.client.InternalHttpClient.doExecute (InternalHttpClient.java:185)
  813. at org.apache.maven.wagon.providers.http.httpclient.impl.client.CloseableHttpClient.execute (CloseableHttpClient.java:83)
  814. at org.apache.maven.wagon.providers.http.wagon.shared.AbstractHttpClientWagon.execute (AbstractHttpClientWagon.java:838)
  815. at org.apache.maven.wagon.providers.http.wagon.shared.AbstractHttpClientWagon.fillInputData (AbstractHttpClientWagon.java:999)
  816. at org.apache.maven.wagon.providers.http.wagon.shared.AbstractHttpClientWagon.fillInputData (AbstractHttpClientWagon.java:976)
  817. at org.apache.maven.wagon.StreamWagon.getInputStream (StreamWagon.java:126)
  818. at org.apache.maven.wagon.StreamWagon.getIfNewer (StreamWagon.java:88)
  819. at org.apache.maven.wagon.StreamWagon.get (StreamWagon.java:61)
  820. at org.eclipse.aether.transport.wagon.WagonTransporter$GetTaskRunner.run (WagonTransporter.java:567)
  821. at org.eclipse.aether.transport.wagon.WagonTransporter.execute (WagonTransporter.java:435)
  822. at org.eclipse.aether.transport.wagon.WagonTransporter.get (WagonTransporter.java:412)
  823. at org.eclipse.aether.connector.basic.BasicRepositoryConnector$GetTaskRunner.runTask (BasicRepositoryConnector.java:456)
  824. at org.eclipse.aether.connector.basic.BasicRepositoryConnector$TaskRunner.run (BasicRepositoryConnector.java:363)
  825. at org.eclipse.aether.util.concurrency.RunnableErrorForwarder$1.run (RunnableErrorForwarder.java:75)
  826. at org.eclipse.aether.connector.basic.BasicRepositoryConnector$DirectExecutor.execute (BasicRepositoryConnector.java:642)
  827. at org.eclipse.aether.connector.basic.BasicRepositoryConnector.get (BasicRepositoryConnector.java:262)
  828. at org.eclipse.aether.internal.impl.DefaultArtifactResolver.performDownloads (DefaultArtifactResolver.java:489)
  829. at org.eclipse.aether.internal.impl.DefaultArtifactResolver.resolve (DefaultArtifactResolver.java:390)
  830. at org.eclipse.aether.internal.impl.DefaultArtifactResolver.resolveArtifacts (DefaultArtifactResolver.java:215)
  831. at org.eclipse.aether.internal.impl.DefaultRepositorySystem.resolveDependencies (DefaultRepositorySystem.java:325)
  832. at org.apache.maven.project.DefaultProjectDependenciesResolver.resolve (DefaultProjectDependenciesResolver.java:202)
  833. at org.apache.maven.lifecycle.internal.LifecycleDependencyResolver.getDependencies (LifecycleDependencyResolver.java:243)
  834. at org.apache.maven.lifecycle.internal.LifecycleDependencyResolver.resolveProjectDependencies (LifecycleDependencyResolver.java:147)
  835. at org.apache.maven.lifecycle.internal.MojoExecutor.ensureDependenciesAreResolved (MojoExecutor.java:248)
  836. at org.apache.maven.lifecycle.internal.MojoExecutor.execute (MojoExecutor.java:202)
  837. at org.apache.maven.lifecycle.internal.MojoExecutor.execute (MojoExecutor.java:156)
  838. at org.apache.maven.lifecycle.internal.MojoExecutor.execute (MojoExecutor.java:148)
  839. at org.apache.maven.lifecycle.internal.LifecycleModuleBuilder.buildProject (LifecycleModuleBuilder.java:117)
  840. at org.apache.maven.lifecycle.internal.LifecycleModuleBuilder.buildProject (LifecycleModuleBuilder.java:81)
  841. at org.apache.maven.lifecycle.internal.builder.singlethreaded.SingleThreadedBuilder.build (SingleThreadedBuilder.java:56)
  842. at org.apache.maven.lifecycle.internal.LifecycleStarter.execute (LifecycleStarter.java:128)
  843. at org.apache.maven.DefaultMaven.doExecute (DefaultMaven.java:305)
  844. at org.apache.maven.DefaultMaven.doExecute (DefaultMaven.java:192)
  845. at org.apache.maven.DefaultMaven.execute (DefaultMaven.java:105)
  846. at org.apache.maven.cli.MavenCli.execute (MavenCli.java:956)
  847. at org.apache.maven.cli.MavenCli.doMain (MavenCli.java:288)
  848. at org.apache.maven.cli.MavenCli.main (MavenCli.java:192)
  849. at sun.reflect.NativeMethodAccessorImpl.invoke0 (Native Method)
  850. at sun.reflect.NativeMethodAccessorImpl.invoke (NativeMethodAccessorImpl.java:62)
  851. at sun.reflect.DelegatingMethodAccessorImpl.invoke (DelegatingMethodAccessorImpl.java:43)
  852. at java.lang.reflect.Method.invoke (Method.java:498)
  853. at org.codehaus.plexus.classworlds.launcher.Launcher.launchEnhanced (Launcher.java:289)
  854. at org.codehaus.plexus.classworlds.launcher.Launcher.launch (Launcher.java:229)
  855. at org.codehaus.plexus.classworlds.launcher.Launcher.mainWithExitCode (Launcher.java:415)
  856. at org.codehaus.plexus.classworlds.launcher.Launcher.main (Launcher.java:356)
  857. [ERROR]
  858. [ERROR]
  859. [ERROR] For more information about the errors and possible solutions, please read the following articles:
  860. [ERROR] [Help 1] http://cwiki.apache.org/confluence/display/MAVEN/DependencyResolutionException
  861. irynah@irynah-Vostro-3560:/media/irynah/DATA/0NEW-108G/0PROJECTS/OpenMRS-projects/openmrs-contrib-uitestframework$
  862.  
Add Comment
Please, Sign In to add comment