G2A Many GEOs
SHARE
TWEET

Untitled

a guest Dec 24th, 2019 64 Never
Not a member of Pastebin yet? Sign Up, it unlocks many cool features!
  1. Found 5.5.1 via distributionUrl
  2. Running /opt/gradle/versions/5.5.1/bin/gradle assembleRelease
  3. > Task :preBuild UP-TO-DATE
  4. > Task :preReleaseBuild
  5. > Task :compileReleaseAidl NO-SOURCE
  6. > Task :compileReleaseRenderscript NO-SOURCE
  7. > Task :checkReleaseManifest
  8. > Task :generateReleaseBuildConfig
  9. > Task :prepareLintJar
  10. > Task :generateReleaseSources
  11. > Task :javaPreCompileRelease
  12. > Task :mainApkListPersistenceRelease
  13. > Task :generateReleaseResValues
  14. > Task :generateReleaseResources
  15. > Task :mergeReleaseResources
  16. > Task :createReleaseCompatibleScreenManifests
  17. > Task :processReleaseManifest
  18. > Task :processReleaseResources
  19.  
  20. > Task :compileReleaseJavaWithJavac
  21. /home/vagrant/build/net.minetest.minetest/build/android/src/main/java/net.minetest.minetest/MinetestAssetCopy.java:99: error: non-static method getAssets() cannot be referenced from a static context
  22.                 InputStream src = getAssets().open(filename);
  23.                                   ^
  24. /home/vagrant/build/net.minetest.minetest/build/android/src/main/java/net.minetest.minetest/MinetestAssetCopy.java:156: error: non-static variable m_ProgressBar cannot be referenced from a static context
  25.             m_ProgressBar.setMax(m_tocopy.size());
  26.             ^
  27. /home/vagrant/build/net.minetest.minetest/build/android/src/main/java/net.minetest.minetest/MinetestAssetCopy.java:177: error: non-static method getAssets() cannot be referenced from a static context
  28.                         src = getAssets().open(filename);
  29.                               ^
  30. /home/vagrant/build/net.minetest.minetest/build/android/src/main/java/net.minetest.minetest/MinetestAssetCopy.java:204: error: non-static method getAssets() cannot be referenced from a static context
  31.                             src = getAssets().open(filename);
  32.                                   ^
  33. /home/vagrant/build/net.minetest.minetest/build/android/src/main/java/net.minetest.minetest/MinetestAssetCopy.java:254: error: non-static variable m_ProgressBar cannot be referenced from a static context
  34.                 m_ProgressBar.setProgress(progress[0]);
  35.                 ^
  36. /home/vagrant/build/net.minetest.minetest/build/android/src/main/java/net.minetest.minetest/MinetestAssetCopy.java:255: error: non-static variable m_Filename cannot be referenced from a static context
  37.                 m_Filename.setText(todisplay);
  38.                 ^
  39. /home/vagrant/build/net.minetest.minetest/build/android/src/main/java/net.minetest.minetest/MinetestAssetCopy.java:260: error: non-static variable m_Filename cannot be referenced from a static context
  40.                 m_Filename.setText(full_text);
  41.                 ^
  42. /home/vagrant/build/net.minetest.minetest/build/android/src/main/java/net.minetest.minetest/MinetestAssetCopy.java:307: error: non-static method getAssets() cannot be referenced from a static context
  43.                         AssetFileDescriptor fd = getAssets().openFd(current_path);
  44.                                                  ^
  45. /home/vagrant/build/net.minetest.minetest/build/android/src/main/java/net.minetest.minetest/MinetestAssetCopy.java:336: error: non-static method getAssets() cannot be referenced from a static context
  46.                 InputStream is = getAssets().open("index.txt");
  47.                                  ^
  48. /home/vagrant/build/net.minetest.minetest/build/android/src/main/java/net.minetest.minetest/MinetestAssetCopy.java:357: error: non-static method getAssets() cannot be referenced from a static context
  49.                 InputStream is = getAssets().open("filelist.txt");
  50.                                  ^
  51. /home/vagrant/build/net.minetest.minetest/build/android/src/main/java/net.minetest.minetest/MinetestAssetCopy.java:374: error: non-static method finish() cannot be referenced from a static context
  52.             finish();
  53.             ^
  54. Note: /home/vagrant/build/net.minetest.minetest/build/android/src/main/java/net.minetest.minetest/MinetestAssetCopy.java uses or overrides a deprecated API.
  55. Note: Recompile with -Xlint:deprecation for details.
  56. 11 errors
  57.  
  58. > Task :compileReleaseJavaWithJavac FAILED
  59.  
  60. FAILURE: Build failed with an exception.
  61.  
  62. * What went wrong:
  63. Execution failed for task ':compileReleaseJavaWithJavac'.
  64. > Compilation failed; see the compiler error output for details.
  65.  
  66. * Try:
  67. Run with --stacktrace option to get the stack trace. Run with --info or --debug option to get more log output. Run with --scan to get full insights.
  68.  
  69. * Get more help at https://help.gradle.org
  70.  
  71. Deprecated Gradle features were used in this build, making it incompatible with Gradle 6.0.
  72. Use '--warning-mode all' to show the individual deprecation warnings.
  73. See https://docs.gradle.org/5.5.1/userguide/command_line_interface.html#sec:command_line_warnings
  74.  
  75. BUILD FAILED in 9s
  76. 12 actionable tasks: 12 executed
  77. Makefile:687: recipe for target 'apk' failed
  78. make[1]: *** [apk] Error 1
  79. make[1]: Leaving directory '/home/vagrant/build/net.minetest.minetest/build/android'
  80. Makefile:156: recipe for target 'release' failed
  81. make: *** [release] Error 2
  82. ==== detail end ====
  83. DEBUG: Error encoutered, stopping by user request.
RAW Paste Data
Ledger Nano X - The secure hardware wallet
We use cookies for various purposes including analytics. By continuing to use Pastebin, you agree to our use of cookies as described in the Cookies Policy. OK, I Understand
Top