Advertisement
Guest User

Untitled

a guest
Jun 22nd, 2022
18
Never
Not a member of Pastebin yet? Sign Up, it unlocks many cool features!
  1. [1/1] Planning build
  2. Building for debugging...
  3. [1/4] Emitting module ZIPFoundation
  4. [4/6] Emitting module Test
  5. error: link command failed with exit code 1 (use -v to see invocation)
  6. /usr/bin/ld.gold: error: cannot find -lstdc++
  7. /usr/libexec/swift/lib/swift_static/linux/libswiftCore.a(AnyHashableSupport.cpp.o):function std::pair<(anonymous namespace)::HashableConformanceEntry*, unsigned int> swift::ConcurrentReadableHashMap<(anonymous namespace)::HashableConformanceEntry, swift::StaticMutex>::find<(anonymous namespace)::HashableConformanceKey>((anonymous namespace)::HashableConformanceKey const&, swift::ConcurrentReadableHashMap<(anonymous namespace)::HashableConformanceEntry, swift::StaticMutex>::IndexStorage, unsigned long, (anonymous namespace)::HashableConformanceEntry*): error: undefined reference to '__cxa_guard_acquire'
  8. /usr/libexec/swift/lib/swift_static/linux/libswiftCore.a(AnyHashableSupport.cpp.o):function std::pair<(anonymous namespace)::HashableConformanceEntry*, unsigned int> swift::ConcurrentReadableHashMap<(anonymous namespace)::HashableConformanceEntry, swift::StaticMutex>::find<(anonymous namespace)::HashableConformanceKey>((anonymous namespace)::HashableConformanceKey const&, swift::ConcurrentReadableHashMap<(anonymous namespace)::HashableConformanceEntry, swift::StaticMutex>::IndexStorage, unsigned long, (anonymous namespace)::HashableConformanceEntry*): error: undefined reference to '__cxa_guard_release'
  9. /usr/libexec/swift/lib/swift_static/linux/libswiftCore.a(AnyHashableSupport.cpp.o):function swift::ConcurrentReadableHashMap<(anonymous namespace)::HashableConformanceEntry, swift::StaticMutex>::resize(swift::ConcurrentReadableHashMap<(anonymous namespace)::HashableConformanceEntry, swift::StaticMutex>::IndexStorage, unsigned char, (anonymous namespace)::HashableConformanceEntry*): error: undefined reference to '__cxa_guard_acquire'
  10. /usr/libexec/swift/lib/swift_static/linux/libswiftCore.a(AnyHashableSupport.cpp.o):function swift::ConcurrentReadableHashMap<(anonymous namespace)::HashableConformanceEntry, swift::StaticMutex>::resize(swift::ConcurrentReadableHashMap<(anonymous namespace)::HashableConformanceEntry, swift::StaticMutex>::IndexStorage, unsigned char, (anonymous namespace)::HashableConformanceEntry*): error: undefined reference to '__cxa_guard_release'
  11. /usr/libexec/swift/lib/swift_static/linux/libswiftCore.a(Casting.cpp.o):function swift::nameForMetadata[abi:cxx11](swift::TargetMetadata<swift::InProcess> const*, bool): error: undefined reference to 'std::__cxx11::basic_string<char, std::char_traits<char>, std::allocator<char> >::_M_replace(unsigned long, unsigned long, char const*, unsigned long)'
  12. /usr/libexec/swift/lib/swift_static/linux/libswiftCore.a(Casting.cpp.o):function swift::nameForMetadata[abi:cxx11](swift::TargetMetadata<swift::InProcess> const*, bool): error: undefined reference to 'operator delete(void*)'
  13. /usr/libexec/swift/lib/swift_static/linux/libswiftCore.a(Casting.cpp.o):function swift_getTypeName: error: undefined reference to 'std::__once_callable'
  14. /usr/libexec/swift/lib/swift_static/linux/libswiftCore.a(Casting.cpp.o):function swift_getTypeName: error: undefined reference to 'std::__once_call'
  15. /usr/libexec/swift/lib/swift_static/linux/libswiftCore.a(Casting.cpp.o):function swift_getTypeName: error: undefined reference to '__once_proxy'
  16. /usr/libexec/swift/lib/swift_static/linux/libswiftCore.a(Casting.cpp.o):function swift_getTypeName: error: undefined reference to 'std::__once_callable'
  17. /usr/libexec/swift/lib/swift_static/linux/libswiftCore.a(Casting.cpp.o):function swift_getTypeName: error: undefined reference to 'std::__once_call'
  18. /usr/libexec/swift/lib/swift_static/linux/libswiftCore.a(Casting.cpp.o):function swift_getTypeName: error: undefined reference to 'operator delete(void*)'
  19. /usr/libexec/swift/lib/swift_static/linux/libswiftCore.a(Casting.cpp.o):function swift_getTypeName: error: undefined reference to 'std::__throw_system_error(int)'
  20. /usr/libexec/swift/lib/swift_static/linux/libswiftCore.a(Casting.cpp.o):function swift_getMangledTypeName: error: undefined reference to 'std::__once_callable'
  21. /usr/libexec/swift/lib/swift_static/linux/libswiftCore.a(Casting.cpp.o):function swift_getMangledTypeName: error: undefined reference to 'std::__once_call'
  22. /usr/libexec/swift/lib/swift_static/linux/libswiftCore.a(Casting.cpp.o):function swift_getMangledTypeName: error: undefined reference to '__once_proxy'
  23. /usr/libexec/swift/lib/swift_static/linux/libswiftCore.a(Casting.cpp.o):function swift_getMangledTypeName: error: undefined reference to 'std::__once_callable'
  24. /usr/libexec/swift/lib/swift_static/linux/libswiftCore.a(Casting.cpp.o):function swift_getMangledTypeName: error: undefined reference to 'std::__once_call'
  25. /usr/libexec/swift/lib/swift_static/linux/libswiftCore.a(Casting.cpp.o):function swift_getMangledTypeName: error: undefined reference to 'std::__cxx11::basic_string<char, std::char_traits<char>, std::allocator<char> >::_M_create(unsigned long&, unsigned long)'
  26. /usr/libexec/swift/lib/swift_static/linux/libswiftCore.a(Casting.cpp.o):function swift_getMangledTypeName: error: undefined reference to 'operator delete(void*)'
  27. /usr/libexec/swift/lib/swift_static/linux/libswiftCore.a(Casting.cpp.o):function swift_getMangledTypeName: error: undefined reference to 'operator delete(void*)'
  28. /usr/libexec/swift/lib/swift_static/linux/libswiftCore.a(Casting.cpp.o):function swift_getMangledTypeName: error: undefined reference to 'std::__throw_system_error(int)'
  29. /usr/libexec/swift/lib/swift_static/linux/libswiftCore.a(Casting.cpp.o):function $ss36_getBridgedNonVerbatimObjectiveCTypeyypXpSgxmlF: error: undefined reference to '__cxa_guard_acquire'
  30. /usr/libexec/swift/lib/swift_static/linux/libswiftCore.a(Casting.cpp.o):function $ss36_getBridgedNonVerbatimObjectiveCTypeyypXpSgxmlF: error: undefined reference to '__cxa_guard_release'
  31. /usr/libexec/swift/lib/swift_static/linux/libswiftCore.a(Casting.cpp.o):function $ss33_isBridgedNonVerbatimToObjectiveCySbxmlF: error: undefined reference to '__cxa_guard_acquire'
  32. /usr/libexec/swift/lib/swift_static/linux/libswiftCore.a(Casting.cpp.o):function $ss33_isBridgedNonVerbatimToObjectiveCySbxmlF: error: undefined reference to '__cxa_guard_release'
  33. /usr/libexec/swift/lib/swift_static/linux/libswiftCore.a(Errors.cpp.o):function swift::dumpStackTraceEntry(unsigned int, void*, bool): error: undefined reference to 'std::__cxx11::basic_string<char, std::char_traits<char>, std::allocator<char> >::_M_replace(unsigned long, unsigned long, char const*, unsigned long)'
  34. /usr/libexec/swift/lib/swift_static/linux/libswiftCore.a(Errors.cpp.o):function swift::dumpStackTraceEntry(unsigned int, void*, bool): error: undefined reference to '__cxa_demangle'
  35. /usr/libexec/swift/lib/swift_static/linux/libswiftCore.a(Errors.cpp.o):function swift::dumpStackTraceEntry(unsigned int, void*, bool): error: undefined reference to 'std::__cxx11::basic_string<char, std::char_traits<char>, std::allocator<char> >::_M_append(char const*, unsigned long)'
  36. /usr/libexec/swift/lib/swift_static/linux/libswiftCore.a(Errors.cpp.o):function swift::dumpStackTraceEntry(unsigned int, void*, bool): error: undefined reference to 'std::__throw_length_error(char const*)'
  37. /usr/libexec/swift/lib/swift_static/linux/libswiftCore.a(Errors.cpp.o):function swift::withCurrentBacktrace(std::function<void (void**, int)>): error: undefined reference to 'std::__throw_bad_function_call()'
  38. /usr/libexec/swift/lib/swift_static/linux/libswiftCore.a(Metadata.cpp.o):function swift::MetadataAllocator::Allocate(unsigned long, unsigned long): error: undefined reference to '__once_proxy'
  39. /usr/libexec/swift/lib/swift_static/linux/libswiftCore.a(Metadata.cpp.o):function swift::MetadataAllocator::Allocate(unsigned long, unsigned long): error: undefined reference to '__once_proxy'
  40. /usr/libexec/swift/lib/swift_static/linux/libswiftCore.a(Metadata.cpp.o):function swift::MetadataAllocator::Allocate(unsigned long, unsigned long): error: undefined reference to 'operator new[](unsigned long)'
  41. /usr/libexec/swift/lib/swift_static/linux/libswiftCore.a(Metadata.cpp.o):function swift::MetadataAllocator::Allocate(unsigned long, unsigned long): error: undefined reference to 'operator delete[](void*)'
  42. /usr/libexec/swift/lib/swift_static/linux/libswiftCore.a(Metadata.cpp.o):function swift::MetadataAllocator::Allocate(unsigned long, unsigned long): error: undefined reference to 'std::__throw_system_error(int)'
  43. /usr/libexec/swift/lib/swift_static/linux/libswiftCore.a(Metadata.cpp.o):function getCache(swift::TargetTypeContextDescriptor<swift::InProcess> const&): error: undefined reference to 'std::__throw_system_error(int)'
  44. /usr/libexec/swift/lib/swift_static/linux/libswiftCore.a(Metadata.cpp.o):function _swift_getGenericMetadata(swift::MetadataRequest, void const* const*, swift::TargetTypeContextDescriptor<swift::InProcess> const*): error: undefined reference to 'operator new(unsigned long)'
  45. /usr/libexec/swift/lib/swift_static/linux/libswiftCore.a(Metadata.cpp.o):function swift_getSingletonMetadata: error: undefined reference to 'operator new(unsigned long)'
  46. /usr/libexec/swift/lib/swift_static/linux/libswiftCore.a(Metadata.cpp.o):function swift_getSingletonMetadata: error: undefined reference to 'operator new(unsigned long)'
  47. /usr/libexec/swift/lib/swift_static/linux/libswiftCore.a(Metadata.cpp.o):function swift::Lazy<(anonymous namespace)::SingletonTypeMetadataCache>::defaultInitCallback(void*): error: undefined reference to 'operator new(unsigned long)'
  48. /usr/libexec/swift/lib/swift_static/linux/libswiftCore.a(Metadata.cpp.o):function __swift::__runtime::llvm::StringRef::str[abi:cxx11]() const: error: undefined reference to 'std::__cxx11::basic_string<char, std::char_traits<char>, std::allocator<char> >::_M_create(unsigned long&, unsigned long)'
  49. /usr/libexec/swift/lib/swift_static/linux/libswiftCore.a(Metadata.cpp.o):function swift::blockOnMetadataDependency(swift::MetadataDependency, swift::MetadataDependency): error: undefined reference to 'std::__throw_length_error(char const*)'
  50. /usr/libexec/swift/lib/swift_static/linux/libswiftCore.a(Metadata.cpp.o):function std::pair<std::__detail::_Node_iterator<swift::TargetMetadata<swift::InProcess> const*, true, false>, bool> std::_Hashtable<swift::TargetMetadata<swift::InProcess> const*, swift::TargetMetadata<swift::InProcess> const*, std::allocator<swift::TargetMetadata<swift::InProcess> const*>, std::__detail::_Identity, std::equal_to<swift::TargetMetadata<swift::InProcess> const*>, std::hash<swift::TargetMetadata<swift::InProcess> const*>, std::__detail::_Mod_range_hashing, std::__detail::_Default_ranged_hash, std::__detail::_Prime_rehash_policy, std::__detail::_Hashtable_traits<false, true, true> >::_M_insert_unique<swift::TargetMetadata<swift::InProcess> const* const&, swift::TargetMetadata<swift::InProcess> const* const&, std::__detail::_AllocNode<std::allocator<std::__detail::_Hash_node<swift::TargetMetadata<swift::InProcess> const*, false> > > >(swift::TargetMetadata<swift::InProcess> const* const&, swift::TargetMetadata<swift::InProcess> const* const&, std::__detail::_AllocNode<std::allocator<std::__detail::_Hash_node<swift::TargetMetadata<swift::InProcess> const*, false> > > const&): error: undefined reference to 'std::__detail::_Prime_rehash_policy::_M_need_rehash(unsigned long, unsigned long, unsigned long) const'
  51. /usr/libexec/swift/lib/swift_static/linux/libswiftCore.a(Metadata.cpp.o):function std::_Hashtable<swift::TargetMetadata<swift::InProcess> const*, swift::TargetMetadata<swift::InProcess> const*, std::allocator<swift::TargetMetadata<swift::InProcess> const*>, std::__detail::_Identity, std::equal_to<swift::TargetMetadata<swift::InProcess> const*>, std::hash<swift::TargetMetadata<swift::InProcess> const*>, std::__detail::_Mod_range_hashing, std::__detail::_Default_ranged_hash, std::__detail::_Prime_rehash_policy, std::__detail::_Hashtable_traits<false, true, true> >::_M_rehash_aux(unsigned long, std::integral_constant<bool, true>): error: undefined reference to 'std::__throw_bad_array_new_length()'
  52. /usr/libexec/swift/lib/swift_static/linux/libswiftCore.a(Metadata.cpp.o):function std::_Hashtable<swift::TargetMetadata<swift::InProcess> const*, swift::TargetMetadata<swift::InProcess> const*, std::allocator<swift::TargetMetadata<swift::InProcess> const*>, std::__detail::_Identity, std::equal_to<swift::TargetMetadata<swift::InProcess> const*>, std::hash<swift::TargetMetadata<swift::InProcess> const*>, std::__detail::_Mod_range_hashing, std::__detail::_Default_ranged_hash, std::__detail::_Prime_rehash_policy, std::__detail::_Hashtable_traits<false, true, true> >::_M_rehash_aux(unsigned long, std::integral_constant<bool, true>): error: undefined reference to 'std::__throw_bad_alloc()'
  53. /usr/libexec/swift/lib/swift_static/linux/libswiftCore.a(Metadata.cpp.o):function diagnoseMetadataDependencyCycle(__swift::__runtime::llvm::ArrayRef<swift::MetadataDependency>): error: undefined reference to 'std::__cxx11::basic_string<char, std::char_traits<char>, std::allocator<char> >::_M_create(unsigned long&, unsigned long)'
  54. /usr/libexec/swift/lib/swift_static/linux/libswiftCore.a(Metadata.cpp.o):function diagnoseMetadataDependencyCycle(__swift::__runtime::llvm::ArrayRef<swift::MetadataDependency>): error: undefined reference to 'std::__cxx11::basic_string<char, std::char_traits<char>, std::allocator<char> >::_M_append(char const*, unsigned long)'
  55. /usr/libexec/swift/lib/swift_static/linux/libswiftCore.a(Metadata.cpp.o):function diagnoseMetadataDependencyCycle(__swift::__runtime::llvm::ArrayRef<swift::MetadataDependency>): error: undefined reference to 'std::__cxx11::basic_string<char, std::char_traits<char>, std::allocator<char> >::_M_append(char const*, unsigned long)'
  56. /usr/libexec/swift/lib/swift_static/linux/libswiftCore.a(Metadata.cpp.o):function diagnoseMetadataDependencyCycle(__swift::__runtime::llvm::ArrayRef<swift::MetadataDependency>): error: undefined reference to 'std::__throw_length_error(char const*)'
  57. /usr/libexec/swift/lib/swift_static/linux/libswiftCore.a(Metadata.cpp.o):function diagnoseMetadataDependencyCycle(__swift::__runtime::llvm::ArrayRef<swift::MetadataDependency>): error: undefined reference to 'std::__cxx11::basic_string<char, std::char_traits<char>, std::allocator<char> >::_M_append(char const*, unsigned long)'
  58. /usr/libexec/swift/lib/swift_static/linux/libswiftCore.a(Metadata.cpp.o):function __swift::__runtime::llvm::toHex[abi:cxx11](__swift::__runtime::llvm::StringRef, bool): error: undefined reference to 'std::__cxx11::basic_string<char, std::char_traits<char>, std::allocator<char> >::reserve(unsigned long)'
  59. /usr/libexec/swift/lib/swift_static/linux/libswiftCore.a(Metadata.cpp.o):function __swift::__runtime::llvm::toHex[abi:cxx11](__swift::__runtime::llvm::StringRef, bool): error: undefined reference to 'std::__cxx11::basic_string<char, std::char_traits<char>, std::allocator<char> >::_M_mutate(unsigned long, unsigned long, char const*, unsigned long)'
  60. /usr/libexec/swift/lib/swift_static/linux/libswiftCore.a(Metadata.cpp.o):function __swift::__runtime::llvm::toHex[abi:cxx11](__swift::__runtime::llvm::StringRef, bool): error: undefined reference to 'std::__cxx11::basic_string<char, std::char_traits<char>, std::allocator<char> >::_M_mutate(unsigned long, unsigned long, char const*, unsigned long)'
  61. /usr/libexec/swift/lib/swift_static/linux/libswiftCore.a(MetadataLookup.cpp.o):function swift::Demangle::__runtime::TypeDecoder<(anonymous namespace)::DecodedMetadataBuilder>::decodeMangledType(swift::Demangle::__runtime::Node*, unsigned int, bool): error: undefined reference to 'std::__cxx11::basic_string<char, std::char_traits<char>, std::allocator<char> >::_M_replace_aux(unsigned long, unsigned long, unsigned long, char)'
  62. /usr/libexec/swift/lib/swift_static/linux/libswiftCore.a(MetadataLookup.cpp.o):function swift::Demangle::__runtime::TypeDecoder<(anonymous namespace)::DecodedMetadataBuilder>::decodeMangledType(swift::Demangle::__runtime::Node*, unsigned int, bool): error: undefined reference to 'std::__cxx11::basic_string<char, std::char_traits<char>, std::allocator<char> >::append(char const*, unsigned long)'
  63. /usr/libexec/swift/lib/swift_static/linux/libswiftCore.a(MetadataLookup.cpp.o):function swift::Demangle::__runtime::TypeDecoder<(anonymous namespace)::DecodedMetadataBuilder>::decodeMangledType(swift::Demangle::__runtime::Node*, unsigned int, bool): error: undefined reference to 'std::__cxx11::basic_string<char, std::char_traits<char>, std::allocator<char> >::_M_mutate(unsigned long, unsigned long, char const*, unsigned long)'
  64. /usr/libexec/swift/lib/swift_static/linux/libswiftCore.a(MetadataLookup.cpp.o):function swift::Demangle::__runtime::TypeDecoder<(anonymous namespace)::DecodedMetadataBuilder>::decodeMangledType(swift::Demangle::__runtime::Node*, unsigned int, bool): error: undefined reference to 'std::__throw_length_error(char const*)'
  65. /usr/libexec/swift/lib/swift_static/linux/libswiftCore.a(MetadataLookup.cpp.o):function swift::Demangle::__runtime::TypeDecoder<(anonymous namespace)::DecodedMetadataBuilder>::decodeMangledProtocolType(swift::Demangle::__runtime::Node*, unsigned int): error: undefined reference to 'std::__cxx11::basic_string<char, std::char_traits<char>, std::allocator<char> >::_M_create(unsigned long&, unsigned long)'
  66. /usr/libexec/swift/lib/swift_static/linux/libswiftCore.a(MetadataLookup.cpp.o):function swift::TypeLookupError::TypeLookupError<_gatherGenericParameters(swift::TargetContextDescriptor<swift::InProcess> const*, __swift::__runtime::llvm::ArrayRef<swift::TargetMetadata<swift::InProcess> const*>, swift::TargetMetadata<swift::InProcess> const*, __swift::__runtime::llvm::SmallVectorImpl<unsigned int>&, __swift::__runtime::llvm::SmallVectorImpl<void const*>&, swift::Demangle::__runtime::Demangler&)::$_20>(_gatherGenericParameters(swift::TargetContextDescriptor<swift::InProcess> const*, __swift::__runtime::llvm::ArrayRef<swift::TargetMetadata<swift::InProcess> const*>, swift::TargetMetadata<swift::InProcess> const*, __swift::__runtime::llvm::SmallVectorImpl<unsigned int>&, __swift::__runtime::llvm::SmallVectorImpl<void const*>&, swift::Demangle::__runtime::Demangler&)::$_20 const&)::{lambda(void*, swift::TypeLookupError::Command, void*)#1}::__invoke(void*, swift::TypeLookupError::Command, void*): error: undefined reference to 'std::__cxx11::basic_string<char, std::char_traits<char>, std::allocator<char> >::_M_construct(unsigned long, char)'
  67. /usr/libexec/swift/lib/swift_static/linux/libswiftCore.a(MetadataLookup.cpp.o):function swift::TypeLookupError::TypeLookupError<_gatherGenericParameters(swift::TargetContextDescriptor<swift::InProcess> const*, __swift::__runtime::llvm::ArrayRef<swift::TargetMetadata<swift::InProcess> const*>, swift::TargetMetadata<swift::InProcess> const*, __swift::__runtime::llvm::SmallVectorImpl<unsigned int>&, __swift::__runtime::llvm::SmallVectorImpl<void const*>&, swift::Demangle::__runtime::Demangler&)::$_20>(_gatherGenericParameters(swift::TargetContextDescriptor<swift::InProcess> const*, __swift::__runtime::llvm::ArrayRef<swift::TargetMetadata<swift::InProcess> const*>, swift::TargetMetadata<swift::InProcess> const*, __swift::__runtime::llvm::SmallVectorImpl<unsigned int>&, __swift::__runtime::llvm::SmallVectorImpl<void const*>&, swift::Demangle::__runtime::Demangler&)::$_20 const&)::{lambda(void*, swift::TypeLookupError::Command, void*)#1}::__invoke(void*, swift::TypeLookupError::Command, void*): error: undefined reference to 'std::__cxx11::basic_string<char, std::char_traits<char>, std::allocator<char> >::_M_replace(unsigned long, unsigned long, char const*, unsigned long)'
  68. /usr/libexec/swift/lib/swift_static/linux/libswiftCore.a(MetadataLookup.cpp.o):function swift::TypeLookupError::TypeLookupError<_gatherGenericParameters(swift::TargetContextDescriptor<swift::InProcess> const*, __swift::__runtime::llvm::ArrayRef<swift::TargetMetadata<swift::InProcess> const*>, swift::TargetMetadata<swift::InProcess> const*, __swift::__runtime::llvm::SmallVectorImpl<unsigned int>&, __swift::__runtime::llvm::SmallVectorImpl<void const*>&, swift::Demangle::__runtime::Demangler&)::$_20>(_gatherGenericParameters(swift::TargetContextDescriptor<swift::InProcess> const*, __swift::__runtime::llvm::ArrayRef<swift::TargetMetadata<swift::InProcess> const*>, swift::TargetMetadata<swift::InProcess> const*, __swift::__runtime::llvm::SmallVectorImpl<unsigned int>&, __swift::__runtime::llvm::SmallVectorImpl<void const*>&, swift::Demangle::__runtime::Demangler&)::$_20 const&)::{lambda(void*, swift::TypeLookupError::Command, void*)#1}::__invoke(void*, swift::TypeLookupError::Command, void*): error: undefined reference to 'std::__cxx11::basic_string<char, std::char_traits<char>, std::allocator<char> >::_M_construct(unsigned long, char)'
  69. /usr/libexec/swift/lib/swift_static/linux/libswiftCore.a(MetadataLookup.cpp.o):function swift::TypeLookupError::TypeLookupError<_gatherGenericParameters(swift::TargetContextDescriptor<swift::InProcess> const*, __swift::__runtime::llvm::ArrayRef<swift::TargetMetadata<swift::InProcess> const*>, swift::TargetMetadata<swift::InProcess> const*, __swift::__runtime::llvm::SmallVectorImpl<unsigned int>&, __swift::__runtime::llvm::SmallVectorImpl<void const*>&, swift::Demangle::__runtime::Demangler&)::$_20>(_gatherGenericParameters(swift::TargetContextDescriptor<swift::InProcess> const*, __swift::__runtime::llvm::ArrayRef<swift::TargetMetadata<swift::InProcess> const*>, swift::TargetMetadata<swift::InProcess> const*, __swift::__runtime::llvm::SmallVectorImpl<unsigned int>&, __swift::__runtime::llvm::SmallVectorImpl<void const*>&, swift::Demangle::__runtime::Demangler&)::$_20 const&)::{lambda(void*, swift::TypeLookupError::Command, void*)#1}::__invoke(void*, swift::TypeLookupError::Command, void*): error: undefined reference to 'std::__cxx11::basic_string<char, std::char_traits<char>, std::allocator<char> >::_M_replace(unsigned long, unsigned long, char const*, unsigned long)'
  70. /usr/libexec/swift/lib/swift_static/linux/libswiftCore.a(MetadataLookup.cpp.o):function swift::TypeLookupError::TypeLookupError<_gatherGenericParameters(swift::TargetContextDescriptor<swift::InProcess> const*, __swift::__runtime::llvm::ArrayRef<swift::TargetMetadata<swift::InProcess> const*>, swift::TargetMetadata<swift::InProcess> const*, __swift::__runtime::llvm::SmallVectorImpl<unsigned int>&, __swift::__runtime::llvm::SmallVectorImpl<void const*>&, swift::Demangle::__runtime::Demangler&)::$_20>(_gatherGenericParameters(swift::TargetContextDescriptor<swift::InProcess> const*, __swift::__runtime::llvm::ArrayRef<swift::TargetMetadata<swift::InProcess> const*>, swift::TargetMetadata<swift::InProcess> const*, __swift::__runtime::llvm::SmallVectorImpl<unsigned int>&, __swift::__runtime::llvm::SmallVectorImpl<void const*>&, swift::Demangle::__runtime::Demangler&)::$_20 const&)::{lambda(void*, swift::TypeLookupError::Command, void*)#1}::__invoke(void*, swift::TypeLookupError::Command, void*): error: undefined reference to 'std::__cxx11::basic_string<char, std::char_traits<char>, std::allocator<char> >::_M_construct(unsigned long, char)'
  71. /usr/libexec/swift/lib/swift_static/linux/libswiftCore.a(MetadataLookup.cpp.o):function swift::TypeLookupError::TypeLookupError<_gatherGenericParameters(swift::TargetContextDescriptor<swift::InProcess> const*, __swift::__runtime::llvm::ArrayRef<swift::TargetMetadata<swift::InProcess> const*>, swift::TargetMetadata<swift::InProcess> const*, __swift::__runtime::llvm::SmallVectorImpl<unsigned int>&, __swift::__runtime::llvm::SmallVectorImpl<void const*>&, swift::Demangle::__runtime::Demangler&)::$_21>(_gatherGenericParameters(swift::TargetContextDescriptor<swift::InProcess> const*, __swift::__runtime::llvm::ArrayRef<swift::TargetMetadata<swift::InProcess> const*>, swift::TargetMetadata<swift::InProcess> const*, __swift::__runtime::llvm::SmallVectorImpl<unsigned int>&, __swift::__runtime::llvm::SmallVectorImpl<void const*>&, swift::Demangle::__runtime::Demangler&)::$_21 const&)::{lambda(void*, swift::TypeLookupError::Command, void*)#1}::__invoke(void*, swift::TypeLookupError::Command, void*): error: undefined reference to 'std::__cxx11::basic_string<char, std::char_traits<char>, std::allocator<char> >::_M_construct(unsigned long, char)'
  72. /usr/libexec/swift/lib/swift_static/linux/libswiftCore.a(MetadataLookup.cpp.o):function std::function<swift::TargetMetadata<swift::InProcess> const* (unsigned int, unsigned int)>::operator()(unsigned int, unsigned int) const: error: undefined reference to 'std::__throw_bad_function_call()'
  73. /usr/libexec/swift/lib/swift_static/linux/libswiftCore.a(Demangler.cpp.o):function swift::Demangle::__runtime::Demangler::demangleBridgedMethodParams[abi:cxx11](): error: undefined reference to 'std::__cxx11::basic_string<char, std::char_traits<char>, std::allocator<char> >::_M_mutate(unsigned long, unsigned long, char const*, unsigned long)'
  74. /usr/libexec/swift/lib/swift_static/linux/libswiftCore.a(NodePrinter.cpp.o):function (anonymous namespace)::NodePrinter::print(swift::Demangle::__runtime::Node*, unsigned int, bool): error: undefined reference to 'std::__cxx11::basic_string<char, std::char_traits<char>, std::allocator<char> >::basic_string(std::__cxx11::basic_string<char, std::char_traits<char>, std::allocator<char> > const&)'
  75. /usr/libexec/swift/lib/swift_static/linux/libswiftCore.a(NodePrinter.cpp.o):function (anonymous namespace)::NodePrinter::print(swift::Demangle::__runtime::Node*, unsigned int, bool): error: undefined reference to 'std::__throw_bad_function_call()'
  76. /usr/libexec/swift/lib/swift_static/linux/libswiftCore.a(NodePrinter.cpp.o):function std::function<std::__cxx11::basic_string<char, std::char_traits<char>, std::allocator<char> > (unsigned long, unsigned long)>::operator()(unsigned long, unsigned long) const: error: undefined reference to 'std::__throw_bad_function_call()'
  77. /usr/libexec/swift/lib/swift_static/linux/libswiftCore.a(Remangler.cpp.o):function std::pair<std::__detail::_Node_iterator<std::pair<swift::Demangle::__runtime::SubstitutionEntry const, unsigned int>, false, true>, bool> std::_Hashtable<swift::Demangle::__runtime::SubstitutionEntry, std::pair<swift::Demangle::__runtime::SubstitutionEntry const, unsigned int>, std::allocator<std::pair<swift::Demangle::__runtime::SubstitutionEntry const, unsigned int> >, std::__detail::_Select1st, std::equal_to<swift::Demangle::__runtime::SubstitutionEntry>, swift::Demangle::__runtime::SubstitutionEntry::Hasher, std::__detail::_Mod_range_hashing, std::__detail::_Default_ranged_hash, std::__detail::_Prime_rehash_policy, std::__detail::_Hashtable_traits<true, false, true> >::_M_emplace<std::pair<swift::Demangle::__runtime::SubstitutionEntry const, unsigned int> >(std::integral_constant<bool, true>, std::pair<swift::Demangle::__runtime::SubstitutionEntry const, unsigned int>&&): error: undefined reference to 'std::__detail::_Prime_rehash_policy::_M_need_rehash(unsigned long, unsigned long, unsigned long) const'
  78. /usr/libexec/swift/lib/swift_static/linux/libswiftCore.a(Remangler.cpp.o):function std::_Hashtable<swift::Demangle::__runtime::SubstitutionEntry, std::pair<swift::Demangle::__runtime::SubstitutionEntry const, unsigned int>, std::allocator<std::pair<swift::Demangle::__runtime::SubstitutionEntry const, unsigned int> >, std::__detail::_Select1st, std::equal_to<swift::Demangle::__runtime::SubstitutionEntry>, swift::Demangle::__runtime::SubstitutionEntry::Hasher, std::__detail::_Mod_range_hashing, std::__detail::_Default_ranged_hash, std::__detail::_Prime_rehash_policy, std::__detail::_Hashtable_traits<true, false, true> >::_M_rehash_aux(unsigned long, std::integral_constant<bool, true>): error: undefined reference to 'std::__throw_bad_array_new_length()'
  79. /usr/libexec/swift/lib/swift_static/linux/libswiftCore.a(Remangler.cpp.o):function std::_Hashtable<swift::Demangle::__runtime::SubstitutionEntry, std::pair<swift::Demangle::__runtime::SubstitutionEntry const, unsigned int>, std::allocator<std::pair<swift::Demangle::__runtime::SubstitutionEntry const, unsigned int> >, std::__detail::_Select1st, std::equal_to<swift::Demangle::__runtime::SubstitutionEntry>, swift::Demangle::__runtime::SubstitutionEntry::Hasher, std::__detail::_Mod_range_hashing, std::__detail::_Default_ranged_hash, std::__detail::_Prime_rehash_policy, std::__detail::_Hashtable_traits<true, false, true> >::_M_rehash_aux(unsigned long, std::integral_constant<bool, true>): error: undefined reference to 'std::__throw_bad_alloc()'
  80. /usr/libexec/swift/lib/swift_static/linux/libswiftCore.a(Stubs.cpp.o):function _swift_stdlib_getHardwareConcurrency: error: undefined reference to 'std::thread::hardware_concurrency()'
  81. /usr/libexec/swift/lib/swift_static/linux/libicui18nswift.a(umsg.ao):DW.ref.__gxx_personality_v0: error: undefined reference to '__gxx_personality_v0'
  82. /usr/libexec/swift/lib/swift_static/linux/libicui18nswift.a(unum.ao):function unum_clone_65_swift: error: undefined reference to '__dynamic_cast'
  83. /usr/libexec/swift/lib/swift_static/linux/libicui18nswift.a(unum.ao):function unum_clone_65_swift: error: undefined reference to '__dynamic_cast'
  84. /usr/libexec/swift/lib/swift_static/linux/libicui18nswift.a(unum.ao):function unum_getAttribute_65_swift: error: undefined reference to '__dynamic_cast'
  85. /usr/libexec/swift/lib/swift_static/linux/libicui18nswift.a(unum.ao):function unum_setAttribute_65_swift: error: undefined reference to '__dynamic_cast'
  86. /usr/libexec/swift/lib/swift_static/linux/libicui18nswift.a(decimfmt.ao):function __clang_call_terminate: error: undefined reference to '__cxa_begin_catch'
  87. /usr/libexec/swift/lib/swift_static/linux/libicui18nswift.a(decimfmt.ao):function __clang_call_terminate: error: undefined reference to 'std::terminate()'
  88. /usr/libexec/swift/lib/swift_static/linux/libicui18nswift.a(decimfmt.ao):typeinfo for icu_65_swift::DecimalFormat: error: undefined reference to 'vtable for __cxxabiv1::__si_class_type_info'
  89. /usr/bin/ld.gold: the vtable symbol may be undefined because the class is missing its key function
  90. /usr/libexec/swift/lib/swift_static/linux/libicui18nswift.a(dcfmtsym.ao):typeinfo for icu_65_swift::DecimalFormatSymbols: error: undefined reference to 'vtable for __cxxabiv1::__si_class_type_info'
  91. /usr/bin/ld.gold: the vtable symbol may be undefined because the class is missing its key function
  92. /usr/libexec/swift/lib/swift_static/linux/libicui18nswift.a(dcfmtsym.ao):typeinfo for icu_65_swift::(anonymous namespace)::DecFmtSymDataSink: error: undefined reference to 'vtable for __cxxabiv1::__si_class_type_info'
  93. /usr/bin/ld.gold: the vtable symbol may be undefined because the class is missing its key function
  94. /usr/libexec/swift/lib/swift_static/linux/libicui18nswift.a(dcfmtsym.ao):typeinfo for icu_65_swift::(anonymous namespace)::CurrencySpacingSink: error: undefined reference to 'vtable for __cxxabiv1::__si_class_type_info'
  95. /usr/bin/ld.gold: the vtable symbol may be undefined because the class is missing its key function
  96. /usr/libexec/swift/lib/swift_static/linux/libicui18nswift.a(rbnf.ao):vtable for icu_65_swift::LocalizationInfo: error: undefined reference to '__cxa_pure_virtual'
  97. /usr/libexec/swift/lib/swift_static/linux/libicui18nswift.a(rbnf.ao):vtable for icu_65_swift::LocalizationInfo: error: undefined reference to '__cxa_pure_virtual'
  98. /usr/libexec/swift/lib/swift_static/linux/libicui18nswift.a(rbnf.ao):vtable for icu_65_swift::LocalizationInfo: error: undefined reference to '__cxa_pure_virtual'
  99. /usr/libexec/swift/lib/swift_static/linux/libicui18nswift.a(rbnf.ao):vtable for icu_65_swift::LocalizationInfo: error: undefined reference to '__cxa_pure_virtual'
  100. /usr/libexec/swift/lib/swift_static/linux/libicui18nswift.a(rbnf.ao):typeinfo for icu_65_swift::UMemory: error: undefined reference to 'vtable for __cxxabiv1::__class_type_info'
  101. /usr/bin/ld.gold: the vtable symbol may be undefined because the class is missing its key function
  102. /usr/libexec/swift/lib/swift_static/linux/libicui18nswift.a(reldatefmt.ao):typeinfo for icu_65_swift::FormattedRelativeDateTime: error: undefined reference to 'vtable for __cxxabiv1::__vmi_class_type_info'
  103. /usr/bin/ld.gold: the vtable symbol may be undefined because the class is missing its key function
  104. /usr/libexec/swift/lib/swift_static/linux/libicui18nswift.a(number_affixutils.ao):typeinfo for icu_65_swift::number::impl::TokenConsumer: error: undefined reference to 'vtable for __cxxabiv1::__class_type_info'
  105. /usr/bin/ld.gold: the vtable symbol may be undefined because the class is missing its key function
  106. /usr/libexec/swift/lib/swift_static/linux/libicui18nswift.a(number_affixutils.ao):typeinfo for icu_65_swift::number::impl::SymbolProvider: error: undefined reference to 'vtable for __cxxabiv1::__class_type_info'
  107. /usr/bin/ld.gold: the vtable symbol may be undefined because the class is missing its key function
  108. /usr/libexec/swift/lib/swift_static/linux/libicui18nswift.a(number_decimalquantity.ao):typeinfo for icu_65_swift::IFixedDecimal: error: undefined reference to 'vtable for __cxxabiv1::__class_type_info'
  109. /usr/bin/ld.gold: the vtable symbol may be undefined because the class is missing its key function
  110. /usr/libexec/swift/lib/swift_static/linux/libicui18nswift.a(number_decimalquantity.ao):typeinfo for icu_65_swift::number::impl::DecimalQuantity: error: undefined reference to 'vtable for __cxxabiv1::__vmi_class_type_info'
  111. /usr/bin/ld.gold: the vtable symbol may be undefined because the class is missing its key function
  112. /usr/libexec/swift/lib/swift_static/linux/libicui18nswift.a(number_formatimpl.ao):typeinfo for icu_65_swift::number::impl::EmptyModifier: error: undefined reference to 'vtable for __cxxabiv1::__vmi_class_type_info'
  113. /usr/bin/ld.gold: the vtable symbol may be undefined because the class is missing its key function
  114. /usr/libexec/swift/lib/swift_static/linux/libicui18nswift.a(number_longnames.ao):typeinfo for icu_65_swift::number::impl::LongNameHandler: error: undefined reference to 'vtable for __cxxabiv1::__vmi_class_type_info'
  115. /usr/bin/ld.gold: the vtable symbol may be undefined because the class is missing its key function
  116. /usr/libexec/swift/lib/swift_static/linux/libicuucswift.a(umutex.ao):function icu_65_swift::umtx_init(): error: undefined reference to 'std::condition_variable::condition_variable()'
  117. /usr/libexec/swift/lib/swift_static/linux/libicuucswift.a(umutex.ao):function icu_65_swift::umtx_initImplPreInit(icu_65_swift::UInitOnce&): error: undefined reference to 'std::condition_variable::wait(std::unique_lock<std::mutex>&)'
  118. /usr/libexec/swift/lib/swift_static/linux/libicuucswift.a(umutex.ao):function icu_65_swift::umtx_initImplPostInit(icu_65_swift::UInitOnce&): error: undefined reference to 'std::condition_variable::notify_all()'
  119. /usr/libexec/swift/lib/swift_static/linux/libicuucswift.a(umutex.ao):function icu_65_swift::umtx_cleanup(): error: undefined reference to 'std::condition_variable::~condition_variable()'
  120. /usr/libexec/swift/lib/swift_static/linux/libicuucswift.a(unifiedcache.ao):function icu_65_swift::UnifiedCache::getInstance(UErrorCode&): error: undefined reference to 'std::condition_variable::condition_variable()'
  121. /usr/libexec/swift/lib/swift_static/linux/libicuucswift.a(unifiedcache.ao):function icu_65_swift::UnifiedCache::_putIfAbsentAndGet(icu_65_swift::CacheKeyBase const&, icu_65_swift::SharedObject const*&, UErrorCode&) const: error: undefined reference to 'std::condition_variable::notify_all()'
  122. /usr/libexec/swift/lib/swift_static/linux/libicuucswift.a(unifiedcache.ao):function icu_65_swift::UnifiedCache::_put(UHashElement const*, icu_65_swift::SharedObject const*, UErrorCode) const: error: undefined reference to 'std::condition_variable::notify_all()'
  123. /usr/libexec/swift/lib/swift_static/linux/libicuucswift.a(unifiedcache.ao):function icu_65_swift::UnifiedCache::_poll(icu_65_swift::CacheKeyBase const&, icu_65_swift::SharedObject const*&, UErrorCode&) const: error: undefined reference to 'std::condition_variable::wait(std::unique_lock<std::mutex>&)'
  124. /usr/libexec/swift/lib/swift_static/linux/libicuucswift.a(unifiedcache.ao):function unifiedcache_cleanup(): error: undefined reference to 'std::condition_variable::~condition_variable()'
  125. clang-13: error: linker command failed with exit code 1 (use -v to see invocation)
  126. [6/7] Linking Test
  127.  
Advertisement
RAW Paste Data Copied
Advertisement