diogogmt

openstack installation errors

Jan 22nd, 2013
107
0
Never
Not a member of Pastebin yet? Sign Up, it unlocks many cool features!
text 12.03 KB | None | 0 0
  1. root@senecacd-MS-7808:/home/senecacd# apt-get install keystone -y
  2. Reading package lists... Done
  3. Building dependency tree
  4. Reading state information... Done
  5. keystone is already the newest version.
  6. The following packages were automatically installed and are no longer required:
  7. linux-headers-3.2.0-29 linux-headers-3.2.0-29-generic
  8. Use 'apt-get autoremove' to remove them.
  9. 0 upgraded, 0 newly installed, 0 to remove and 0 not upgraded.
  10. 1 not fully installed or removed.
  11. After this operation, 0 B of additional disk space will be used.
  12. Setting up keystone (2012.1+stable~20120824-a16a0ab9-0ubuntu2.3) ...
  13. Traceback (most recent call last):
  14. File "/usr/local/bin/keystone-manage", line 5, in <module>
  15. pkg_resources.run_script('keystone==2012.1', 'keystone-manage')
  16. File "/usr/lib/python2.7/dist-packages/pkg_resources.py", line 499, in run_script
  17. self.require(requires)[0].run_script(script_name, ns)
  18. File "/usr/lib/python2.7/dist-packages/pkg_resources.py", line 1235, in run_script
  19. execfile(script_filename, namespace, namespace)
  20. File "/usr/local/lib/python2.7/dist-packages/keystone-2012.1-py2.7.egg/EGG-INFO/scripts/keystone-manage", line 28, in <module>
  21. cli.main(argv=sys.argv, config_files=config_files)
  22. File "/usr/local/lib/python2.7/dist-packages/keystone-2012.1-py2.7.egg/keystone/cli.py", line 148, in main
  23. return run(cmd, (args[:1] + args[2:]))
  24. File "/usr/local/lib/python2.7/dist-packages/keystone-2012.1-py2.7.egg/keystone/cli.py", line 134, in run
  25. return CMDS[cmd](argv=args).run()
  26. File "/usr/local/lib/python2.7/dist-packages/keystone-2012.1-py2.7.egg/keystone/cli.py", line 36, in run
  27. return self.main()
  28. File "/usr/local/lib/python2.7/dist-packages/keystone-2012.1-py2.7.egg/keystone/cli.py", line 55, in main
  29. driver = utils.import_object(getattr(CONF, k).driver)
  30. File "/usr/local/lib/python2.7/dist-packages/keystone-2012.1-py2.7.egg/keystone/common/utils.py", line 63, in import_object
  31. cls = import_class(import_str)
  32. File "/usr/local/lib/python2.7/dist-packages/keystone-2012.1-py2.7.egg/keystone/common/utils.py", line 50, in import_class
  33. __import__(mod_str)
  34. File "/usr/local/lib/python2.7/dist-packages/keystone-2012.1-py2.7.egg/keystone/identity/backends/sql.py", line 24, in <module>
  35. from keystone.common.sql import migration
  36. File "/usr/local/lib/python2.7/dist-packages/keystone-2012.1-py2.7.egg/keystone/common/sql/migration.py", line 24, in <module>
  37. from migrate.versioning import api as versioning_api
  38. File "/usr/local/lib/python2.7/dist-packages/sqlalchemy_migrate-0.7.2-py2.7.egg/migrate/versioning/api.py", line 33, in <module>
  39. from migrate.versioning import (repository, schema, version,
  40. File "/usr/local/lib/python2.7/dist-packages/sqlalchemy_migrate-0.7.2-py2.7.egg/migrate/versioning/schema.py", line 10, in <module>
  41. from sqlalchemy import exceptions as sa_exceptions
  42. ImportError: cannot import name exceptions
  43. dpkg: error processing keystone (--configure):
  44. subprocess installed post-installation script returned error exit status 1
  45. Errors were encountered while processing:
  46. keystone
  47. E: Sub-process /usr/bin/dpkg returned an error code (1)
  48.  
  49.  
  50.  
  51.  
  52.  
  53.  
  54.  
  55.  
  56.  
  57.  
  58.  
  59. Error 2:
  60.  
  61. root@senecacd-MS-7808:/home/senecacd# keystone-manage db_sync
  62. Traceback (most recent call last):
  63. File "/usr/local/bin/keystone-manage", line 5, in <module>
  64. pkg_resources.run_script('keystone==2012.1', 'keystone-manage')
  65. File "/usr/lib/python2.7/dist-packages/pkg_resources.py", line 499, in run_script
  66. self.require(requires)[0].run_script(script_name, ns)
  67. File "/usr/lib/python2.7/dist-packages/pkg_resources.py", line 1235, in run_script
  68. execfile(script_filename, namespace, namespace)
  69. File "/usr/local/lib/python2.7/dist-packages/keystone-2012.1-py2.7.egg/EGG-INFO/scripts/keystone-manage", line 28, in <module>
  70. cli.main(argv=sys.argv, config_files=config_files)
  71. File "/usr/local/lib/python2.7/dist-packages/keystone-2012.1-py2.7.egg/keystone/cli.py", line 148, in main
  72. return run(cmd, (args[:1] + args[2:]))
  73. File "/usr/local/lib/python2.7/dist-packages/keystone-2012.1-py2.7.egg/keystone/cli.py", line 134, in run
  74. return CMDS[cmd](argv=args).run()
  75. File "/usr/local/lib/python2.7/dist-packages/keystone-2012.1-py2.7.egg/keystone/cli.py", line 36, in run
  76. return self.main()
  77. File "/usr/local/lib/python2.7/dist-packages/keystone-2012.1-py2.7.egg/keystone/cli.py", line 55, in main
  78. driver = utils.import_object(getattr(CONF, k).driver)
  79. File "/usr/local/lib/python2.7/dist-packages/keystone-2012.1-py2.7.egg/keystone/common/utils.py", line 63, in import_object
  80. cls = import_class(import_str)
  81. File "/usr/local/lib/python2.7/dist-packages/keystone-2012.1-py2.7.egg/keystone/common/utils.py", line 50, in import_class
  82. __import__(mod_str)
  83. File "/usr/local/lib/python2.7/dist-packages/keystone-2012.1-py2.7.egg/keystone/identity/backends/sql.py", line 24, in <module>
  84. from keystone.common.sql import migration
  85. File "/usr/local/lib/python2.7/dist-packages/keystone-2012.1-py2.7.egg/keystone/common/sql/migration.py", line 24, in <module>
  86. from migrate.versioning import api as versioning_api
  87. File "/usr/local/lib/python2.7/dist-packages/sqlalchemy_migrate-0.7.2-py2.7.egg/migrate/versioning/api.py", line 33, in <module>
  88. from migrate.versioning import (repository, schema, version,
  89. File "/usr/local/lib/python2.7/dist-packages/sqlalchemy_migrate-0.7.2-py2.7.egg/migrate/versioning/schema.py", line 10, in <module>
  90. from sqlalchemy import exceptions as sa_exceptions
  91. ImportError: cannot import name exceptions
  92.  
  93.  
  94.  
  95.  
  96.  
  97.  
  98.  
  99.  
  100.  
  101.  
  102.  
  103.  
  104.  
  105.  
  106. Error 3:
  107.  
  108.  
  109. root@senecacd-MS-7808:/home/senecacd# apt-get install python-sqlalchemy
  110. Reading package lists... Done
  111. Building dependency tree
  112. Reading state information... Done
  113. python-sqlalchemy is already the newest version.
  114. The following packages were automatically installed and are no longer required:
  115. linux-headers-3.2.0-29 linux-headers-3.2.0-29-generic
  116. Use 'apt-get autoremove' to remove them.
  117. 0 upgraded, 0 newly installed, 0 to remove and 0 not upgraded.
  118. 1 not fully installed or removed.
  119. After this operation, 0 B of additional disk space will be used.
  120. Do you want to continue [Y/n]? y
  121. Setting up keystone (2012.1+stable~20120824-a16a0ab9-0ubuntu2.3) ...
  122. Traceback (most recent call last):
  123. File "/usr/local/bin/keystone-manage", line 5, in <module>
  124. pkg_resources.run_script('keystone==2012.1', 'keystone-manage')
  125. File "/usr/lib/python2.7/dist-packages/pkg_resources.py", line 499, in run_script
  126. self.require(requires)[0].run_script(script_name, ns)
  127. File "/usr/lib/python2.7/dist-packages/pkg_resources.py", line 1235, in run_script
  128. execfile(script_filename, namespace, namespace)
  129. File "/usr/local/lib/python2.7/dist-packages/keystone-2012.1-py2.7.egg/EGG-INFO/scripts/keystone-manage", line 28, in <module>
  130. cli.main(argv=sys.argv, config_files=config_files)
  131. File "/usr/local/lib/python2.7/dist-packages/keystone-2012.1-py2.7.egg/keystone/cli.py", line 148, in main
  132. return run(cmd, (args[:1] + args[2:]))
  133. File "/usr/local/lib/python2.7/dist-packages/keystone-2012.1-py2.7.egg/keystone/cli.py", line 134, in run
  134. return CMDS[cmd](argv=args).run()
  135. File "/usr/local/lib/python2.7/dist-packages/keystone-2012.1-py2.7.egg/keystone/cli.py", line 36, in run
  136. return self.main()
  137. File "/usr/local/lib/python2.7/dist-packages/keystone-2012.1-py2.7.egg/keystone/cli.py", line 55, in main
  138. driver = utils.import_object(getattr(CONF, k).driver)
  139. File "/usr/local/lib/python2.7/dist-packages/keystone-2012.1-py2.7.egg/keystone/common/utils.py", line 63, in import_object
  140. cls = import_class(import_str)
  141. File "/usr/local/lib/python2.7/dist-packages/keystone-2012.1-py2.7.egg/keystone/common/utils.py", line 50, in import_class
  142. __import__(mod_str)
  143. File "/usr/local/lib/python2.7/dist-packages/keystone-2012.1-py2.7.egg/keystone/identity/backends/sql.py", line 24, in <module>
  144. from keystone.common.sql import migration
  145. File "/usr/local/lib/python2.7/dist-packages/keystone-2012.1-py2.7.egg/keystone/common/sql/migration.py", line 24, in <module>
  146. from migrate.versioning import api as versioning_api
  147. File "/usr/local/lib/python2.7/dist-packages/sqlalchemy_migrate-0.7.2-py2.7.egg/migrate/versioning/api.py", line 33, in <module>
  148. from migrate.versioning import (repository, schema, version,
  149. File "/usr/local/lib/python2.7/dist-packages/sqlalchemy_migrate-0.7.2-py2.7.egg/migrate/versioning/schema.py", line 10, in <module>
  150. from sqlalchemy import exceptions as sa_exceptions
  151. ImportError: cannot import name exceptions
  152. dpkg: error processing keystone (--configure):
  153. subprocess installed post-installation script returned error exit status 1
  154. Errors were encountered while processing:
  155. keystone
  156. E: Sub-process /usr/bin/dpkg returned an error code (1)
  157. root@senecacd-MS-7808:/home/senecacd#
  158.  
  159.  
  160.  
  161.  
  162.  
  163.  
  164. Error 5:
  165.  
  166.  
  167. root@senecacd-MS-7808:/home/senecacd# apt-get autoremove
  168. Reading package lists... Done
  169. Building dependency tree
  170. Reading state information... Done
  171. The following packages will be REMOVED:
  172. linux-headers-3.2.0-29 linux-headers-3.2.0-29-generic
  173. 0 upgraded, 0 newly installed, 2 to remove and 0 not upgraded.
  174. 1 not fully installed or removed.
  175. After this operation, 67.5 MB disk space will be freed.
  176. Do you want to continue [Y/n]? y
  177. (Reading database ... 177910 files and directories currently installed.)
  178. Removing linux-headers-3.2.0-29-generic ...
  179. Removing linux-headers-3.2.0-29 ...
  180. Setting up keystone (2012.1+stable~20120824-a16a0ab9-0ubuntu2.3) ...
  181. Traceback (most recent call last):
  182. File "/usr/local/bin/keystone-manage", line 5, in <module>
  183. pkg_resources.run_script('keystone==2012.1', 'keystone-manage')
  184. File "/usr/lib/python2.7/dist-packages/pkg_resources.py", line 499, in run_script
  185. self.require(requires)[0].run_script(script_name, ns)
  186. File "/usr/lib/python2.7/dist-packages/pkg_resources.py", line 1235, in run_script
  187. execfile(script_filename, namespace, namespace)
  188. File "/usr/local/lib/python2.7/dist-packages/keystone-2012.1-py2.7.egg/EGG-INFO/scripts/keystone-manage", line 28, in <module>
  189. cli.main(argv=sys.argv, config_files=config_files)
  190. File "/usr/local/lib/python2.7/dist-packages/keystone-2012.1-py2.7.egg/keystone/cli.py", line 148, in main
  191. return run(cmd, (args[:1] + args[2:]))
  192. File "/usr/local/lib/python2.7/dist-packages/keystone-2012.1-py2.7.egg/keystone/cli.py", line 134, in run
  193. return CMDS[cmd](argv=args).run()
  194. File "/usr/local/lib/python2.7/dist-packages/keystone-2012.1-py2.7.egg/keystone/cli.py", line 36, in run
  195. return self.main()
  196. File "/usr/local/lib/python2.7/dist-packages/keystone-2012.1-py2.7.egg/keystone/cli.py", line 55, in main
  197. driver = utils.import_object(getattr(CONF, k).driver)
  198. File "/usr/local/lib/python2.7/dist-packages/keystone-2012.1-py2.7.egg/keystone/common/utils.py", line 63, in import_object
  199. cls = import_class(import_str)
  200. File "/usr/local/lib/python2.7/dist-packages/keystone-2012.1-py2.7.egg/keystone/common/utils.py", line 50, in import_class
  201. __import__(mod_str)
  202. File "/usr/local/lib/python2.7/dist-packages/keystone-2012.1-py2.7.egg/keystone/identity/backends/sql.py", line 24, in <module>
  203. from keystone.common.sql import migration
  204. File "/usr/local/lib/python2.7/dist-packages/keystone-2012.1-py2.7.egg/keystone/common/sql/migration.py", line 24, in <module>
  205. from migrate.versioning import api as versioning_api
  206. File "/usr/local/lib/python2.7/dist-packages/sqlalchemy_migrate-0.7.2-py2.7.egg/migrate/versioning/api.py", line 33, in <module>
  207. from migrate.versioning import (repository, schema, version,
  208. File "/usr/local/lib/python2.7/dist-packages/sqlalchemy_migrate-0.7.2-py2.7.egg/migrate/versioning/schema.py", line 10, in <module>
  209. from sqlalchemy import exceptions as sa_exceptions
  210. ImportError: cannot import name exceptions
  211. dpkg: error processing keystone (--configure):
  212. subprocess installed post-installation script returned error exit status 1
  213. Errors were encountered while processing:
  214. keystone
  215. E: Sub-process /usr/bin/dpkg returned an error code (1)
  216. root@senecacd-MS-7808:/home/senecacd#
Advertisement
Add Comment
Please, Sign In to add comment