Advertisement
Guest User

Untitled

a guest
Sep 24th, 2014
296
Never
Not a member of Pastebin yet? Sign Up, it unlocks many cool features!
  1. lauri@lauri-t420 ~/Cubietruck-Debian/output/linux-next $ make ARCH=arm CROSS_COMPILE=arm-linux-gnueabihf- uImage modules
  2. scripts/kconfig/conf --silentoldconfig Kconfig
  3. CHK include/config/kernel.release
  4. UPD include/config/kernel.release
  5. CHK include/generated/uapi/linux/version.h
  6. CHK include/generated/utsrelease.h
  7. UPD include/generated/utsrelease.h
  8. make[1]: `include/generated/mach-types.h' is up to date.
  9. CC kernel/bounds.s
  10. In file included from ./arch/arm/include/uapi/asm/posix_types.h:35:0,
  11. from ./include/uapi/linux/posix_types.h:35,
  12. from include/uapi/linux/types.h:13,
  13. from include/linux/types.h:5,
  14. from include/linux/page-flags.h:8,
  15. from kernel/bounds.c:9:
  16. ./include/uapi/asm-generic/posix_types.h:66:5: warning: "__BITS_PER_LONG" is not defined [-Wundef]
  17. In file included from ./arch/arm/include/asm/bitops.h:122:0,
  18. from include/linux/bitops.h:33,
  19. from include/linux/kernel.h:10,
  20. from include/asm-generic/bug.h:13,
  21. from ./arch/arm/include/asm/bug.h:61,
  22. from include/linux/bug.h:4,
  23. from include/linux/page-flags.h:9,
  24. from kernel/bounds.c:9:
  25. include/asm-generic/bitops/non-atomic.h: In function ‘__set_bit’:
  26. include/asm-generic/bitops/non-atomic.h:17:23: error: ‘BITS_PER_LONG’ undeclared (first use in this function)
  27. include/asm-generic/bitops/non-atomic.h:17:23: note: each undeclared identifier is reported only once for each function it appears in
  28. include/asm-generic/bitops/non-atomic.h: In function ‘__clear_bit’:
  29. include/asm-generic/bitops/non-atomic.h:25:23: error: ‘BITS_PER_LONG’ undeclared (first use in this function)
  30. include/asm-generic/bitops/non-atomic.h: In function ‘__change_bit’:
  31. include/asm-generic/bitops/non-atomic.h:42:23: error: ‘BITS_PER_LONG’ undeclared (first use in this function)
  32. include/asm-generic/bitops/non-atomic.h: In function ‘__test_and_set_bit’:
  33. include/asm-generic/bitops/non-atomic.h:59:23: error: ‘BITS_PER_LONG’ undeclared (first use in this function)
  34. include/asm-generic/bitops/non-atomic.h: In function ‘__test_and_clear_bit’:
  35. include/asm-generic/bitops/non-atomic.h:78:23: error: ‘BITS_PER_LONG’ undeclared (first use in this function)
  36. include/asm-generic/bitops/non-atomic.h: In function ‘__test_and_change_bit’:
  37. include/asm-generic/bitops/non-atomic.h:90:23: error: ‘BITS_PER_LONG’ undeclared (first use in this function)
  38. include/asm-generic/bitops/non-atomic.h: In function ‘test_bit’:
  39. include/asm-generic/bitops/non-atomic.h:105:21: error: ‘BITS_PER_LONG’ undeclared (first use in this function)
  40. In file included from ./arch/arm/include/asm/bitops.h:312:0,
  41. from include/linux/bitops.h:33,
  42. from include/linux/kernel.h:10,
  43. from include/asm-generic/bug.h:13,
  44. from ./arch/arm/include/asm/bug.h:61,
  45. from include/linux/bug.h:4,
  46. from include/linux/page-flags.h:9,
  47. from kernel/bounds.c:9:
  48. include/asm-generic/bitops/fls64.h: At top level:
  49. include/asm-generic/bitops/fls64.h:17:5: warning: "BITS_PER_LONG" is not defined [-Wundef]
  50. include/asm-generic/bitops/fls64.h:25:7: warning: "BITS_PER_LONG" is not defined [-Wundef]
  51. include/asm-generic/bitops/fls64.h:33:2: error: #error BITS_PER_LONG not 32 or 64
  52. In file included from ./arch/arm/include/asm/bitops.h:314:0,
  53. from include/linux/bitops.h:33,
  54. from include/linux/kernel.h:10,
  55. from include/asm-generic/bug.h:13,
  56. from ./arch/arm/include/asm/bug.h:61,
  57. from include/linux/bug.h:4,
  58. from include/linux/page-flags.h:9,
  59. from kernel/bounds.c:9:
  60. include/asm-generic/bitops/sched.h: In function ‘sched_find_first_bit’:
  61. include/asm-generic/bitops/sched.h:14:5: warning: "BITS_PER_LONG" is not defined [-Wundef]
  62. include/asm-generic/bitops/sched.h:18:7: warning: "BITS_PER_LONG" is not defined [-Wundef]
  63. include/asm-generic/bitops/sched.h:27:2: error: #error BITS_PER_LONG not defined
  64. include/asm-generic/bitops/sched.h:29:1: warning: no return statement in function returning non-void [-Wreturn-type]
  65. In file included from include/linux/kernel.h:10:0,
  66. from include/asm-generic/bug.h:13,
  67. from ./arch/arm/include/asm/bug.h:61,
  68. from include/linux/bug.h:4,
  69. from include/linux/page-flags.h:9,
  70. from kernel/bounds.c:9:
  71. include/linux/bitops.h: In function ‘fls_long’:
  72. include/linux/bitops.h:195:2: error: implicit declaration of function ‘fls64’ [-Werror=implicit-function-declaration]
  73. include/linux/bitops.h: In function ‘__ffs64’:
  74. include/linux/bitops.h:208:5: warning: "BITS_PER_LONG" is not defined [-Wundef]
  75. include/linux/bitops.h:211:7: warning: "BITS_PER_LONG" is not defined [-Wundef]
  76. include/linux/bitops.h:212:2: error: #error BITS_PER_LONG not 32 or 64
  77. In file included from include/asm-generic/bug.h:13:0,
  78. from ./arch/arm/include/asm/bug.h:61,
  79. from include/linux/bug.h:4,
  80. from include/linux/page-flags.h:9,
  81. from kernel/bounds.c:9:
  82. include/linux/kernel.h: At top level:
  83. include/linux/kernel.h:71:5: warning: "BITS_PER_LONG" is not defined [-Wundef]
  84. cc1: some warnings being treated as errors
  85. make[1]: *** [kernel/bounds.s] Error 1
  86. make: *** [prepare0] Error 2
Advertisement
Advertisement
Advertisement
RAW Paste Data Copied
Advertisement