wkchu

kirkwood_boot.nocolor.log

Dec 3rd, 2020
1,370
Never
Not a member of Pastebin yet? Sign Up, it unlocks many cool features!
  1. picocom v3.1
  2.  
  3. port is        : /dev/ttyUSB0
  4. flowcontrol    : none
  5. baudrate is    : 115200
  6. parity is      : none
  7. databits are   : 8
  8. stopbits are   : 1
  9. escape is      : C-a
  10. local echo is  : no
  11. noinit is      : no
  12. noreset is     : no
  13. hangup is      : no
  14. nolock is      : no
  15. send_cmd is    : sz -vv
  16. receive_cmd is : rz -vv -E
  17. imap is        :
  18. omap is        :
  19. emap is        : crcrlf,delbs,
  20. logfile is     : none
  21. initstring     : none
  22. exit_after is  : not set
  23. exit is        : no
  24.  
  25. Type [C-a] [C-h] to see available commands
  26. Terminal ready
  27. þ
  28.          __  __                      _ _
  29.         |  \/  | __ _ _ ____   _____| | |
  30.         | |\/| |/ _` | '__\ \ / / _ \ | |
  31.         | |  | | (_| | |   \ V /  __/ | |
  32.         |_|  |_|\__,_|_|    \_/ \___|_|_|
  33.  _   _     ____              _
  34. | | | |   | __ )  ___   ___ | |_
  35. | | | |___|  _ \ / _ \ / _ \| __|
  36. | |_| |___| |_) | (_) | (_) | |_
  37.  \___/    |____/ \___/ \___/ \__|  ** LOADER **
  38.  ** MARVELL BOARD: Synology Disk Station LE
  39.  
  40. U-Boot 1.1.4 (Oct  9 2016 - 22:14:52) Marvell version: 3.4.4
  41.  
  42. U-Boot code: 00600000 -> 0067FFF0  BSS: -> 0068B43C
  43.  
  44. Soc: 88F6281 A1 (DDR2)
  45. CPU running @ 1200Mhz L2 running @ 480Mhz
  46. SysClock = 400Mhz , TClock = 200Mhz
  47.  
  48. DRAM CAS Latency = 6 tRP = 6 tRAS = 18 tRCD=6
  49. DRAM CS[0] base 0x00000000   size 128MB
  50. DRAM Total size 128MB  16bit width
  51. [4096kB@f8000000] Flash:  4 MB
  52. Addresses 8M - 0M are saved for the U-Boot usage.
  53. Mem malloc Initialization (8M - 7M): Done
  54. Using default environment
  55.  
  56.  
  57. CPU : Marvell Feroceon (Rev 1)
  58.  
  59. Streaming disabled
  60. Write allocate disabled
  61.  
  62. Module 1 is AUDIO
  63.  
  64. USB 0: host mode
  65.  
  66. Synology Model: DS211j
  67. Fan Status: Good
  68.  
  69. Net:   egiga0 [PRIME]
  70. Hit any key to stop autoboot:  3  2  1  0
  71. Using egiga0 device
  72. TFTP from server 192.168.xxxxx; our IP address is 192.168.xxx
  73. Filename 'uImage-dtb'.
  74. Load address: 0x2000000
  75. Loading: *#################################################################
  76.      #################################################################
  77.      #################################################################
  78.      #################################################################
  79.      #################################################################
  80.      #################################################################
  81.      #################################################################
  82.      #################################################################
  83.      #################################################################
  84.      #################################################################
  85.      #################################################################
  86.      #################################################################
  87.      #################################################################
  88.      ##################################################
  89. done
  90. Bytes transferred = 4579764 (45e1b4 hex)
  91. ## Booting image at 02000000 ...
  92.    Image Name:   Linux kernel
  93.    Image Type:   ARM Linux Kernel Image (uncompressed)
  94.    Data Size:    4579700 Bytes =  4.4 MB
  95.    Load Address: 00008000
  96.    Entry Point:  00008000
  97.    Verifying Checksum ... OK
  98. OK
  99.  
  100. Starting kernel ...
  101.  
  102. Booting Linux on physical CPU 0x0
  103. Linux version 5.0.0-dirty (user@archon) (gcc version 7.3.0 (Buildroot 2018.08.1-00003-g576b333)) #9 Thu Mar 7 20:46:20 CET 2019
  104. CPU: Feroceon 88FR131 [56251311] revision 1 (ARMv5TE), cr=0005397f
  105. CPU: VIVT data cache, VIVT instruction cache
  106. OF: fdt: Machine model: Synology DS210 v10, v20, v30, DS211j
  107. printk: bootconsole [earlycon0] enabled
  108. Memory policy: Data cache writeback
  109. random: get_random_bytes called from start_kernel+0x84/0x3a0 with crng_init=0
  110. Built 1 zonelists, mobility grouping on.  Total pages: 32480
  111. Kernel command line: console=ttyS0,115200n8 earlyprintk=ttyS0,115200n8 root=/dev/sdb2 rootwait
  112. Dentry cache hash table entries: 16384 (order: 4, 65536 bytes)
  113. Inode-cache hash table entries: 8192 (order: 3, 32768 bytes)
  114. Memory: 120084K/131072K available (6606K kernel code, 334K rwdata, 1580K rodata, 200K init, 665K bss, 10988K reserved, 0K cma-reserved, 0K highmem)
  115. Virtual kernel memory layout:
  116.     vector  : 0xffff0000 - 0xffff1000   (   4 kB)
  117.     fixmap  : 0xffc00000 - 0xfff00000   (3072 kB)
  118.     vmalloc : 0xc8800000 - 0xff800000   ( 880 MB)
  119.     lowmem  : 0xc0000000 - 0xc8000000   ( 128 MB)
  120.     pkmap   : 0xbfe00000 - 0xc0000000   (   2 MB)
  121.     modules : 0xbf000000 - 0xbfe00000   (  14 MB)
  122.       .text : 0x(ptrval) - 0x(ptrval)   (6608 kB)
  123.       .init : 0x(ptrval) - 0x(ptrval)   ( 200 kB)
  124.       .data : 0x(ptrval) - 0x(ptrval)   ( 335 kB)
  125.        .bss : 0x(ptrval) - 0x(ptrval)   ( 666 kB)
  126. SLUB: HWalign=32, Order=0-3, MinObjects=0, CPUs=1, Nodes=1
  127. NR_IRQS: 16, nr_irqs: 16, preallocated irqs: 16
  128. clocksource: orion_clocksource: mask: 0xffffffff max_cycles: 0xffffffff, max_idle_ns: 9556302233 ns
  129. sched_clock: 32 bits at 200MHz, resolution 5ns, wraps every 10737418237ns
  130. Switching to timer-based delay loop, resolution 5ns
  131. Console: colour dummy device 80x30
  132. Calibrating delay loop (skipped), value calculated using timer frequency.. 400.00 BogoMIPS (lpj=2000000)
  133. pid_max: default: 32768 minimum: 301
  134. Mount-cache hash table entries: 1024 (order: 0, 4096 bytes)
  135. Mountpoint-cache hash table entries: 1024 (order: 0, 4096 bytes)
  136. CPU: Testing write buffer coherency: ok
  137. Setting up static identity map for 0x8200 - 0x8258
  138. mvebu-soc-id: MVEBU SoC ID=0x6281, Rev=0x3
  139. devtmpfs: initialized
  140. clocksource: jiffies: mask: 0xffffffff max_cycles: 0xffffffff, max_idle_ns: 19112604462750000 ns
  141. futex hash table entries: 256 (order: -1, 3072 bytes)
  142. pinctrl core: initialized pinctrl subsystem
  143. NET: Registered protocol family 16
  144. DMA: preallocated 256 KiB pool for atomic coherent allocations
  145. cpuidle: using governor menu
  146. Feroceon L2: Enabling L2
  147. Feroceon L2: Cache support initialised.
  148. [Firmware Info]: /ocp@f1000000/ethernet-controller@72000/ethernet0-port@0: local-mac-address is not set
  149. vgaarb: loaded
  150. SCSI subsystem initialized
  151. usbcore: registered new interface driver usbfs
  152. usbcore: registered new interface driver hub
  153. usbcore: registered new device driver usb
  154. Advanced Linux Sound Architecture Driver Initialized.
  155. clocksource: Switched to clocksource orion_clocksource
  156. NET: Registered protocol family 2
  157. tcp_listen_portaddr_hash hash table entries: 512 (order: 0, 4096 bytes)
  158. TCP established hash table entries: 1024 (order: 0, 4096 bytes)
  159. TCP bind hash table entries: 1024 (order: 0, 4096 bytes)
  160. TCP: Hash tables configured (established 1024 bind 1024)
  161. UDP hash table entries: 256 (order: 0, 4096 bytes)
  162. UDP-Lite hash table entries: 256 (order: 0, 4096 bytes)
  163. NET: Registered protocol family 1
  164. RPC: Registered named UNIX socket transport module.
  165. RPC: Registered udp transport module.
  166. RPC: Registered tcp transport module.
  167. RPC: Registered tcp NFSv4.1 backchannel transport module.
  168. Initialise system trusted keyrings
  169. workingset: timestamp_bits=14 max_order=15 bucket_order=1
  170. NFS: Registering the id_resolver key type
  171. Key type id_resolver registered
  172. Key type id_legacy registered
  173. nfs4filelayout_init: NFSv4 File Layout Driver Registering...
  174. Installing knfsd (copyright (C) 1996 okir@monad.swb.de).
  175. jffs2: version 2.2. (NAND) © 2001-2006 Red Hat, Inc.
  176. Key type asymmetric registered
  177. Asymmetric key parser 'x509' registered
  178. io scheduler mq-deadline registered
  179. io scheduler kyber registered
  180. kirkwood-pinctrl f1010000.pin-controller: registered pinctrl driver
  181. mvebu-pcie mbus@f1000000:pcie@82000000: PCI host bridge to bus 0000:00
  182. pci_bus 0000:00: root bus resource [bus 00-ff]
  183. pci_bus 0000:00: root bus resource [mem 0xe0000000-0xefffffff]
  184. pci_bus 0000:00: root bus resource [io  0x1000-0xeffff]
  185. PCI: bus0: Fast back to back transfers disabled
  186. pci 0000:00:01.0: bridge configuration invalid ([bus 00-00]), reconfiguring
  187. PCI: bus1: Fast back to back transfers enabled
  188. pci 0000:00:01.0: BAR 6: assigned [mem 0xe0000000-0xe00007ff pref]
  189. pci 0000:00:01.0: PCI bridge to [bus 01]
  190. mv_xor f1060800.xor: Marvell shared XOR driver
  191. mv_xor f1060800.xor: Marvell XOR (Registers Mode): ( xor cpy intr )
  192. mv_xor f1060900.xor: Marvell shared XOR driver
  193. mv_xor f1060900.xor: Marvell XOR (Registers Mode): ( xor cpy intr )
  194. Serial: 8250/16550 driver, 2 ports, IRQ sharing disabled
  195. printk: console [ttyS0] disabled
  196. f1012000.serial: ttyS0 at MMIO 0xf1012000 (irq = 27, base_baud = 12500000) is a 16550A
  197. printk: console [ttyS0] enabled
  198. printk: console [ttyS0] enabled
  199. printk: bootconsole [earlycon0] disabled
  200. printk: bootconsole [earlycon0] disabled
  201. f1012100.serial: ttyS1 at MMIO 0xf1012100 (irq = 28, base_baud = 12500000) is a 16550A
  202. loop: module loaded
  203. sata_mv f1080000.sata: slots 32 ports 2
  204. scsi host0: sata_mv
  205. scsi host1: sata_mv
  206. ata1: SATA max UDMA/133 irq 34
  207. ata2: SATA max UDMA/133 irq 34
  208. m25p80 spi0.0: found s25sl032p, expected m25p80
  209. m25p80 spi0.0: s25sl032p (4096 Kbytes)
  210. 6 fixed-partitions partitions found on MTD device spi0.0
  211. Creating 6 MTD partitions on "spi0.0":
  212. 0x000000000000-0x000000080000 : "RedBoot"
  213. 0x000000080000-0x000000280000 : "zImage"
  214. 0x000000280000-0x0000003c0000 : "rd.gz"
  215. 0x0000003c0000-0x0000003d0000 : "vendor"
  216. 0x0000003d0000-0x0000003f0000 : "RedBoot config"
  217. 0x0000003f0000-0x000000400000 : "FIS directory"
  218. libphy: Fixed MDIO Bus: probed
  219. libphy: orion_mdio_bus: probed
  220. mdio_bus f1072004.mdio-bus-mii: MDIO device at address 9 is missing.
  221. mv643xx_eth: MV-643xx 10/100/1000 ethernet driver version 1.4
  222. mv643xx_eth_port mv643xx_eth_port.0: DMA mask not set
  223. ata1: SATA link up 3.0 Gbps (SStatus 123 SControl F300)
  224. ata1.00: ATA-9: WDC WD30PURX-64P6ZY0, 80.00A80, max UDMA/133
  225. ata1.00: 5860533168 sectors, multi 0: LBA48 NCQ (depth 31/32)
  226. ata1.00: configured for UDMA/133
  227. scsi 0:0:0:0: Direct-Access     ATA      WDC WD30PURX-64P 0A80 PQ: 0 ANSI: 5
  228. sd 0:0:0:0: [sda] 5860533168 512-byte logical blocks: (3.00 TB/2.73 TiB)
  229. sd 0:0:0:0: [sda] 4096-byte physical blocks
  230. sd 0:0:0:0: [sda] Write Protect is off
  231. sd 0:0:0:0: [sda] Write cache: enabled, read cache: enabled, doesn't support DPO or FUA
  232.  sda: sda1
  233. sd 0:0:0:0: [sda] Attached SCSI disk
  234. mv643xx_eth_port mv643xx_eth_port.0 eth0: port 0 with MAC address 00:00:5f:ff:00:00
  235. libertas_sdio: Libertas SDIO driver
  236. libertas_sdio: Copyright Pierre Ossman
  237. ehci_hcd: USB 2.0 'Enhanced' Host Controller (EHCI) Driver
  238. ehci-pci: EHCI PCI platform driver
  239. ehci-orion: EHCI orion driver
  240. orion-ehci f1050000.ehci: EHCI Host Controller
  241. orion-ehci f1050000.ehci: new USB bus registered, assigned bus number 1
  242. orion-ehci f1050000.ehci: irq 32, io mem 0xf1050000
  243. orion-ehci f1050000.ehci: USB 2.0 started, EHCI 1.00
  244. ata2: SATA link down (SStatus 0 SControl F300)
  245. hub 1-0:1.0: USB hub found
  246. hub 1-0:1.0: 1 port detected
  247. usbcore: registered new interface driver usb-storage
  248. usbcore: registered new interface driver ums-datafab
  249. usbcore: registered new interface driver ums-freecom
  250. usbcore: registered new interface driver ums-jumpshot
  251. usbcore: registered new interface driver ums-sddr09
  252. usbcore: registered new interface driver ums-sddr55
  253. i2c /dev entries driver
  254. rtc-s35390a 0-0030: registered as rtc0
  255. orion_wdt: Initial timeout 21 sec
  256. kirkwood-pinctrl f1010000.pin-controller: pin PIN21 already requested by f1080000.sata; cannot claim for gpio-leds-hdd-21-2
  257. kirkwood-pinctrl f1010000.pin-controller: pin-21 (gpio-leds-hdd-21-2) status -22
  258. kirkwood-pinctrl f1010000.pin-controller: could not request pin 21 (PIN21) from group mpp21  on device f1010000.pin-controller
  259. leds-gpio gpio-leds-hdd-21-2: Error applying setting, reverse things back
  260. leds-gpio: probe of gpio-leds-hdd-21-2 failed with error -22
  261. marvell-cesa f1030000.crypto: CESA device successfully registered
  262. usbcore: registered new interface driver usbhid
  263. usbhid: USB HID core driver
  264. oprofile: no performance counters
  265. oprofile: using timer interrupt.
  266. NET: Registered protocol family 17
  267. lib80211: common routines for IEEE802.11 drivers
  268. Key type dns_resolver registered
  269. registered taskstats version 1
  270. Loading compiled-in X.509 certificates
  271. usb 1-1: new high-speed USB device number 2 using orion-ehci
  272. random: fast init done
  273. hub 1-1:1.0: USB hub found
  274. hub 1-1:1.0: 4 ports detected
  275. usb 1-1.2: new high-speed USB device number 3 using orion-ehci
  276. usb-storage 1-1.2:1.0: USB Mass Storage device detected
  277. scsi host2: usb-storage 1-1.2:1.0
  278. scsi 2:0:0:0: Direct-Access     General  USB Flash Disk   1.0  PQ: 0 ANSI: 2
  279. sd 2:0:0:0: [sdb] 3913728 512-byte logical blocks: (2.00 GB/1.87 GiB)
  280. sd 2:0:0:0: [sdb] Write Protect is off
  281. sd 2:0:0:0: [sdb] No Caching mode page found
  282. sd 2:0:0:0: [sdb] Assuming drive cache: write through
  283.  sdb: sdb1 sdb2
  284. sd 2:0:0:0: [sdb] Attached SCSI removable disk
  285. rtc-s35390a 0-0030: setting system clock to 2020-12-03T18:47:19 UTC (1607021239)
  286. cfg80211: Loading compiled-in X.509 certificates for regulatory database
  287. cfg80211: Loaded X.509 cert 'sforshee: 00b28ddf47aef9cea7'
  288. ALSA device list:
  289.   No soundcards found.
  290. platform regulatory.0: Direct firmware load for regulatory.db failed with error -2
  291. cfg80211: failed to load regulatory.db
  292. EXT4-fs (sdb2): mounted filesystem with ordered data mode. Opts: (null)
  293. VFS: Mounted root (ext4 filesystem) readonly on device 8:18.
  294. devtmpfs: mounted
  295. Freeing unused kernel memory: 200K
  296. This architecture does not have kernel memory protection.
  297. Run /sbin/init as init process
  298. ata2: link is slow to respond, please be patient (ready=0)
  299. systemd[1]: systemd 246.1-1-arch running in system mode. (+PAM +AUDIT -SELINUX -IMA -APPARMOR +SMACK -SYSVINIT +UTMP +LIBCRYPTSETUP +GCRYPT +GNUTLS +ACL +XZ +LZ4 +ZSTD +SECCOMP +BLKID +ELFUTILS +KMOD +IDN2 -IDN +PCRE2 default-hierarchy=hybrid)
  300. systemd[1]: Detected architecture arm.
  301.  
  302. Welcome to Arch Linux ARM!
  303.  
  304. systemd[1]: Set hostname to <alarm>.
  305. random: systemd: uninitialized urandom read (16 bytes read)
  306. systemd[1]: Initializing machine ID from random generator.
  307. systemd[1]: Installed transient /etc/machine-id file.
  308. systemd[1]: Queued start job for default target Graphical Interface.
  309. random: systemd: uninitialized urandom read (16 bytes read)
  310. systemd[1]: system-getty.slice: unit configures an IP firewall, but the local system does not support BPF/cgroup firewalling.
  311. systemd[1]: (This warning is only shown for the first unit using IP firewalling.)
  312. systemd[1]: Created slice system-getty.slice.
  313. [  OK  ] Created slice system-getty.slice.
  314. random: systemd: uninitialized urandom read (16 bytes read)
  315. systemd[1]: Created slice system-modprobe.slice.
  316. [  OK  ] Created slice system-modprobe.slice.
  317. random: systemd: uninitialized urandom read (16 bytes read)
  318. systemd[1]: Created slice system-serial\x2dgetty.slice.
  319. [  OK  ] Created slice system-serial\x2dgetty.slice.
  320. systemd[1]: Created slice User and Session Slice.
  321. [  OK  ] Created slice User and Session Slice.
  322. systemd[1]: Started Dispatch Password Requests to Console Directory Watch.
  323. [  OK  ] Started Dispatch Password …ts to Console Directory Watch.
  324. systemd[1]: Started Forward Password Requests to Wall Directory Watch.
  325. [  OK  ] Started Forward Password R…uests to Wall Directory Watch.
  326. systemd[1]: Condition check resulted in Arbitrary Executable File Formats File System Automount Point being skipped.
  327. systemd[1]: Reached target Local Encrypted Volumes.
  328. [  OK  ] Reached target Local Encrypted Volumes.
  329. systemd[1]: Reached target Paths.
  330. [  OK  ] Reached target Paths.
  331. systemd[1]: Reached target Remote File Systems.
  332. [  OK  ] Reached target Remote File Systems.
  333. systemd[1]: Reached target Slices.
  334. [  OK  ] Reached target Slices.
  335. systemd[1]: Reached target Swap.
  336. [  OK  ] Reached target Swap.
  337. systemd[1]: Listening on Device-mapper event daemon FIFOs.
  338. [  OK  ] Listening on Device-mapper event daemon FIFOs.
  339. systemd[1]: Listening on Process Core Dump Socket.
  340. [  OK  ] Listening on Process Core Dump Socket.
  341. systemd[1]: Condition check resulted in Journal Audit Socket being skipped.
  342. systemd[1]: Listening on Journal Socket (/dev/log).
  343. [  OK  ] Listening on Journal Socket (/dev/log).
  344. systemd[1]: Listening on Journal Socket.
  345. [  OK  ] Listening on Journal Socket.
  346. systemd[1]: Listening on Network Service Netlink Socket.
  347. [  OK  ] Listening on Network Service Netlink Socket.
  348. systemd[1]: Listening on udev Control Socket.
  349. [  OK  ] Listening on udev Control Socket.
  350. systemd[1]: Listening on udev Kernel Socket.
  351. [  OK  ] Listening on udev Kernel Socket.
  352. systemd[1]: Condition check resulted in Huge Pages File System being skipped.
  353. systemd[1]: Condition check resulted in POSIX Message Queue File System being skipped.
  354. systemd[1]: Mounting Kernel Debug File System...
  355.          Mounting Kernel Debug File System...
  356. systemd[1]: Condition check resulted in Kernel Trace File System being skipped.
  357. systemd[1]: Mounting Temporary Directory (/tmp)...
  358.          Mounting Temporary Directory (/tmp)...
  359. systemd[1]: Condition check resulted in Create list of static device nodes for the current kernel being skipped.
  360. systemd[1]: Starting Load Kernel Module drm...
  361.          Starting Load Kernel Module drm...
  362. systemd[1]: Condition check resulted in Set Up Additional Binary Formats being skipped.
  363. systemd[1]: Condition check resulted in Load Kernel Modules being skipped.
  364. systemd[1]: Condition check resulted in FUSE Control File System being skipped.
  365. systemd[1]: Condition check resulted in Kernel Configuration File System being skipped.
  366. systemd[1]: Starting Remount Root and Kernel File Systems...
  367.          Starting Remount Root and Kernel File Systems...
  368. systemd[1]: Condition check resulted in Repartition Root Disk being skipped.
  369. systemd[1]: Starting Apply Kernel Variables...
  370.          Starting Apply Kernel Variables...
  371. systemd[1]: Starting Coldplug All udev Devices...
  372.          Starting Coldplug All udev Devices...
  373. systemd[1]: Mounted Kernel Debug File System.
  374. [  OK  ] Mounted Kernel Debug File System.
  375. systemd[1]: Mounted Temporary Directory (/tmp).
  376. [  OK  ] Mounted Temporary Directory (/tmp).
  377. systemd[1]: modprobe@drm.service: Succeeded.
  378. systemd[1]: Finished Load Kernel Module drm.
  379. [  OK  ] Finished Load Kernel Module drm.
  380. systemd[1]: Finished Remount Root and Kernel File Systems.
  381. [  OK  ] Finished Remount Root and Kernel File Systems.
  382. systemd[1]: Finished Apply Kernel Variables.
  383. [  OK  ] Finished Apply Kernel Variables.
  384. systemd[1]: Condition check resulted in First Boot Wizard being skipped.
  385. systemd[1]: Condition check resulted in Rebuild Hardware Database being skipped.
  386. systemd[1]: Starting Load/Save Random Seed...
  387.          Starting Load/Save Random Seed...
  388. systemd[1]: Condition check resulted in Create System Users being skipped.
  389. systemd[1]: Starting Create Static Device Nodes in /dev...
  390.          Starting Create Static Device Nodes in /dev...
  391. systemd[1]: Finished Load/Save Random Seed.
  392. [  OK  ] Finished Load/Save Random Seed.
  393. systemd[1]: Finished Create Static Device Nodes in /dev.
  394. [  OK  ] Finished Create Static Device Nodes in /dev.
  395. systemd[1]: Reached target Local File Systems (Pre).
  396. [  OK  ] Reached target Local File Systems (Pre).
  397. systemd[1]: Condition check resulted in Virtual Machine and Container Storage (Compatibility) being skipped.
  398. systemd[1]: Reached target Local File Systems.
  399. [  OK  ] Reached target Local File Systems.
  400. systemd[1]: Started Entropy Daemon based on the HAVEGE algorithm.
  401. [  OK  ] Started Entropy Daemon based on the HAVEGE algorithm.
  402. systemd[1]: Condition check resulted in Rebuild Dynamic Linker Cache being skipped.
  403. systemd[1]: Condition check resulted in Store a System Token in an EFI Variable being skipped.
  404. systemd[1]: Starting Journal Service...
  405.          Starting Journal Service...
  406. systemd[1]: Condition check resulted in Commit a transient machine-id on disk being skipped.
  407. systemd[1]: Starting Rule-based Manager for Device Events and Files...
  408.          Starting Rule-based Manage…for Device Events and Files...
  409. systemd[1]: Finished Coldplug All udev Devices.
  410. [  OK  ] Finished Coldplug All udev Devices.
  411. systemd[1]: Started Journal Service.
  412. ata2: SRST failed (errno=-16)
  413. [  OK  ] Started Journal Service.
  414. [  OK  ] Started Rule-based Manager for Device Events and Files.
  415.          Starting Flush Journal to Persistent Storage...
  416.          Starting Network Service...
  417. [  OK  ] Finished Flush Journal to Persistent Storage.
  418.          Starting Create Volatile Files and Directories...
  419. ata2: SATA link up 3.0 Gbps (SStatus 123 SControl F300)
  420. ata2.00: ATA-9: WDC WD30EFRX-68EUZN0, 82.00A82, max UDMA/133
  421. ata2.00: 5860533168 sectors, multi 0: LBA48 NCQ (depth 31/32)
  422. ata2.00: configured for UDMA/133
  423. scsi 1:0:0:0: Direct-Access     ATA      WDC WD30EFRX-68E 0A82 PQ: 0 ANSI: 5
  424. sd 1:0:0:0: [sdc] 5860533168 512-byte logical blocks: (3.00 TB/2.73 TiB)
  425. sd 1:0:0:0: [sdc] 4096-byte physical blocks
  426. sd 1:0:0:0: [sdc] Write Protect is off
  427. sd 1:0:0:0: [sdc] Write cache: enabled, read cache: enabled, doesn't support DPO or FUA
  428.  sdc: sdc1
  429. sd 1:0:0:0: [sdc] Attached SCSI disk
  430. [  OK  ] Finished Create Volatile Files and Directories.
  431. random: crng init done
  432. random: 6 urandom warning(s) missed due to ratelimiting
  433. [  OK  ] Started Network Service.
  434. [  OK  ] Found device /dev/ttyS0.
  435.          Starting Network Name Resolution...
  436. mv643xx_eth_port mv643xx_eth_port.0 eth0: link up, 100 Mb/s, full duplex, flow control disabled
  437.          Starting Network Time Synchronization...
  438.          Starting Update UTMP about System Boot/Shutdown...
  439. [FAILED] Failed to start Network Time Synchronization.
  440. See 'systemctl status systemd-timesyncd.service' for details.
  441. [  OK  ] Stopped Network Time Synchronization.
  442.          Starting Network Time Synchronization...
  443. [  OK  ] Finished Update UTMP about System Boot/Shutdown.
  444. [FAILED] Failed to start Network Time Synchronization.
  445. See 'systemctl status systemd-timesyncd.service' for details.
  446. [  OK  ] Stopped Network Time Synchronization.
  447.          Starting Network Time Synchronization...
  448. [FAILED] Failed to start Network Time Synchronization.
  449. See 'systemctl status systemd-timesyncd.service' for details.
  450. [  OK  ] Stopped Network Time Synchronization.
  451.          Starting Network Time Synchronization...
  452. [FAILED] Failed to start Network Time Synchronization.
  453. See 'systemctl status systemd-timesyncd.service' for details.
  454. [  OK  ] Stopped Network Time Synchronization.
  455.          Starting Network Time Synchronization...
  456. [FAILED] Failed to start Network Time Synchronization.
  457. See 'systemctl status systemd-timesyncd.service' for details.
  458. [  OK  ] Stopped Network Time Synchronization.
  459. [FAILED] Failed to start Network Time Synchronization.
  460. See 'systemctl status systemd-timesyncd.service' for details.
  461. [  OK  ] Reached target System Initialization.
  462. [  OK  ] Started Daily Cleanup of Temporary Directories.
  463. [  OK  ] Reached target System Time Set.
  464. [  OK  ] Reached target System Time Synchronized.
  465. [  OK  ] Started Daily verification of password and group files.
  466. [  OK  ] Reached target Timers.
  467. [  OK  ] Listening on D-Bus System Message Bus Socket.
  468. [  OK  ] Reached target Sockets.
  469. [  OK  ] Reached target Basic System.
  470. [  OK  ] Started D-Bus System Message Bus.
  471.          Starting SSH Key Generation...
  472.          Starting User Login Management...
  473. [  OK  ] Started Network Name Resolution.
  474. [FAILED] Failed to start User Login Management.
  475. See 'systemctl status systemd-logind.service' for details.
  476. [  OK  ] Finished SSH Key Generation.
  477. [  OK  ] Reached target Network.
  478. [  OK  ] Reached target Host and Network Name Lookups.
  479. [  OK  ] Started OpenSSH Daemon.
  480. [  OK  ] Stopped User Login Management.
  481.          Starting Load Kernel Module drm...
  482.          Starting Permit User Sessions...
  483. [  OK  ] Finished Load Kernel Module drm.
  484.          Starting User Login Management...
  485. [  OK  ] Finished Permit User Sessions.
  486. [FAILED] Failed to start User Login Management.
  487. See 'systemctl status systemd-logind.service' for details.
  488. [  OK  ] Started Getty on tty1.
  489. [  OK  ] Started Serial Getty on ttyS0.
  490. [  OK  ] Reached target Login Prompts.
  491. [  OK  ] Stopped OpenSSH Daemon.
  492. [  OK  ] Started OpenSSH Daemon.
  493. [  OK  ] Stopped User Login Management.
  494.          Starting Load Kernel Module drm...
  495. [  OK  ] Finished Load Kernel Module drm.
  496.          Starting User Login Management...
  497. [FAILED] Failed to start User Login Management.
  498. See 'systemctl status systemd-logind.service' for details.
  499. [  OK  ] Stopped OpenSSH Daemon.
  500. [  OK  ] Started OpenSSH Daemon.
  501. [  OK  ] Stopped User Login Management.
  502.          Starting Load Kernel Module drm...
  503. [  OK  ] Finished Load Kernel Module drm.
  504.          Starting Hostname Service...
  505.          Starting User Login Management...
  506. [FAILED] Failed to start User Login Management.
  507. See 'systemctl status systemd-logind.service' for details.
  508. [  OK  ] Stopped OpenSSH Daemon.
  509. [  OK  ] Started OpenSSH Daemon.
  510. [  OK  ] Stopped User Login Management.
  511.          Starting Load Kernel Module drm...
  512. [  OK  ] Finished Load Kernel Module drm.
  513.          Starting User Login Management...
  514. [FAILED] Failed to start User Login Management.
  515. See 'systemctl status systemd-logind.service' for details.
  516. [  OK  ] Started Hostname Service.
  517. [  OK  ] Stopped OpenSSH Daemon.
  518. [  OK  ] Started OpenSSH Daemon.
  519. [  OK  ] Stopped User Login Management.
  520. [FAILED] Failed to start Load Kernel Module drm.
  521. See 'systemctl status modprobe@drm.service' for details.
  522. [FAILED] Failed to start User Login Management.
  523. See 'systemctl status systemd-logind.service' for details.
  524. [  OK  ] Reached target Multi-User System.
  525. [  OK  ] Reached target Graphical Interface.
  526.  
  527.  
  528. Arch Linux 5.0.0-dirty (ttyS0)
  529.  
  530. alarm login: alarm
  531.  
  532. Password:
  533.  
  534. Authentication failure
  535.  
  536.  
  537. Arch Linux 5.0.0-dirty (ttyS0)
  538.  
  539. alarm login:
  540. Terminating...
  541. Skipping tty reset...
  542. Thanks for using picocom
  543.  
RAW Paste Data