SHARE
TWEET

Untitled

a guest Dec 2nd, 2019 93 Never
Not a member of Pastebin yet? Sign Up, it unlocks many cool features!
  1. /home/loki/loki/tests/core_tests/chaingen.cpp:569:140: error: no matching function for call to ‘service_nodes::service_node_list::state_t::update_from_block(const loki_chain_generator_db&, cryptonote::network_type, const std::set<service_nodes::service_node_list::state_t>&, <brace-enclosed initializer list>, cryptonote::block&, std::vector<cryptonote::transaction>&, std::nullptr_t)’
  2.   569 |   entry.service_node_state.update_from_block(db_, cryptonote::FAKECHAIN, state_history_, {} /*alt_states*/, entry.block, entry.txs, nullptr);
  3.       |                                                                                                                                            ^
  4. In file included from /home/loki/loki/src/rpc/core_rpc_server_commands_defs.h:45,
  5.                  from /home/loki/loki/src/cryptonote_core/tx_pool.h:48,
  6.                  from /home/loki/loki/src/cryptonote_core/cryptonote_core.h:42,
  7.                  from /home/loki/loki/tests/core_tests/chaingen.h:53,
  8.                  from /home/loki/loki/tests/core_tests/chaingen.cpp:49:
  9. /home/loki/loki/src/cryptonote_core/service_node_list.h:424:12: note: candidate: ‘void service_nodes::service_node_list::state_t::update_from_block(const cryptonote::BlockchainDB&, cryptonote::network_type, const std::set<service_nodes::service_node_list::state_t>&, const std::set<service_nodes::service_node_list::state_t>&, const std::unordered_map<crypto::hash, service_nodes::service_node_list::state_t>&, const cryptonote::block&, const std::vector<cryptonote::transaction>&, const keys_ptr&)’
  10.   424 |       void update_from_block(
  11.       |            ^~~~~~~~~~~~~~~~~
  12. /home/loki/loki/src/cryptonote_core/service_node_list.h:424:12: note:   candidate expects 8 arguments, 7 provided
  13. make[3]: *** [tests/core_tests/CMakeFiles/core_tests.dir/build.make:115: tests/core_tests/CMakeFiles/core_tests.dir/chaingen.cpp.o] Error 1
  14. make[3]: Leaving directory '/home/loki/loki/build/Linux/_HEAD_detached_at_v5.1.5_/release'
  15. make[2]: *** [CMakeFiles/Makefile2:3994: tests/core_tests/CMakeFiles/core_tests.dir/all] Error 2
  16. make[2]: Leaving directory '/home/loki/loki/build/Linux/_HEAD_detached_at_v5.1.5_/release'
  17. make[1]: *** [Makefile:141: all] Error 2
  18. make[1]: Leaving directory '/home/loki/loki/build/Linux/_HEAD_detached_at_v5.1.5_/release'
  19. make: *** [Makefile:104: release-all] Error 2
RAW Paste Data
We use cookies for various purposes including analytics. By continuing to use Pastebin, you agree to our use of cookies as described in the Cookies Policy. OK, I Understand
 
Top