SHARE
TWEET

Untitled

a guest Apr 20th, 2019 106 Never
Not a member of Pastebin yet? Sign Up, it unlocks many cool features!
  1. Traceback (most recent call last):
  2.   File "Utilities/mkpack.py", line 370, in <module>
  3.     main()
  4.   File "Utilities/mkpack.py", line 352, in main
  5.     crush_png = import_crush_png(sdk_path)
  6.   File "Utilities/mkpack.py", line 71, in import_crush_png
  7.     execfile(activate_this, dict(__file__=activate_this))
  8. NameError: name 'execfile' is not defined
  9. Traceback (most recent call last):
  10.   File "Utilities/mkpack.py", line 370, in <module>
  11.     main()
  12.   File "Utilities/mkpack.py", line 352, in main
  13.     crush_png = import_crush_png(sdk_path)
  14.   File "Utilities/mkpack.py", line 71, in import_crush_png
  15.     execfile(activate_this, dict(__file__=activate_this))
  16. NameError: name 'execfile' is not defined
  17. Traceback (most recent call last):
  18.   File "Utilities/mkpack.py", line 370, in <module>
  19.     main()
  20.   File "Utilities/mkpack.py", line 352, in main
  21.     crush_png = import_crush_png(sdk_path)
  22.   File "Utilities/mkpack.py", line 71, in import_crush_png
  23.     execfile(activate_this, dict(__file__=activate_this))
  24. NameError: name 'execfile' is not defined
  25. [snowy] MKPACK res/snowy.json
  26. Traceback (most recent call last):
  27.   File "Utilities/mkpack.py", line 370, in <module>
  28.     main()
  29.   File "Utilities/mkpack.py", line 352, in main
  30.     crush_png = import_crush_png(sdk_path)
  31.   File "Utilities/mkpack.py", line 71, in import_crush_png
  32.     execfile(activate_this, dict(__file__=activate_this))
  33. NameError: name 'execfile' is not defined
  34. make: *** [Makefile:158: build/snowy/res/snowy_res.pbpack] Error 1
RAW Paste Data
We use cookies for various purposes including analytics. By continuing to use Pastebin, you agree to our use of cookies as described in the Cookies Policy. OK, I Understand
 
Top