Not a member of Pastebin yet?
Sign Up,
it unlocks many cool features!
- 90%] Building CXX object ZXing/CMakeFiles/ZXing.dir/src/pdf417/PDFModulusGF.cpp.o
- [ 91%] Building CXX object ZXing/CMakeFiles/ZXing.dir/src/pdf417/PDFModulusPoly.cpp.o
- [ 92%] Building CXX object ZXing/CMakeFiles/ZXing.dir/src/pdf417/PDFReader.cpp.o
- [ 93%] Building CXX object ZXing/CMakeFiles/ZXing.dir/src/pdf417/PDFScanningDecoder.cpp.o
- [ 94%] Building CXX object ZXing/CMakeFiles/ZXing.dir/src/qrcode/QRCodecMode.cpp.o
- [ 95%] Building CXX object ZXing/CMakeFiles/ZXing.dir/src/qrcode/QRErrorCorrectionLevel.cpp.o
- [ 96%] Building CXX object ZXing/CMakeFiles/ZXing.dir/src/qrcode/QRDetector.cpp.o
- [ 97%] Building CXX object ZXing/CMakeFiles/ZXing.dir/src/qrcode/QRFormatInformation.cpp.o
- /home/zeudap/.cache/yay/python-zxing-cpp/src/zxing-cpp-3.0.0/core/src/pdf417/PDFScanningDecoder.cpp:751:1: internal compiler error: Segmentation fault
- 751 | } // ZXing
- | ^
- 0x26ef811 diagnostic_context::diagnostic_impl(rich_location*, diagnostic_metadata const*, diagnostic_option_id, char const*, __va_list_tag (*) [1], diagnostic_t)
- ???:0
- 0x2749918 internal_error(char const*, ...)
- ???:0
- 0x7f85aeae89e0 fwrite
- ???:0
- 0xbfb1dc fprint_whex(_IO_FILE*, unsigned long)
- ???:0
- 0xb40a8b dw2_asm_output_data(int, unsigned long, char const*, ...)
- ???:0
- 0xb2561a symbol_table::finalize_compilation_unit()
- ???:0
- Please submit a full bug report, with preprocessed source (by using -freport-bug).
- Please include the complete backtrace with any bug report.
- See <https://gitlab.archlinux.org/archlinux/packaging/packages/gcc/-/issues> for instructions.
- Assembler messages:
- {standard input}:45181: Warning: end of file not at end of a line; newline inserted
- make[2]: *** [ZXing/CMakeFiles/ZXing.dir/build.make:1192: ZXing/CMakeFiles/ZXing.dir/src/pdf417/PDFScanningDecoder.cpp.o] Error 1
- make[2]: *** Waiting for unfinished jobs....
- make[1]: *** [CMakeFiles/Makefile2:139: ZXing/CMakeFiles/ZXing.dir/all] Error 2
- make: *** [Makefile:136: all] Error 2
- Traceback (most recent call last):
- File "/usr/lib/python3.14/site-packages/pyproject_hooks/_in_process/_in_process.py", line 389, in <module>
- main()
- ~~~~^^
- File "/usr/lib/python3.14/site-packages/pyproject_hooks/_in_process/_in_process.py", line 373, in main
- json_out["return_val"] = hook(**hook_input["kwargs"])
- ~~~~^^^^^^^^^^^^^^^^^^^^^^^^
- File "/usr/lib/python3.14/site-packages/pyproject_hooks/_in_process/_in_process.py", line 280, in build_wheel
- return _build_backend().build_wheel(
- ~~~~~~~~~~~~~~~~~~~~~~~~~~~~^
- wheel_directory, config_settings, metadata_directory
- ^^^^^^^^^^^^^^^^^^^^^^^^^^^^^^^^^^^^^^^^^^^^^^^^^^^^
- )
- ^
- File "/usr/lib/python3.14/site-packages/setuptools/build_meta.py", line 438, in build_wheel
- return _build(['bdist_wheel'])
- File "/usr/lib/python3.14/site-packages/setuptools/build_meta.py", line 429, in _build
- return self._build_with_temp_dir(
- ~~~~~~~~~~~~~~~~~~~~~~~~~^
- cmd,
- ^^^^
- ...<3 lines>...
- self._arbitrary_args(config_settings),
- ^^^^^^^^^^^^^^^^^^^^^^^^^^^^^^^^^^^^^^
- )
- ^
- File "/usr/lib/python3.14/site-packages/setuptools/build_meta.py", line 410, in _build_with_temp_dir
- self.run_setup()
- ~~~~~~~~~~~~~~^^
- File "/usr/lib/python3.14/site-packages/setuptools/build_meta.py", line 317, in run_setup
- exec(code, locals())
- ~~~~^^^^^^^^^^^^^^^^
- File "<string>", line 38, in <module>
- File "/usr/lib/python3.14/site-packages/setuptools/__init__.py", line 117, in setup
- return distutils.core.setup(**attrs) # type: ignore[return-value]
- ~~~~~~~~~~~~~~~~~~~~^^^^^^^^^
- File "/usr/lib/python3.14/site-packages/setuptools/_distutils/core.py", line 186, in setup
- return run_commands(dist)
- File "/usr/lib/python3.14/site-packages/setuptools/_distutils/core.py", line 202, in run_commands
- dist.run_commands()
- ~~~~~~~~~~~~~~~~~^^
- File "/usr/lib/python3.14/site-packages/setuptools/_distutils/dist.py", line 1000, in run_commands
- self.run_command(cmd)
- ~~~~~~~~~~~~~~~~^^^^^
- File "/usr/lib/python3.14/site-packages/setuptools/dist.py", line 1107, in run_command
- super().run_command(command)
- ~~~~~~~~~~~~~~~~~~~^^^^^^^^^
- File "/usr/lib/python3.14/site-packages/setuptools/_distutils/dist.py", line 1019, in run_command
- cmd_obj.run()
- ~~~~~~~~~~~^^
- File "/usr/lib/python3.14/site-packages/setuptools/command/bdist_wheel.py", line 370, in run
- self.run_command("build")
- ~~~~~~~~~~~~~~~~^^^^^^^^^
- File "/usr/lib/python3.14/site-packages/setuptools/_distutils/cmd.py", line 341, in run_command
- self.distribution.run_command(command)
- ~~~~~~~~~~~~~~~~~~~~~~~~~~~~~^^^^^^^^^
- File "/usr/lib/python3.14/site-packages/setuptools/dist.py", line 1107, in run_command
- super().run_command(command)
- ~~~~~~~~~~~~~~~~~~~^^^^^^^^^
- File "/usr/lib/python3.14/site-packages/setuptools/_distutils/dist.py", line 1019, in run_command
- cmd_obj.run()
- ~~~~~~~~~~~^^
- File "/usr/lib/python3.14/site-packages/setuptools/_distutils/command/build.py", line 135, in run
- self.run_command(cmd_name)
- ~~~~~~~~~~~~~~~~^^^^^^^^^^
- File "/usr/lib/python3.14/site-packages/setuptools/_distutils/cmd.py", line 341, in run_command
- self.distribution.run_command(command)
- ~~~~~~~~~~~~~~~~~~~~~~~~~~~~~^^^^^^^^^
- File "/usr/lib/python3.14/site-packages/setuptools/dist.py", line 1107, in run_command
- super().run_command(command)
- ~~~~~~~~~~~~~~~~~~~^^^^^^^^^
- File "/usr/lib/python3.14/site-packages/setuptools/_distutils/dist.py", line 1019, in run_command
- cmd_obj.run()
- ~~~~~~~~~~~^^
- File "/usr/lib/python3.14/site-packages/setuptools/command/build_ext.py", line 97, in run
- _build_ext.run(self)
- ~~~~~~~~~~~~~~^^^^^^
- File "/usr/lib/python3.14/site-packages/setuptools/_distutils/command/build_ext.py", line 367, in run
- self.build_extensions()
- ~~~~~~~~~~~~~~~~~~~~~^^
- File "/usr/lib/python3.14/site-packages/setuptools/_distutils/command/build_ext.py", line 483, in build_extensions
- self._build_extensions_serial()
- ~~~~~~~~~~~~~~~~~~~~~~~~~~~~~^^
- File "/usr/lib/python3.14/site-packages/setuptools/_distutils/command/build_ext.py", line 509, in _build_extensions_serial
- self.build_extension(ext)
- ~~~~~~~~~~~~~~~~~~~~^^^^^
- File "<string>", line 35, in build_extension
- File "/usr/lib/python3.14/subprocess.py", line 419, in check_call
- raise CalledProcessError(retcode, cmd)
- subprocess.CalledProcessError: Command '['cmake', '--build', '.', '--config', 'Release', '-j', '8']' returned non-zero exit status 2.
- ERROR Backend subprocess exited when trying to invoke build_wheel
- ==> ERROR: A failure occurred in build().
- Aborting...
- -> error making: python-zxing-cpp-exit status 4
- -> Failed to install the following packages. Manual intervention is required:
- python-zxing-cpp - exit status 4
Advertisement
Add Comment
Please, Sign In to add comment