Guest User

qt 5.15

a guest
Aug 27th, 2021
172
0
Never
Not a member of Pastebin yet? Sign Up, it unlocks many cool features!
text 205.77 KB | None | 0 0
  1. cd 'C:\Users\Patron\Desktop\Code Projects\Sistema_Silo'
  2. C:\MinGW\msys\1.0\bin\make.exe -f Makefile CONF=Debug clean QMAKE=/C/Qt14/5.15.0/mingw81_64/bin/qmake.exe
  3. "/C/MinGW/msys/1.0/bin/make.exe" -f nbproject/Makefile-Debug.mk QMAKE=/C/Qt14/5.15.0/mingw81_64/bin/qmake.exe SUBPROJECTS= .clean-conf
  4. make.exe[1]: Entering directory `/c/Users/Patron/Desktop/Code Projects/Sistema_Silo'
  5. /C/Qt14/5.15.0/mingw81_64/bin/qmake.exe VPATH=. -spec win32-g++ -o qttmp-Debug.mk nbproject/qt-Debug.pro
  6. mv -f qttmp-Debug.mk nbproject/qt-Debug.mk
  7. /C/MinGW/msys/1.0/bin/make.exe -f nbproject/qt-Debug.mk distclean
  8. make.exe[2]: Entering directory `/c/Users/Patron/Desktop/Code Projects/Sistema_Silo'
  9. rm -f qrc_LogoSplashScreen.cpp
  10. rm -f moc_predefs.h
  11. rm -f moc_Launcher.cpp moc_Login.cpp moc_Silo_SaS.cpp
  12. rm -f ui_Launcher.h "ui_Login V0.2.h" "ui_Pantalla_Principal V2.6.h"
  13. rm -f build/Debug/MingW64__Qt_5.15-Windows/Impresora.o build/Debug/MingW64__Qt_5.15-Windows/Launcher.o build/Debug/MingW64__Qt_5.15-Windows/Login.o build/Debug/MingW64__Qt_5.15-Windows/Serial.o build/Debug/MingW64__Qt_5.15-Windows/Silo_SaS.o build/Debug/MingW64__Qt_5.15-Windows/Web_handler.o build/Debug/MingW64__Qt_5.15-Windows/main_Pantalla_Principal.o build/Debug/MingW64__Qt_5.15-Windows/qrc_LogoSplashScreen.o build/Debug/MingW64__Qt_5.15-Windows/moc_Launcher.o build/Debug/MingW64__Qt_5.15-Windows/moc_Login.o build/Debug/MingW64__Qt_5.15-Windows/moc_Silo_SaS.o
  14. rm -f build/Debug/MingW64__Qt_5.15-Windows/Sistema_Silo_MingW64__Qt_5.15-Windows_V1.1_resource_res.o
  15. rm -f .qmake.stash
  16. rm -f dist/Debug/MingW64__Qt_5.15-Windows/Sistema_Silo_MingW64__Qt_5.15-Windows_V1.1.exe
  17. rm -f qttmp-Debug.mk
  18. make.exe[2]: Leaving directory `/c/Users/Patron/Desktop/Code Projects/Sistema_Silo'
  19. make.exe[1]: Leaving directory `/c/Users/Patron/Desktop/Code Projects/Sistema_Silo'
  20.  
  21. CLEAN SUCCESSFUL (total time: 4s)
  22. cd 'C:\Users\Patron\Desktop\Code Projects\Sistema_Silo'
  23. C:\MinGW\msys\1.0\bin\make.exe -f Makefile CONF=Debug QMAKE=/C/Qt14/5.15.0/mingw81_64/bin/qmake.exe
  24. "/C/MinGW/msys/1.0/bin/make.exe" -f nbproject/Makefile-Debug.mk QMAKE=/C/Qt14/5.15.0/mingw81_64/bin/qmake.exe SUBPROJECTS= .build-conf
  25. make.exe[1]: Entering directory `/c/Users/Patron/Desktop/Code Projects/Sistema_Silo'
  26. /C/Qt14/5.15.0/mingw81_64/bin/qmake.exe VPATH=. -spec win32-g++ -o qttmp-Debug.mk nbproject/qt-Debug.pro
  27. Info: creating stash file C:\Users\Patron\Desktop\Code Projects\Sistema_Silo\.qmake.stash
  28. WARNING: Failure to find: ui_Launcher.h
  29. WARNING: Failure to find: ui_Login V0.2.h
  30. mv -f qttmp-Debug.mk nbproject/qt-Debug.mk
  31. "/C/MinGW/msys/1.0/bin/make.exe" -f nbproject/qt-Debug.mk dist/Debug/MingW64__Qt_5.15-Windows/Sistema_Silo_MingW64__Qt_5.15-Windows_V1.1.exe
  32. make.exe[2]: Entering directory `/c/Users/Patron/Desktop/Code Projects/Sistema_Silo'
  33. 'C:\Qt14\5.15.0\mingw81_64\bin\uic.exe' Launcher.ui -o ui_Launcher.h
  34. 'C:\Qt14\5.15.0\mingw81_64\bin\uic.exe' "Login V0.2.ui" -o "ui_Login V0.2.h"
  35. 'C:\Qt14\5.15.0\mingw81_64\bin\uic.exe' "Pantalla_Principal V2.6.ui" -o "ui_Pantalla_Principal V2.6.h"
  36. g++ -c -fno-keep-inline-dllexport -g -Wall -Wextra -Wextra -fexceptions -mthreads -DUNICODE -D_UNICODE -DWIN32 -DMINGW_HAS_SECURE_API=1 -DQT_PRINTSUPPORT_LIB -DQT_WIDGETS_LIB -DQT_GUI_LIB -DQT_SQL_LIB -DQT_CORE_LIB -DQT_NEEDS_QMAIN -Inbproject -I. -IDependencies/curl-7.78.0-win64-mingw/include -IDependencies/openssl-1.1.1k-win64-mingw/include -IC:/Qt14/5.15.0/mingw81_64/include -IC:/Qt14/5.15.0/mingw81_64/include/QtPrintSupport -IC:/Qt14/5.15.0/mingw81_64/include/QtWidgets -IC:/Qt14/5.15.0/mingw81_64/include/QtGui -IC:/Qt14/5.15.0/mingw81_64/include/QtANGLE -IC:/Qt14/5.15.0/mingw81_64/include/QtSql -IC:/Qt14/5.15.0/mingw81_64/include/QtCore -I. -I. -I/include -IC:/Qt14/5.15.0/mingw81_64/mkspecs/win32-g++ -o build/Debug/MingW64__Qt_5.15-Windows/Impresora.o Impresora.cpp
  37. In file included from c:/Qt14/Tools/mingw810_64/x86_64-w64-mingw32/include/winsock.h:36,
  38. from c:/Qt14/Tools/mingw810_64/x86_64-w64-mingw32/include/windows.h:92,
  39. from Silo_SaS.h:66,
  40. from Impresora.h:19,
  41. from Impresora.cpp:13:
  42. c:/Qt14/Tools/mingw810_64/x86_64-w64-mingw32/include/psdk_inc/_fd_types.h:100:2: warning: #warning "fd_set and associated macros have been defined in sys/types. This can cause runtime problems with W32 sockets" [-Wcpp]
  43. #warning "fd_set and associated macros have been defined in sys/types. \
  44. ^~~~~~~
  45. In file included from c:/Qt14/Tools/mingw810_64/x86_64-w64-mingw32/include/sec_api/stdlib_s.h:9,
  46. from c:/Qt14/Tools/mingw810_64/x86_64-w64-mingw32/include/stdlib.h:740,
  47. from c:/Qt14/Tools/mingw810_64/lib/gcc/x86_64-w64-mingw32/8.1.0/include/c++/cstdlib:75,
  48. from c:/Qt14/Tools/mingw810_64/lib/gcc/x86_64-w64-mingw32/8.1.0/include/c++/bits/stl_algo.h:59,
  49. from c:/Qt14/Tools/mingw810_64/lib/gcc/x86_64-w64-mingw32/8.1.0/include/c++/algorithm:62,
  50. from C:/Qt14/5.15.0/mingw81_64/include/QtCore/qglobal.h:142,
  51. from C:/Qt14/5.15.0/mingw81_64/include/QtGui/qtguiglobal.h:43,
  52. from C:/Qt14/5.15.0/mingw81_64/include/QtWidgets/qtwidgetsglobal.h:43,
  53. from C:/Qt14/5.15.0/mingw81_64/include/QtPrintSupport/qtprintsupportglobal.h:43,
  54. from C:/Qt14/5.15.0/mingw81_64/include/QtPrintSupport/qprinter.h:43,
  55. from C:/Qt14/5.15.0/mingw81_64/include/QtPrintSupport/QPrinter:1,
  56. from Impresora.h:16,
  57. from Impresora.cpp:13:
  58. C:/MinGW/msys/1.0/include/stdlib.h:25:3: error: conflicting declaration 'typedef struct div_t div_t'
  59. } div_t;
  60. ^~~~~
  61. In file included from c:/Qt14/Tools/mingw810_64/lib/gcc/x86_64-w64-mingw32/8.1.0/include/c++/cstdlib:75,
  62. from c:/Qt14/Tools/mingw810_64/lib/gcc/x86_64-w64-mingw32/8.1.0/include/c++/bits/stl_algo.h:59,
  63. from c:/Qt14/Tools/mingw810_64/lib/gcc/x86_64-w64-mingw32/8.1.0/include/c++/algorithm:62,
  64. from C:/Qt14/5.15.0/mingw81_64/include/QtCore/qglobal.h:142,
  65. from C:/Qt14/5.15.0/mingw81_64/include/QtGui/qtguiglobal.h:43,
  66. from C:/Qt14/5.15.0/mingw81_64/include/QtWidgets/qtwidgetsglobal.h:43,
  67. from C:/Qt14/5.15.0/mingw81_64/include/QtPrintSupport/qtprintsupportglobal.h:43,
  68. from C:/Qt14/5.15.0/mingw81_64/include/QtPrintSupport/qprinter.h:43,
  69. from C:/Qt14/5.15.0/mingw81_64/include/QtPrintSupport/QPrinter:1,
  70. from Impresora.h:16,
  71. from Impresora.cpp:13:
  72. c:/Qt14/Tools/mingw810_64/x86_64-w64-mingw32/include/stdlib.h:62:5: note: previous declaration as 'typedef struct _div_t div_t'
  73. } div_t;
  74. ^~~~~
  75. In file included from c:/Qt14/Tools/mingw810_64/x86_64-w64-mingw32/include/sec_api/stdlib_s.h:9,
  76. from c:/Qt14/Tools/mingw810_64/x86_64-w64-mingw32/include/stdlib.h:740,
  77. from c:/Qt14/Tools/mingw810_64/lib/gcc/x86_64-w64-mingw32/8.1.0/include/c++/cstdlib:75,
  78. from c:/Qt14/Tools/mingw810_64/lib/gcc/x86_64-w64-mingw32/8.1.0/include/c++/bits/stl_algo.h:59,
  79. from c:/Qt14/Tools/mingw810_64/lib/gcc/x86_64-w64-mingw32/8.1.0/include/c++/algorithm:62,
  80. from C:/Qt14/5.15.0/mingw81_64/include/QtCore/qglobal.h:142,
  81. from C:/Qt14/5.15.0/mingw81_64/include/QtGui/qtguiglobal.h:43,
  82. from C:/Qt14/5.15.0/mingw81_64/include/QtWidgets/qtwidgetsglobal.h:43,
  83. from C:/Qt14/5.15.0/mingw81_64/include/QtPrintSupport/qtprintsupportglobal.h:43,
  84. from C:/Qt14/5.15.0/mingw81_64/include/QtPrintSupport/qprinter.h:43,
  85. from C:/Qt14/5.15.0/mingw81_64/include/QtPrintSupport/QPrinter:1,
  86. from Impresora.h:16,
  87. from Impresora.cpp:13:
  88. C:/MinGW/msys/1.0/include/stdlib.h:31:3: error: conflicting declaration 'typedef struct ldiv_t ldiv_t'
  89. } ldiv_t;
  90. ^~~~~~
  91. In file included from c:/Qt14/Tools/mingw810_64/lib/gcc/x86_64-w64-mingw32/8.1.0/include/c++/cstdlib:75,
  92. from c:/Qt14/Tools/mingw810_64/lib/gcc/x86_64-w64-mingw32/8.1.0/include/c++/bits/stl_algo.h:59,
  93. from c:/Qt14/Tools/mingw810_64/lib/gcc/x86_64-w64-mingw32/8.1.0/include/c++/algorithm:62,
  94. from C:/Qt14/5.15.0/mingw81_64/include/QtCore/qglobal.h:142,
  95. from C:/Qt14/5.15.0/mingw81_64/include/QtGui/qtguiglobal.h:43,
  96. from C:/Qt14/5.15.0/mingw81_64/include/QtWidgets/qtwidgetsglobal.h:43,
  97. from C:/Qt14/5.15.0/mingw81_64/include/QtPrintSupport/qtprintsupportglobal.h:43,
  98. from C:/Qt14/5.15.0/mingw81_64/include/QtPrintSupport/qprinter.h:43,
  99. from C:/Qt14/5.15.0/mingw81_64/include/QtPrintSupport/QPrinter:1,
  100. from Impresora.h:16,
  101. from Impresora.cpp:13:
  102. c:/Qt14/Tools/mingw810_64/x86_64-w64-mingw32/include/stdlib.h:67:5: note: previous declaration as 'typedef struct _ldiv_t ldiv_t'
  103. } ldiv_t;
  104. ^~~~~~
  105. In file included from C:/MinGW/msys/1.0/include/assert.h:9,
  106. from C:/Qt14/5.15.0/mingw81_64/include/QtCore/qglobal.h:50,
  107. from C:/Qt14/5.15.0/mingw81_64/include/QtGui/qtguiglobal.h:43,
  108. from C:/Qt14/5.15.0/mingw81_64/include/QtWidgets/qtwidgetsglobal.h:43,
  109. from C:/Qt14/5.15.0/mingw81_64/include/QtPrintSupport/qtprintsupportglobal.h:43,
  110. from C:/Qt14/5.15.0/mingw81_64/include/QtPrintSupport/qprinter.h:43,
  111. from C:/Qt14/5.15.0/mingw81_64/include/QtPrintSupport/QPrinter:1,
  112. from Impresora.h:16,
  113. from Impresora.cpp:13:
  114. C:/MinGW/msys/1.0/include/string.h:54:13: warning: declaration of 'int bcmp(const char*, const char*, size_t)' conflicts with built-in declaration 'int bcmp(const void*, const void*, long long unsigned int)' [-Wbuiltin-declaration-mismatch]
  115. int _EXFUN(bcmp,(const char *, const char *, size_t));
  116. ^~~~
  117. C:/MinGW/msys/1.0/include/_ansi.h:38:30: note: in definition of macro '_EXFUN'
  118. #define _EXFUN(name, proto) name proto
  119. ^~~~
  120. C:/MinGW/msys/1.0/include/string.h:55:14: warning: declaration of 'void bcopy(const char*, char*, size_t)' conflicts with built-in declaration 'void bcopy(const void*, void*, long long unsigned int)' [-Wbuiltin-declaration-mismatch]
  121. void _EXFUN(bcopy,(const char *, char *, size_t));
  122. ^~~~~
  123. C:/MinGW/msys/1.0/include/_ansi.h:38:30: note: in definition of macro '_EXFUN'
  124. #define _EXFUN(name, proto) name proto
  125. ^~~~
  126. C:/MinGW/msys/1.0/include/string.h:56:14: warning: declaration of 'void bzero(char*, size_t)' conflicts with built-in declaration 'void bzero(void*, long long unsigned int)' [-Wbuiltin-declaration-mismatch]
  127. void _EXFUN(bzero,(char *, size_t));
  128. ^~~~~
  129. C:/MinGW/msys/1.0/include/_ansi.h:38:30: note: in definition of macro '_EXFUN'
  130. #define _EXFUN(name, proto) name proto
  131. ^~~~
  132. In file included from c:/Qt14/Tools/mingw810_64/lib/gcc/x86_64-w64-mingw32/8.1.0/include/c++/bits/postypes.h:40,
  133. from c:/Qt14/Tools/mingw810_64/lib/gcc/x86_64-w64-mingw32/8.1.0/include/c++/bits/char_traits.h:40,
  134. from c:/Qt14/Tools/mingw810_64/lib/gcc/x86_64-w64-mingw32/8.1.0/include/c++/string:40,
  135. from C:/Qt14/5.15.0/mingw81_64/include/QtCore/qbytearray.h:52,
  136. from C:/Qt14/5.15.0/mingw81_64/include/QtCore/qstring.h:50,
  137. from C:/Qt14/5.15.0/mingw81_64/include/QtPrintSupport/qprinter.h:44,
  138. from C:/Qt14/5.15.0/mingw81_64/include/QtPrintSupport/QPrinter:1,
  139. from Impresora.h:16,
  140. from Impresora.cpp:13:
  141. c:/Qt14/Tools/mingw810_64/lib/gcc/x86_64-w64-mingw32/8.1.0/include/c++/cwchar:64:11: error: '::mbstate_t' has not been declared
  142. using ::mbstate_t;
  143. ^~~~~~~~~
  144. c:/Qt14/Tools/mingw810_64/lib/gcc/x86_64-w64-mingw32/8.1.0/include/c++/cwchar:141:11: error: '::btowc' has not been declared
  145. using ::btowc;
  146. ^~~~~
  147. c:/Qt14/Tools/mingw810_64/lib/gcc/x86_64-w64-mingw32/8.1.0/include/c++/cwchar:142:11: error: '::fgetwc' has not been declared
  148. using ::fgetwc;
  149. ^~~~~~
  150. c:/Qt14/Tools/mingw810_64/lib/gcc/x86_64-w64-mingw32/8.1.0/include/c++/cwchar:143:11: error: '::fgetws' has not been declared
  151. using ::fgetws;
  152. ^~~~~~
  153. c:/Qt14/Tools/mingw810_64/lib/gcc/x86_64-w64-mingw32/8.1.0/include/c++/cwchar:144:11: error: '::fputwc' has not been declared
  154. using ::fputwc;
  155. ^~~~~~
  156. c:/Qt14/Tools/mingw810_64/lib/gcc/x86_64-w64-mingw32/8.1.0/include/c++/cwchar:145:11: error: '::fputws' has not been declared
  157. using ::fputws;
  158. ^~~~~~
  159. c:/Qt14/Tools/mingw810_64/lib/gcc/x86_64-w64-mingw32/8.1.0/include/c++/cwchar:146:11: error: '::fwide' has not been declared
  160. using ::fwide;
  161. ^~~~~
  162. c:/Qt14/Tools/mingw810_64/lib/gcc/x86_64-w64-mingw32/8.1.0/include/c++/cwchar:147:11: error: '::fwprintf' has not been declared
  163. using ::fwprintf;
  164. ^~~~~~~~
  165. c:/Qt14/Tools/mingw810_64/lib/gcc/x86_64-w64-mingw32/8.1.0/include/c++/cwchar:148:11: error: '::fwscanf' has not been declared
  166. using ::fwscanf;
  167. ^~~~~~~
  168. c:/Qt14/Tools/mingw810_64/lib/gcc/x86_64-w64-mingw32/8.1.0/include/c++/cwchar:149:11: error: '::getwc' has not been declared
  169. using ::getwc;
  170. ^~~~~
  171. c:/Qt14/Tools/mingw810_64/lib/gcc/x86_64-w64-mingw32/8.1.0/include/c++/cwchar:150:11: error: '::getwchar' has not been declared
  172. using ::getwchar;
  173. ^~~~~~~~
  174. c:/Qt14/Tools/mingw810_64/lib/gcc/x86_64-w64-mingw32/8.1.0/include/c++/cwchar:151:11: error: '::mbrlen' has not been declared
  175. using ::mbrlen;
  176. ^~~~~~
  177. c:/Qt14/Tools/mingw810_64/lib/gcc/x86_64-w64-mingw32/8.1.0/include/c++/cwchar:152:11: error: '::mbrtowc' has not been declared
  178. using ::mbrtowc;
  179. ^~~~~~~
  180. c:/Qt14/Tools/mingw810_64/lib/gcc/x86_64-w64-mingw32/8.1.0/include/c++/cwchar:153:11: error: '::mbsinit' has not been declared
  181. using ::mbsinit;
  182. ^~~~~~~
  183. c:/Qt14/Tools/mingw810_64/lib/gcc/x86_64-w64-mingw32/8.1.0/include/c++/cwchar:154:11: error: '::mbsrtowcs' has not been declared
  184. using ::mbsrtowcs;
  185. ^~~~~~~~~
  186. c:/Qt14/Tools/mingw810_64/lib/gcc/x86_64-w64-mingw32/8.1.0/include/c++/cwchar:155:11: error: '::putwc' has not been declared
  187. using ::putwc;
  188. ^~~~~
  189. c:/Qt14/Tools/mingw810_64/lib/gcc/x86_64-w64-mingw32/8.1.0/include/c++/cwchar:156:11: error: '::putwchar' has not been declared
  190. using ::putwchar;
  191. ^~~~~~~~
  192. c:/Qt14/Tools/mingw810_64/lib/gcc/x86_64-w64-mingw32/8.1.0/include/c++/cwchar:158:11: error: '::swprintf' has not been declared
  193. using ::swprintf;
  194. ^~~~~~~~
  195. c:/Qt14/Tools/mingw810_64/lib/gcc/x86_64-w64-mingw32/8.1.0/include/c++/cwchar:160:11: error: '::swscanf' has not been declared
  196. using ::swscanf;
  197. ^~~~~~~
  198. c:/Qt14/Tools/mingw810_64/lib/gcc/x86_64-w64-mingw32/8.1.0/include/c++/cwchar:161:11: error: '::ungetwc' has not been declared
  199. using ::ungetwc;
  200. ^~~~~~~
  201. c:/Qt14/Tools/mingw810_64/lib/gcc/x86_64-w64-mingw32/8.1.0/include/c++/cwchar:162:11: error: '::vfwprintf' has not been declared
  202. using ::vfwprintf;
  203. ^~~~~~~~~
  204. c:/Qt14/Tools/mingw810_64/lib/gcc/x86_64-w64-mingw32/8.1.0/include/c++/cwchar:164:11: error: '::vfwscanf' has not been declared
  205. using ::vfwscanf;
  206. ^~~~~~~~
  207. c:/Qt14/Tools/mingw810_64/lib/gcc/x86_64-w64-mingw32/8.1.0/include/c++/cwchar:167:11: error: '::vswprintf' has not been declared
  208. using ::vswprintf;
  209. ^~~~~~~~~
  210. c:/Qt14/Tools/mingw810_64/lib/gcc/x86_64-w64-mingw32/8.1.0/include/c++/cwchar:170:11: error: '::vswscanf' has not been declared
  211. using ::vswscanf;
  212. ^~~~~~~~
  213. c:/Qt14/Tools/mingw810_64/lib/gcc/x86_64-w64-mingw32/8.1.0/include/c++/cwchar:172:11: error: '::vwprintf' has not been declared
  214. using ::vwprintf;
  215. ^~~~~~~~
  216. c:/Qt14/Tools/mingw810_64/lib/gcc/x86_64-w64-mingw32/8.1.0/include/c++/cwchar:174:11: error: '::vwscanf' has not been declared
  217. using ::vwscanf;
  218. ^~~~~~~
  219. c:/Qt14/Tools/mingw810_64/lib/gcc/x86_64-w64-mingw32/8.1.0/include/c++/cwchar:176:11: error: '::wcrtomb' has not been declared
  220. using ::wcrtomb;
  221. ^~~~~~~
  222. c:/Qt14/Tools/mingw810_64/lib/gcc/x86_64-w64-mingw32/8.1.0/include/c++/cwchar:177:11: error: '::wcscat' has not been declared
  223. using ::wcscat;
  224. ^~~~~~
  225. c:/Qt14/Tools/mingw810_64/lib/gcc/x86_64-w64-mingw32/8.1.0/include/c++/cwchar:179:11: error: '::wcscoll' has not been declared
  226. using ::wcscoll;
  227. ^~~~~~~
  228. c:/Qt14/Tools/mingw810_64/lib/gcc/x86_64-w64-mingw32/8.1.0/include/c++/cwchar:180:11: error: '::wcscpy' has not been declared
  229. using ::wcscpy;
  230. ^~~~~~
  231. c:/Qt14/Tools/mingw810_64/lib/gcc/x86_64-w64-mingw32/8.1.0/include/c++/cwchar:181:11: error: '::wcscspn' has not been declared
  232. using ::wcscspn;
  233. ^~~~~~~
  234. c:/Qt14/Tools/mingw810_64/lib/gcc/x86_64-w64-mingw32/8.1.0/include/c++/cwchar:182:11: error: '::wcsftime' has not been declared
  235. using ::wcsftime;
  236. ^~~~~~~~
  237. c:/Qt14/Tools/mingw810_64/lib/gcc/x86_64-w64-mingw32/8.1.0/include/c++/cwchar:184:11: error: '::wcsncat' has not been declared
  238. using ::wcsncat;
  239. ^~~~~~~
  240. c:/Qt14/Tools/mingw810_64/lib/gcc/x86_64-w64-mingw32/8.1.0/include/c++/cwchar:185:11: error: '::wcsncmp' has not been declared
  241. using ::wcsncmp;
  242. ^~~~~~~
  243. c:/Qt14/Tools/mingw810_64/lib/gcc/x86_64-w64-mingw32/8.1.0/include/c++/cwchar:186:11: error: '::wcsncpy' has not been declared
  244. using ::wcsncpy;
  245. ^~~~~~~
  246. c:/Qt14/Tools/mingw810_64/lib/gcc/x86_64-w64-mingw32/8.1.0/include/c++/cwchar:187:11: error: '::wcsrtombs' has not been declared
  247. using ::wcsrtombs;
  248. ^~~~~~~~~
  249. c:/Qt14/Tools/mingw810_64/lib/gcc/x86_64-w64-mingw32/8.1.0/include/c++/cwchar:188:11: error: '::wcsspn' has not been declared
  250. using ::wcsspn;
  251. ^~~~~~
  252. c:/Qt14/Tools/mingw810_64/lib/gcc/x86_64-w64-mingw32/8.1.0/include/c++/cwchar:193:11: error: '::wcstok' has not been declared
  253. using ::wcstok;
  254. ^~~~~~
  255. c:/Qt14/Tools/mingw810_64/lib/gcc/x86_64-w64-mingw32/8.1.0/include/c++/cwchar:196:11: error: '::wcsxfrm' has not been declared
  256. using ::wcsxfrm;
  257. ^~~~~~~
  258. c:/Qt14/Tools/mingw810_64/lib/gcc/x86_64-w64-mingw32/8.1.0/include/c++/cwchar:197:11: error: '::wctob' has not been declared
  259. using ::wctob;
  260. ^~~~~
  261. c:/Qt14/Tools/mingw810_64/lib/gcc/x86_64-w64-mingw32/8.1.0/include/c++/cwchar:198:11: error: '::wmemcmp' has not been declared
  262. using ::wmemcmp;
  263. ^~~~~~~
  264. c:/Qt14/Tools/mingw810_64/lib/gcc/x86_64-w64-mingw32/8.1.0/include/c++/cwchar:199:11: error: '::wmemcpy' has not been declared
  265. using ::wmemcpy;
  266. ^~~~~~~
  267. c:/Qt14/Tools/mingw810_64/lib/gcc/x86_64-w64-mingw32/8.1.0/include/c++/cwchar:200:11: error: '::wmemmove' has not been declared
  268. using ::wmemmove;
  269. ^~~~~~~~
  270. c:/Qt14/Tools/mingw810_64/lib/gcc/x86_64-w64-mingw32/8.1.0/include/c++/cwchar:201:11: error: '::wmemset' has not been declared
  271. using ::wmemset;
  272. ^~~~~~~
  273. c:/Qt14/Tools/mingw810_64/lib/gcc/x86_64-w64-mingw32/8.1.0/include/c++/cwchar:202:11: error: '::wprintf' has not been declared
  274. using ::wprintf;
  275. ^~~~~~~
  276. c:/Qt14/Tools/mingw810_64/lib/gcc/x86_64-w64-mingw32/8.1.0/include/c++/cwchar:203:11: error: '::wscanf' has not been declared
  277. using ::wscanf;
  278. ^~~~~~
  279. c:/Qt14/Tools/mingw810_64/lib/gcc/x86_64-w64-mingw32/8.1.0/include/c++/cwchar:204:11: error: '::wcschr' has not been declared
  280. using ::wcschr;
  281. ^~~~~~
  282. c:/Qt14/Tools/mingw810_64/lib/gcc/x86_64-w64-mingw32/8.1.0/include/c++/cwchar:205:11: error: '::wcspbrk' has not been declared
  283. using ::wcspbrk;
  284. ^~~~~~~
  285. c:/Qt14/Tools/mingw810_64/lib/gcc/x86_64-w64-mingw32/8.1.0/include/c++/cwchar:206:11: error: '::wcsrchr' has not been declared
  286. using ::wcsrchr;
  287. ^~~~~~~
  288. c:/Qt14/Tools/mingw810_64/lib/gcc/x86_64-w64-mingw32/8.1.0/include/c++/cwchar:207:11: error: '::wcsstr' has not been declared
  289. using ::wcsstr;
  290. ^~~~~~
  291. c:/Qt14/Tools/mingw810_64/lib/gcc/x86_64-w64-mingw32/8.1.0/include/c++/cwchar:208:11: error: '::wmemchr' has not been declared
  292. using ::wmemchr;
  293. ^~~~~~~
  294. c:/Qt14/Tools/mingw810_64/lib/gcc/x86_64-w64-mingw32/8.1.0/include/c++/cwchar: In function 'wchar_t* std::wcschr(wchar_t*, wchar_t)':
  295. c:/Qt14/Tools/mingw810_64/lib/gcc/x86_64-w64-mingw32/8.1.0/include/c++/cwchar:213:19: error: invalid conversion from 'const wchar_t*' to 'wchar_t*' [-fpermissive]
  296. { return wcschr(const_cast<const wchar_t*>(__p), __c); }
  297. ^~~~~~~~~~~~~~~~~~~~~~~~~~~~~~~
  298. c:/Qt14/Tools/mingw810_64/lib/gcc/x86_64-w64-mingw32/8.1.0/include/c++/cwchar:212:19: note: initializing argument 1 of 'wchar_t* std::wcschr(wchar_t*, wchar_t)'
  299. wcschr(wchar_t* __p, wchar_t __c)
  300. ~~~~~~~~~^~~
  301. c:/Qt14/Tools/mingw810_64/lib/gcc/x86_64-w64-mingw32/8.1.0/include/c++/cwchar: In function 'wchar_t* std::wcspbrk(wchar_t*, const wchar_t*)':
  302. c:/Qt14/Tools/mingw810_64/lib/gcc/x86_64-w64-mingw32/8.1.0/include/c++/cwchar:217:20: error: invalid conversion from 'const wchar_t*' to 'wchar_t*' [-fpermissive]
  303. { return wcspbrk(const_cast<const wchar_t*>(__s1), __s2); }
  304. ^~~~~~~~~~~~~~~~~~~~~~~~~~~~~~~~
  305. c:/Qt14/Tools/mingw810_64/lib/gcc/x86_64-w64-mingw32/8.1.0/include/c++/cwchar:216:20: note: initializing argument 1 of 'wchar_t* std::wcspbrk(wchar_t*, const wchar_t*)'
  306. wcspbrk(wchar_t* __s1, const wchar_t* __s2)
  307. ~~~~~~~~~^~~~
  308. c:/Qt14/Tools/mingw810_64/lib/gcc/x86_64-w64-mingw32/8.1.0/include/c++/cwchar: In function 'wchar_t* std::wcsrchr(wchar_t*, wchar_t)':
  309. c:/Qt14/Tools/mingw810_64/lib/gcc/x86_64-w64-mingw32/8.1.0/include/c++/cwchar:221:20: error: invalid conversion from 'const wchar_t*' to 'wchar_t*' [-fpermissive]
  310. { return wcsrchr(const_cast<const wchar_t*>(__p), __c); }
  311. ^~~~~~~~~~~~~~~~~~~~~~~~~~~~~~~
  312. c:/Qt14/Tools/mingw810_64/lib/gcc/x86_64-w64-mingw32/8.1.0/include/c++/cwchar:220:20: note: initializing argument 1 of 'wchar_t* std::wcsrchr(wchar_t*, wchar_t)'
  313. wcsrchr(wchar_t* __p, wchar_t __c)
  314. ~~~~~~~~~^~~
  315. c:/Qt14/Tools/mingw810_64/lib/gcc/x86_64-w64-mingw32/8.1.0/include/c++/cwchar: In function 'wchar_t* std::wcsstr(wchar_t*, const wchar_t*)':
  316. c:/Qt14/Tools/mingw810_64/lib/gcc/x86_64-w64-mingw32/8.1.0/include/c++/cwchar:225:19: error: invalid conversion from 'const wchar_t*' to 'wchar_t*' [-fpermissive]
  317. { return wcsstr(const_cast<const wchar_t*>(__s1), __s2); }
  318. ^~~~~~~~~~~~~~~~~~~~~~~~~~~~~~~~
  319. c:/Qt14/Tools/mingw810_64/lib/gcc/x86_64-w64-mingw32/8.1.0/include/c++/cwchar:224:19: note: initializing argument 1 of 'wchar_t* std::wcsstr(wchar_t*, const wchar_t*)'
  320. wcsstr(wchar_t* __s1, const wchar_t* __s2)
  321. ~~~~~~~~~^~~~
  322. c:/Qt14/Tools/mingw810_64/lib/gcc/x86_64-w64-mingw32/8.1.0/include/c++/cwchar: In function 'wchar_t* std::wmemchr(wchar_t*, wchar_t, std::size_t)':
  323. c:/Qt14/Tools/mingw810_64/lib/gcc/x86_64-w64-mingw32/8.1.0/include/c++/cwchar:229:20: error: invalid conversion from 'const wchar_t*' to 'wchar_t*' [-fpermissive]
  324. { return wmemchr(const_cast<const wchar_t*>(__p), __c, __n); }
  325. ^~~~~~~~~~~~~~~~~~~~~~~~~~~~~~~
  326. c:/Qt14/Tools/mingw810_64/lib/gcc/x86_64-w64-mingw32/8.1.0/include/c++/cwchar:228:20: note: initializing argument 1 of 'wchar_t* std::wmemchr(wchar_t*, wchar_t, std::size_t)'
  327. wmemchr(wchar_t* __p, wchar_t __c, size_t __n)
  328. ~~~~~~~~~^~~
  329. c:/Qt14/Tools/mingw810_64/lib/gcc/x86_64-w64-mingw32/8.1.0/include/c++/cwchar: At global scope:
  330. c:/Qt14/Tools/mingw810_64/lib/gcc/x86_64-w64-mingw32/8.1.0/include/c++/cwchar:257:11: error: '::wcstoll' has not been declared
  331. using ::wcstoll;
  332. ^~~~~~~
  333. c:/Qt14/Tools/mingw810_64/lib/gcc/x86_64-w64-mingw32/8.1.0/include/c++/cwchar:258:11: error: '::wcstoull' has not been declared
  334. using ::wcstoull;
  335. ^~~~~~~~
  336. c:/Qt14/Tools/mingw810_64/lib/gcc/x86_64-w64-mingw32/8.1.0/include/c++/cwchar:265:22: error: '__gnu_cxx::wcstoll' has not been declared
  337. using ::__gnu_cxx::wcstoll;
  338. ^~~~~~~
  339. c:/Qt14/Tools/mingw810_64/lib/gcc/x86_64-w64-mingw32/8.1.0/include/c++/cwchar:266:22: error: '__gnu_cxx::wcstoull' has not been declared
  340. using ::__gnu_cxx::wcstoull;
  341. ^~~~~~~~
  342. c:/Qt14/Tools/mingw810_64/lib/gcc/x86_64-w64-mingw32/8.1.0/include/c++/cwchar:283:14: error: 'std::vfwscanf' has not been declared
  343. using std::vfwscanf;
  344. ^~~~~~~~
  345. c:/Qt14/Tools/mingw810_64/lib/gcc/x86_64-w64-mingw32/8.1.0/include/c++/cwchar:286:14: error: 'std::vswscanf' has not been declared
  346. using std::vswscanf;
  347. ^~~~~~~~
  348. c:/Qt14/Tools/mingw810_64/lib/gcc/x86_64-w64-mingw32/8.1.0/include/c++/cwchar:289:14: error: 'std::vwscanf' has not been declared
  349. using std::vwscanf;
  350. ^~~~~~~
  351. c:/Qt14/Tools/mingw810_64/lib/gcc/x86_64-w64-mingw32/8.1.0/include/c++/cwchar:294:14: error: 'std::wcstoll' has not been declared
  352. using std::wcstoll;
  353. ^~~~~~~
  354. c:/Qt14/Tools/mingw810_64/lib/gcc/x86_64-w64-mingw32/8.1.0/include/c++/cwchar:295:14: error: 'std::wcstoull' has not been declared
  355. using std::wcstoull;
  356. ^~~~~~~~
  357. In file included from c:/Qt14/Tools/mingw810_64/lib/gcc/x86_64-w64-mingw32/8.1.0/include/c++/bits/char_traits.h:40,
  358. from c:/Qt14/Tools/mingw810_64/lib/gcc/x86_64-w64-mingw32/8.1.0/include/c++/string:40,
  359. from C:/Qt14/5.15.0/mingw81_64/include/QtCore/qbytearray.h:52,
  360. from C:/Qt14/5.15.0/mingw81_64/include/QtCore/qstring.h:50,
  361. from C:/Qt14/5.15.0/mingw81_64/include/QtPrintSupport/qprinter.h:44,
  362. from C:/Qt14/5.15.0/mingw81_64/include/QtPrintSupport/QPrinter:1,
  363. from Impresora.h:16,
  364. from Impresora.cpp:13:
  365. c:/Qt14/Tools/mingw810_64/lib/gcc/x86_64-w64-mingw32/8.1.0/include/c++/bits/postypes.h:228:16: error: 'mbstate_t' was not declared in this scope
  366. typedef fpos<mbstate_t> streampos;
  367. ^~~~~~~~~
  368. c:/Qt14/Tools/mingw810_64/lib/gcc/x86_64-w64-mingw32/8.1.0/include/c++/bits/postypes.h:228:16: note: suggested alternative: 'mstats'
  369. typedef fpos<mbstate_t> streampos;
  370. ^~~~~~~~~
  371. mstats
  372. c:/Qt14/Tools/mingw810_64/lib/gcc/x86_64-w64-mingw32/8.1.0/include/c++/bits/postypes.h:228:25: error: template argument 1 is invalid
  373. typedef fpos<mbstate_t> streampos;
  374. ^
  375. c:/Qt14/Tools/mingw810_64/lib/gcc/x86_64-w64-mingw32/8.1.0/include/c++/bits/postypes.h:230:16: error: 'mbstate_t' was not declared in this scope
  376. typedef fpos<mbstate_t> wstreampos;
  377. ^~~~~~~~~
  378. c:/Qt14/Tools/mingw810_64/lib/gcc/x86_64-w64-mingw32/8.1.0/include/c++/bits/postypes.h:230:16: note: suggested alternative: 'mstats'
  379. typedef fpos<mbstate_t> wstreampos;
  380. ^~~~~~~~~
  381. mstats
  382. c:/Qt14/Tools/mingw810_64/lib/gcc/x86_64-w64-mingw32/8.1.0/include/c++/bits/postypes.h:230:25: error: template argument 1 is invalid
  383. typedef fpos<mbstate_t> wstreampos;
  384. ^
  385. c:/Qt14/Tools/mingw810_64/lib/gcc/x86_64-w64-mingw32/8.1.0/include/c++/bits/postypes.h:234:16: error: 'mbstate_t' was not declared in this scope
  386. typedef fpos<mbstate_t> u16streampos;
  387. ^~~~~~~~~
  388. c:/Qt14/Tools/mingw810_64/lib/gcc/x86_64-w64-mingw32/8.1.0/include/c++/bits/postypes.h:234:16: note: suggested alternative: 'mstats'
  389. typedef fpos<mbstate_t> u16streampos;
  390. ^~~~~~~~~
  391. mstats
  392. c:/Qt14/Tools/mingw810_64/lib/gcc/x86_64-w64-mingw32/8.1.0/include/c++/bits/postypes.h:234:25: error: template argument 1 is invalid
  393. typedef fpos<mbstate_t> u16streampos;
  394. ^
  395. c:/Qt14/Tools/mingw810_64/lib/gcc/x86_64-w64-mingw32/8.1.0/include/c++/bits/postypes.h:236:16: error: 'mbstate_t' was not declared in this scope
  396. typedef fpos<mbstate_t> u32streampos;
  397. ^~~~~~~~~
  398. c:/Qt14/Tools/mingw810_64/lib/gcc/x86_64-w64-mingw32/8.1.0/include/c++/bits/postypes.h:236:16: note: suggested alternative: 'mstats'
  399. typedef fpos<mbstate_t> u32streampos;
  400. ^~~~~~~~~
  401. mstats
  402. c:/Qt14/Tools/mingw810_64/lib/gcc/x86_64-w64-mingw32/8.1.0/include/c++/bits/postypes.h:236:25: error: template argument 1 is invalid
  403. typedef fpos<mbstate_t> u32streampos;
  404. ^
  405. In file included from c:/Qt14/Tools/mingw810_64/lib/gcc/x86_64-w64-mingw32/8.1.0/include/c++/string:40,
  406. from C:/Qt14/5.15.0/mingw81_64/include/QtCore/qbytearray.h:52,
  407. from C:/Qt14/5.15.0/mingw81_64/include/QtCore/qstring.h:50,
  408. from C:/Qt14/5.15.0/mingw81_64/include/QtPrintSupport/qprinter.h:44,
  409. from C:/Qt14/5.15.0/mingw81_64/include/QtPrintSupport/QPrinter:1,
  410. from Impresora.h:16,
  411. from Impresora.cpp:13:
  412. c:/Qt14/Tools/mingw810_64/lib/gcc/x86_64-w64-mingw32/8.1.0/include/c++/bits/char_traits.h:67:20: error: 'mbstate_t' in namespace 'std' does not name a type
  413. typedef std::mbstate_t state_type;
  414. ^~~~~~~~~
  415. c:/Qt14/Tools/mingw810_64/lib/gcc/x86_64-w64-mingw32/8.1.0/include/c++/bits/char_traits.h:281:15: error: 'mbstate_t' does not name a type; did you mean 'mstats'?
  416. typedef mbstate_t state_type;
  417. ^~~~~~~~~
  418. mstats
  419. c:/Qt14/Tools/mingw810_64/lib/gcc/x86_64-w64-mingw32/8.1.0/include/c++/bits/char_traits.h:394:15: error: 'mbstate_t' does not name a type; did you mean 'mstats'?
  420. typedef mbstate_t state_type;
  421. ^~~~~~~~~
  422. mstats
  423. c:/Qt14/Tools/mingw810_64/lib/gcc/x86_64-w64-mingw32/8.1.0/include/c++/bits/char_traits.h: In static member function 'static int std::char_traits<wchar_t>::compare(const char_type*, const char_type*, std::size_t)':
  424. c:/Qt14/Tools/mingw810_64/lib/gcc/x86_64-w64-mingw32/8.1.0/include/c++/bits/char_traits.h:420:11: error: 'wmemcmp' was not declared in this scope
  425. return wmemcmp(__s1, __s2, __n);
  426. ^~~~~~~
  427. c:/Qt14/Tools/mingw810_64/lib/gcc/x86_64-w64-mingw32/8.1.0/include/c++/bits/char_traits.h:420:11: note: suggested alternative: 'memcmp'
  428. return wmemcmp(__s1, __s2, __n);
  429. ^~~~~~~
  430. memcmp
  431. c:/Qt14/Tools/mingw810_64/lib/gcc/x86_64-w64-mingw32/8.1.0/include/c++/bits/char_traits.h: In static member function 'static const char_type* std::char_traits<wchar_t>::find(const char_type*, std::size_t, const char_type&)':
  432. c:/Qt14/Tools/mingw810_64/lib/gcc/x86_64-w64-mingw32/8.1.0/include/c++/bits/char_traits.h:446:19: error: invalid conversion from 'const char_type*' {aka 'const wchar_t*'} to 'wchar_t*' [-fpermissive]
  433. return wmemchr(__s, __a, __n);
  434. ^~~
  435. In file included from c:/Qt14/Tools/mingw810_64/lib/gcc/x86_64-w64-mingw32/8.1.0/include/c++/bits/postypes.h:40,
  436. from c:/Qt14/Tools/mingw810_64/lib/gcc/x86_64-w64-mingw32/8.1.0/include/c++/bits/char_traits.h:40,
  437. from c:/Qt14/Tools/mingw810_64/lib/gcc/x86_64-w64-mingw32/8.1.0/include/c++/string:40,
  438. from C:/Qt14/5.15.0/mingw81_64/include/QtCore/qbytearray.h:52,
  439. from C:/Qt14/5.15.0/mingw81_64/include/QtCore/qstring.h:50,
  440. from C:/Qt14/5.15.0/mingw81_64/include/QtPrintSupport/qprinter.h:44,
  441. from C:/Qt14/5.15.0/mingw81_64/include/QtPrintSupport/QPrinter:1,
  442. from Impresora.h:16,
  443. from Impresora.cpp:13:
  444. c:/Qt14/Tools/mingw810_64/lib/gcc/x86_64-w64-mingw32/8.1.0/include/c++/cwchar:228:20: note: initializing argument 1 of 'wchar_t* std::wmemchr(wchar_t*, wchar_t, std::size_t)'
  445. wmemchr(wchar_t* __p, wchar_t __c, size_t __n)
  446. ~~~~~~~~~^~~
  447. In file included from c:/Qt14/Tools/mingw810_64/lib/gcc/x86_64-w64-mingw32/8.1.0/include/c++/string:40,
  448. from C:/Qt14/5.15.0/mingw81_64/include/QtCore/qbytearray.h:52,
  449. from C:/Qt14/5.15.0/mingw81_64/include/QtCore/qstring.h:50,
  450. from C:/Qt14/5.15.0/mingw81_64/include/QtPrintSupport/qprinter.h:44,
  451. from C:/Qt14/5.15.0/mingw81_64/include/QtPrintSupport/QPrinter:1,
  452. from Impresora.h:16,
  453. from Impresora.cpp:13:
  454. c:/Qt14/Tools/mingw810_64/lib/gcc/x86_64-w64-mingw32/8.1.0/include/c++/bits/char_traits.h: In static member function 'static std::char_traits<wchar_t>::char_type* std::char_traits<wchar_t>::move(std::char_traits<wchar_t>::char_type*, const char_type*, std::size_t)':
  455. c:/Qt14/Tools/mingw810_64/lib/gcc/x86_64-w64-mingw32/8.1.0/include/c++/bits/char_traits.h:454:9: error: 'wmemmove' was not declared in this scope
  456. return wmemmove(__s1, __s2, __n);
  457. ^~~~~~~~
  458. c:/Qt14/Tools/mingw810_64/lib/gcc/x86_64-w64-mingw32/8.1.0/include/c++/bits/char_traits.h:454:9: note: suggested alternative: 'memmove'
  459. return wmemmove(__s1, __s2, __n);
  460. ^~~~~~~~
  461. memmove
  462. c:/Qt14/Tools/mingw810_64/lib/gcc/x86_64-w64-mingw32/8.1.0/include/c++/bits/char_traits.h: In static member function 'static std::char_traits<wchar_t>::char_type* std::char_traits<wchar_t>::copy(std::char_traits<wchar_t>::char_type*, const char_type*, std::size_t)':
  463. c:/Qt14/Tools/mingw810_64/lib/gcc/x86_64-w64-mingw32/8.1.0/include/c++/bits/char_traits.h:462:9: error: 'wmemcpy' was not declared in this scope
  464. return wmemcpy(__s1, __s2, __n);
  465. ^~~~~~~
  466. c:/Qt14/Tools/mingw810_64/lib/gcc/x86_64-w64-mingw32/8.1.0/include/c++/bits/char_traits.h:462:9: note: suggested alternative: 'memcpy'
  467. return wmemcpy(__s1, __s2, __n);
  468. ^~~~~~~
  469. memcpy
  470. c:/Qt14/Tools/mingw810_64/lib/gcc/x86_64-w64-mingw32/8.1.0/include/c++/bits/char_traits.h: In static member function 'static std::char_traits<wchar_t>::char_type* std::char_traits<wchar_t>::assign(std::char_traits<wchar_t>::char_type*, std::size_t, std::char_traits<wchar_t>::char_type)':
  471. c:/Qt14/Tools/mingw810_64/lib/gcc/x86_64-w64-mingw32/8.1.0/include/c++/bits/char_traits.h:470:9: error: 'wmemset' was not declared in this scope
  472. return wmemset(__s, __a, __n);
  473. ^~~~~~~
  474. c:/Qt14/Tools/mingw810_64/lib/gcc/x86_64-w64-mingw32/8.1.0/include/c++/bits/char_traits.h:470:9: note: suggested alternative: 'memset'
  475. return wmemset(__s, __a, __n);
  476. ^~~~~~~
  477. memset
  478. c:/Qt14/Tools/mingw810_64/lib/gcc/x86_64-w64-mingw32/8.1.0/include/c++/bits/char_traits.h: In static member function 'static constexpr std::char_traits<wchar_t>::int_type std::char_traits<wchar_t>::eof()':
  479. c:/Qt14/Tools/mingw810_64/lib/gcc/x86_64-w64-mingw32/8.1.0/include/c++/bits/char_traits.h:487:38: error: 'WEOF' was not declared in this scope
  480. { return static_cast<int_type>(WEOF); }
  481. ^~~~
  482. c:/Qt14/Tools/mingw810_64/lib/gcc/x86_64-w64-mingw32/8.1.0/include/c++/bits/char_traits.h:487:38: note: the macro 'WEOF' had not yet been defined
  483. In file included from c:/Qt14/Tools/mingw810_64/lib/gcc/x86_64-w64-mingw32/8.1.0/include/c++/cwctype:50,
  484. from c:/Qt14/Tools/mingw810_64/lib/gcc/x86_64-w64-mingw32/8.1.0/include/c++/bits/locale_facets.h:39,
  485. from c:/Qt14/Tools/mingw810_64/lib/gcc/x86_64-w64-mingw32/8.1.0/include/c++/bits/basic_ios.h:37,
  486. from c:/Qt14/Tools/mingw810_64/lib/gcc/x86_64-w64-mingw32/8.1.0/include/c++/ios:44,
  487. from c:/Qt14/Tools/mingw810_64/lib/gcc/x86_64-w64-mingw32/8.1.0/include/c++/ostream:38,
  488. from c:/Qt14/Tools/mingw810_64/lib/gcc/x86_64-w64-mingw32/8.1.0/include/c++/iterator:64,
  489. from C:/Qt14/5.15.0/mingw81_64/include/QtCore/qbytearray.h:53,
  490. from C:/Qt14/5.15.0/mingw81_64/include/QtCore/qstring.h:50,
  491. from C:/Qt14/5.15.0/mingw81_64/include/QtPrintSupport/qprinter.h:44,
  492. from C:/Qt14/5.15.0/mingw81_64/include/QtPrintSupport/QPrinter:1,
  493. from Impresora.h:16,
  494. from Impresora.cpp:13:
  495. c:/Qt14/Tools/mingw810_64/x86_64-w64-mingw32/include/wctype.h:39: note: it was later defined here
  496. #define WEOF (wint_t)(0xFFFF)
  497.  
  498. In file included from c:/Qt14/Tools/mingw810_64/lib/gcc/x86_64-w64-mingw32/8.1.0/include/c++/string:40,
  499. from C:/Qt14/5.15.0/mingw81_64/include/QtCore/qbytearray.h:52,
  500. from C:/Qt14/5.15.0/mingw81_64/include/QtCore/qstring.h:50,
  501. from C:/Qt14/5.15.0/mingw81_64/include/QtPrintSupport/qprinter.h:44,
  502. from C:/Qt14/5.15.0/mingw81_64/include/QtPrintSupport/QPrinter:1,
  503. from Impresora.h:16,
  504. from Impresora.cpp:13:
  505. c:/Qt14/Tools/mingw810_64/lib/gcc/x86_64-w64-mingw32/8.1.0/include/c++/bits/char_traits.h: At global scope:
  506. c:/Qt14/Tools/mingw810_64/lib/gcc/x86_64-w64-mingw32/8.1.0/include/c++/bits/char_traits.h:514:15: error: 'mbstate_t' does not name a type; did you mean 'mstats'?
  507. typedef mbstate_t state_type;
  508. ^~~~~~~~~
  509. mstats
  510. c:/Qt14/Tools/mingw810_64/lib/gcc/x86_64-w64-mingw32/8.1.0/include/c++/bits/char_traits.h:611:15: error: 'mbstate_t' does not name a type; did you mean 'mstats'?
  511. typedef mbstate_t state_type;
  512. ^~~~~~~~~
  513. mstats
  514. In file included from c:/Qt14/Tools/mingw810_64/lib/gcc/x86_64-w64-mingw32/8.1.0/include/c++/bits/localefwd.h:42,
  515. from c:/Qt14/Tools/mingw810_64/lib/gcc/x86_64-w64-mingw32/8.1.0/include/c++/string:43,
  516. from C:/Qt14/5.15.0/mingw81_64/include/QtCore/qbytearray.h:52,
  517. from C:/Qt14/5.15.0/mingw81_64/include/QtCore/qstring.h:50,
  518. from C:/Qt14/5.15.0/mingw81_64/include/QtPrintSupport/qprinter.h:44,
  519. from C:/Qt14/5.15.0/mingw81_64/include/QtPrintSupport/QPrinter:1,
  520. from Impresora.h:16,
  521. from Impresora.cpp:13:
  522. c:/Qt14/Tools/mingw810_64/lib/gcc/x86_64-w64-mingw32/8.1.0/include/c++/cctype:87:11: error: '::isblank' has not been declared
  523. using ::isblank;
  524. ^~~~~~~
  525. In file included from c:/Qt14/Tools/mingw810_64/lib/gcc/x86_64-w64-mingw32/8.1.0/include/c++/string:43,
  526. from C:/Qt14/5.15.0/mingw81_64/include/QtCore/qbytearray.h:52,
  527. from C:/Qt14/5.15.0/mingw81_64/include/QtCore/qstring.h:50,
  528. from C:/Qt14/5.15.0/mingw81_64/include/QtPrintSupport/qprinter.h:44,
  529. from C:/Qt14/5.15.0/mingw81_64/include/QtPrintSupport/QPrinter:1,
  530. from Impresora.h:16,
  531. from Impresora.cpp:13:
  532. c:/Qt14/Tools/mingw810_64/lib/gcc/x86_64-w64-mingw32/8.1.0/include/c++/bits/localefwd.h:139:40: error: 'mbstate_t' was not declared in this scope
  533. template<> class codecvt<char, char, mbstate_t>;
  534. ^~~~~~~~~
  535. c:/Qt14/Tools/mingw810_64/lib/gcc/x86_64-w64-mingw32/8.1.0/include/c++/bits/localefwd.h:139:40: note: suggested alternative: 'mstats'
  536. template<> class codecvt<char, char, mbstate_t>;
  537. ^~~~~~~~~
  538. mstats
  539. c:/Qt14/Tools/mingw810_64/lib/gcc/x86_64-w64-mingw32/8.1.0/include/c++/bits/localefwd.h:139:49: error: template argument 3 is invalid
  540. template<> class codecvt<char, char, mbstate_t>;
  541. ^
  542. c:/Qt14/Tools/mingw810_64/lib/gcc/x86_64-w64-mingw32/8.1.0/include/c++/bits/localefwd.h:141:43: error: 'mbstate_t' was not declared in this scope
  543. template<> class codecvt<wchar_t, char, mbstate_t>;
  544. ^~~~~~~~~
  545. c:/Qt14/Tools/mingw810_64/lib/gcc/x86_64-w64-mingw32/8.1.0/include/c++/bits/localefwd.h:141:43: note: suggested alternative: 'mstats'
  546. template<> class codecvt<wchar_t, char, mbstate_t>;
  547. ^~~~~~~~~
  548. mstats
  549. c:/Qt14/Tools/mingw810_64/lib/gcc/x86_64-w64-mingw32/8.1.0/include/c++/bits/localefwd.h:141:52: error: template argument 3 is invalid
  550. template<> class codecvt<wchar_t, char, mbstate_t>;
  551. ^
  552. In file included from C:/MinGW/msys/1.0/include/pthread.h:13,
  553. from c:/Qt14/Tools/mingw810_64/lib/gcc/x86_64-w64-mingw32/8.1.0/include/c++/x86_64-w64-mingw32/bits/gthr-default.h:35,
  554. from c:/Qt14/Tools/mingw810_64/lib/gcc/x86_64-w64-mingw32/8.1.0/include/c++/x86_64-w64-mingw32/bits/gthr.h:148,
  555. from c:/Qt14/Tools/mingw810_64/lib/gcc/x86_64-w64-mingw32/8.1.0/include/c++/ext/atomicity.h:35,
  556. from c:/Qt14/Tools/mingw810_64/lib/gcc/x86_64-w64-mingw32/8.1.0/include/c++/bits/basic_string.h:39,
  557. from c:/Qt14/Tools/mingw810_64/lib/gcc/x86_64-w64-mingw32/8.1.0/include/c++/string:52,
  558. from C:/Qt14/5.15.0/mingw81_64/include/QtCore/qbytearray.h:52,
  559. from C:/Qt14/5.15.0/mingw81_64/include/QtCore/qstring.h:50,
  560. from C:/Qt14/5.15.0/mingw81_64/include/QtPrintSupport/qprinter.h:44,
  561. from C:/Qt14/5.15.0/mingw81_64/include/QtPrintSupport/QPrinter:1,
  562. from Impresora.h:16,
  563. from Impresora.cpp:13:
  564. C:/MinGW/msys/1.0/include/sys/types.h:71:18: error: conflicting declaration 'typedef long int time_t'
  565. typedef _TIME_T_ time_t;
  566. ^~~~~~
  567. In file included from c:/Qt14/Tools/mingw810_64/x86_64-w64-mingw32/include/stddef.h:7,
  568. from c:/Qt14/Tools/mingw810_64/lib/gcc/x86_64-w64-mingw32/8.1.0/include/stddef.h:1,
  569. from c:/Qt14/Tools/mingw810_64/lib/gcc/x86_64-w64-mingw32/8.1.0/include/c++/cstddef:50,
  570. from C:/Qt14/5.15.0/mingw81_64/include/QtCore/qglobal.h:46,
  571. from C:/Qt14/5.15.0/mingw81_64/include/QtGui/qtguiglobal.h:43,
  572. from C:/Qt14/5.15.0/mingw81_64/include/QtWidgets/qtwidgetsglobal.h:43,
  573. from C:/Qt14/5.15.0/mingw81_64/include/QtPrintSupport/qtprintsupportglobal.h:43,
  574. from C:/Qt14/5.15.0/mingw81_64/include/QtPrintSupport/qprinter.h:43,
  575. from C:/Qt14/5.15.0/mingw81_64/include/QtPrintSupport/QPrinter:1,
  576. from Impresora.h:16,
  577. from Impresora.cpp:13:
  578. c:/Qt14/Tools/mingw810_64/x86_64-w64-mingw32/include/crtdefs.h:138:20: note: previous declaration as 'typedef __time64_t time_t'
  579. typedef __time64_t time_t;
  580. ^~~~~~
  581. In file included from C:/MinGW/msys/1.0/include/pthread.h:13,
  582. from c:/Qt14/Tools/mingw810_64/lib/gcc/x86_64-w64-mingw32/8.1.0/include/c++/x86_64-w64-mingw32/bits/gthr-default.h:35,
  583. from c:/Qt14/Tools/mingw810_64/lib/gcc/x86_64-w64-mingw32/8.1.0/include/c++/x86_64-w64-mingw32/bits/gthr.h:148,
  584. from c:/Qt14/Tools/mingw810_64/lib/gcc/x86_64-w64-mingw32/8.1.0/include/c++/ext/atomicity.h:35,
  585. from c:/Qt14/Tools/mingw810_64/lib/gcc/x86_64-w64-mingw32/8.1.0/include/c++/bits/basic_string.h:39,
  586. from c:/Qt14/Tools/mingw810_64/lib/gcc/x86_64-w64-mingw32/8.1.0/include/c++/string:52,
  587. from C:/Qt14/5.15.0/mingw81_64/include/QtCore/qbytearray.h:52,
  588. from C:/Qt14/5.15.0/mingw81_64/include/QtCore/qstring.h:50,
  589. from C:/Qt14/5.15.0/mingw81_64/include/QtPrintSupport/qprinter.h:44,
  590. from C:/Qt14/5.15.0/mingw81_64/include/QtPrintSupport/QPrinter:1,
  591. from Impresora.h:16,
  592. from Impresora.cpp:13:
  593. C:/MinGW/msys/1.0/include/sys/types.h:106:14: error: conflicting declaration 'typedef char int8_t'
  594. typedef char int8_t;
  595. ^~~~~~
  596. In file included from c:/Qt14/Tools/mingw810_64/lib/gcc/x86_64-w64-mingw32/8.1.0/include/stdint.h:9,
  597. from c:/Qt14/Tools/mingw810_64/lib/gcc/x86_64-w64-mingw32/8.1.0/include/c++/bits/atomic_base.h:36,
  598. from c:/Qt14/Tools/mingw810_64/lib/gcc/x86_64-w64-mingw32/8.1.0/include/c++/atomic:41,
  599. from C:/Qt14/5.15.0/mingw81_64/include/QtCore/qatomic_cxx11.h:45,
  600. from C:/Qt14/5.15.0/mingw81_64/include/QtCore/qbasicatomic.h:53,
  601. from C:/Qt14/5.15.0/mingw81_64/include/QtCore/qatomic.h:46,
  602. from C:/Qt14/5.15.0/mingw81_64/include/QtCore/qglobal.h:1304,
  603. from C:/Qt14/5.15.0/mingw81_64/include/QtGui/qtguiglobal.h:43,
  604. from C:/Qt14/5.15.0/mingw81_64/include/QtWidgets/qtwidgetsglobal.h:43,
  605. from C:/Qt14/5.15.0/mingw81_64/include/QtPrintSupport/qtprintsupportglobal.h:43,
  606. from C:/Qt14/5.15.0/mingw81_64/include/QtPrintSupport/qprinter.h:43,
  607. from C:/Qt14/5.15.0/mingw81_64/include/QtPrintSupport/QPrinter:1,
  608. from Impresora.h:16,
  609. from Impresora.cpp:13:
  610. c:/Qt14/Tools/mingw810_64/x86_64-w64-mingw32/include/stdint.h:35:21: note: previous declaration as 'typedef signed char int8_t'
  611. typedef signed char int8_t;
  612. ^~~~~~
  613. In file included from C:/MinGW/msys/1.0/include/pthread.h:13,
  614. from c:/Qt14/Tools/mingw810_64/lib/gcc/x86_64-w64-mingw32/8.1.0/include/c++/x86_64-w64-mingw32/bits/gthr-default.h:35,
  615. from c:/Qt14/Tools/mingw810_64/lib/gcc/x86_64-w64-mingw32/8.1.0/include/c++/x86_64-w64-mingw32/bits/gthr.h:148,
  616. from c:/Qt14/Tools/mingw810_64/lib/gcc/x86_64-w64-mingw32/8.1.0/include/c++/ext/atomicity.h:35,
  617. from c:/Qt14/Tools/mingw810_64/lib/gcc/x86_64-w64-mingw32/8.1.0/include/c++/bits/basic_string.h:39,
  618. from c:/Qt14/Tools/mingw810_64/lib/gcc/x86_64-w64-mingw32/8.1.0/include/c++/string:52,
  619. from C:/Qt14/5.15.0/mingw81_64/include/QtCore/qbytearray.h:52,
  620. from C:/Qt14/5.15.0/mingw81_64/include/QtCore/qstring.h:50,
  621. from C:/Qt14/5.15.0/mingw81_64/include/QtPrintSupport/qprinter.h:44,
  622. from C:/Qt14/5.15.0/mingw81_64/include/QtPrintSupport/QPrinter:1,
  623. from Impresora.h:16,
  624. from Impresora.cpp:13:
  625. C:/MinGW/msys/1.0/include/sys/types.h:137:14: error: conflicting declaration 'typedef long int ssize_t'
  626. typedef long ssize_t;
  627. ^~~~~~~
  628. In file included from c:/Qt14/Tools/mingw810_64/x86_64-w64-mingw32/include/stddef.h:7,
  629. from c:/Qt14/Tools/mingw810_64/lib/gcc/x86_64-w64-mingw32/8.1.0/include/stddef.h:1,
  630. from c:/Qt14/Tools/mingw810_64/lib/gcc/x86_64-w64-mingw32/8.1.0/include/c++/cstddef:50,
  631. from C:/Qt14/5.15.0/mingw81_64/include/QtCore/qglobal.h:46,
  632. from C:/Qt14/5.15.0/mingw81_64/include/QtGui/qtguiglobal.h:43,
  633. from C:/Qt14/5.15.0/mingw81_64/include/QtWidgets/qtwidgetsglobal.h:43,
  634. from C:/Qt14/5.15.0/mingw81_64/include/QtPrintSupport/qtprintsupportglobal.h:43,
  635. from C:/Qt14/5.15.0/mingw81_64/include/QtPrintSupport/qprinter.h:43,
  636. from C:/Qt14/5.15.0/mingw81_64/include/QtPrintSupport/QPrinter:1,
  637. from Impresora.h:16,
  638. from Impresora.cpp:13:
  639. c:/Qt14/Tools/mingw810_64/x86_64-w64-mingw32/include/crtdefs.h:45:35: note: previous declaration as 'typedef long long int ssize_t'
  640. __MINGW_EXTENSION typedef __int64 ssize_t;
  641. ^~~~~~~
  642. In file included from c:/Qt14/Tools/mingw810_64/lib/gcc/x86_64-w64-mingw32/8.1.0/include/c++/x86_64-w64-mingw32/bits/gthr-default.h:35,
  643. from c:/Qt14/Tools/mingw810_64/lib/gcc/x86_64-w64-mingw32/8.1.0/include/c++/x86_64-w64-mingw32/bits/gthr.h:148,
  644. from c:/Qt14/Tools/mingw810_64/lib/gcc/x86_64-w64-mingw32/8.1.0/include/c++/ext/atomicity.h:35,
  645. from c:/Qt14/Tools/mingw810_64/lib/gcc/x86_64-w64-mingw32/8.1.0/include/c++/bits/basic_string.h:39,
  646. from c:/Qt14/Tools/mingw810_64/lib/gcc/x86_64-w64-mingw32/8.1.0/include/c++/string:52,
  647. from C:/Qt14/5.15.0/mingw81_64/include/QtCore/qbytearray.h:52,
  648. from C:/Qt14/5.15.0/mingw81_64/include/QtCore/qstring.h:50,
  649. from C:/Qt14/5.15.0/mingw81_64/include/QtPrintSupport/qprinter.h:44,
  650. from C:/Qt14/5.15.0/mingw81_64/include/QtPrintSupport/QPrinter:1,
  651. from Impresora.h:16,
  652. from Impresora.cpp:13:
  653. C:/MinGW/msys/1.0/include/pthread.h:71:27: error: 'pthread_attr_t' was not declared in this scope
  654. int pthread_attr_destroy (pthread_attr_t *);
  655. ^~~~~~~~~~~~~~
  656. C:/MinGW/msys/1.0/include/pthread.h:71:27: note: suggested alternative: 'pthread_attr_destroy'
  657. int pthread_attr_destroy (pthread_attr_t *);
  658. ^~~~~~~~~~~~~~
  659. pthread_attr_destroy
  660. C:/MinGW/msys/1.0/include/pthread.h:71:43: error: expected primary-expression before ')' token
  661. int pthread_attr_destroy (pthread_attr_t *);
  662. ^
  663. C:/MinGW/msys/1.0/include/pthread.h:72:40: error: 'pthread_attr_t' does not name a type; did you mean 'pthread_attr_destroy'?
  664. int pthread_attr_getdetachstate (const pthread_attr_t *, int *);
  665. ^~~~~~~~~~~~~~
  666. pthread_attr_destroy
  667. C:/MinGW/msys/1.0/include/pthread.h:73:41: error: 'pthread_attr_t' does not name a type; did you mean 'pthread_attr_destroy'?
  668. int pthread_attr_getinheritsched (const pthread_attr_t *, int *);
  669. ^~~~~~~~~~~~~~
  670. pthread_attr_destroy
  671. C:/MinGW/msys/1.0/include/pthread.h:74:39: error: 'pthread_attr_t' does not name a type; did you mean 'pthread_attr_destroy'?
  672. int pthread_attr_getschedparam (const pthread_attr_t *, struct sched_param *);
  673. ^~~~~~~~~~~~~~
  674. pthread_attr_destroy
  675. C:/MinGW/msys/1.0/include/pthread.h:75:40: error: 'pthread_attr_t' does not name a type; did you mean 'pthread_attr_destroy'?
  676. int pthread_attr_getschedpolicy (const pthread_attr_t *, int *);
  677. ^~~~~~~~~~~~~~
  678. pthread_attr_destroy
  679. C:/MinGW/msys/1.0/include/pthread.h:76:34: error: 'pthread_attr_t' does not name a type; did you mean 'pthread_attr_destroy'?
  680. int pthread_attr_getscope (const pthread_attr_t *, int *);
  681. ^~~~~~~~~~~~~~
  682. pthread_attr_destroy
  683. C:/MinGW/msys/1.0/include/pthread.h:77:24: error: 'pthread_attr_t' was not declared in this scope
  684. int pthread_attr_init (pthread_attr_t *);
  685. ^~~~~~~~~~~~~~
  686. C:/MinGW/msys/1.0/include/pthread.h:77:24: note: suggested alternative: 'pthread_attr_init'
  687. int pthread_attr_init (pthread_attr_t *);
  688. ^~~~~~~~~~~~~~
  689. pthread_attr_init
  690. C:/MinGW/msys/1.0/include/pthread.h:77:40: error: expected primary-expression before ')' token
  691. int pthread_attr_init (pthread_attr_t *);
  692. ^
  693. C:/MinGW/msys/1.0/include/pthread.h:78:34: error: 'pthread_attr_t' was not declared in this scope
  694. int pthread_attr_setdetachstate (pthread_attr_t *, int);
  695. ^~~~~~~~~~~~~~
  696. C:/MinGW/msys/1.0/include/pthread.h:78:34: note: suggested alternative: 'pthread_attr_init'
  697. int pthread_attr_setdetachstate (pthread_attr_t *, int);
  698. ^~~~~~~~~~~~~~
  699. pthread_attr_init
  700. C:/MinGW/msys/1.0/include/pthread.h:78:50: error: expected primary-expression before ',' token
  701. int pthread_attr_setdetachstate (pthread_attr_t *, int);
  702. ^
  703. C:/MinGW/msys/1.0/include/pthread.h:78:52: error: expected primary-expression before 'int'
  704. int pthread_attr_setdetachstate (pthread_attr_t *, int);
  705. ^~~
  706. C:/MinGW/msys/1.0/include/pthread.h:78:55: error: expression list treated as compound expression in initializer [-fpermissive]
  707. int pthread_attr_setdetachstate (pthread_attr_t *, int);
  708. ^
  709. C:/MinGW/msys/1.0/include/pthread.h:79:35: error: 'pthread_attr_t' was not declared in this scope
  710. int pthread_attr_setinheritsched (pthread_attr_t *, int);
  711. ^~~~~~~~~~~~~~
  712. C:/MinGW/msys/1.0/include/pthread.h:79:35: note: suggested alternative: 'pthread_attr_init'
  713. int pthread_attr_setinheritsched (pthread_attr_t *, int);
  714. ^~~~~~~~~~~~~~
  715. pthread_attr_init
  716. C:/MinGW/msys/1.0/include/pthread.h:79:51: error: expected primary-expression before ',' token
  717. int pthread_attr_setinheritsched (pthread_attr_t *, int);
  718. ^
  719. C:/MinGW/msys/1.0/include/pthread.h:79:53: error: expected primary-expression before 'int'
  720. int pthread_attr_setinheritsched (pthread_attr_t *, int);
  721. ^~~
  722. C:/MinGW/msys/1.0/include/pthread.h:79:56: error: expression list treated as compound expression in initializer [-fpermissive]
  723. int pthread_attr_setinheritsched (pthread_attr_t *, int);
  724. ^
  725. C:/MinGW/msys/1.0/include/pthread.h:80:33: error: 'pthread_attr_t' was not declared in this scope
  726. int pthread_attr_setschedparam (pthread_attr_t *, const struct sched_param *);
  727. ^~~~~~~~~~~~~~
  728. C:/MinGW/msys/1.0/include/pthread.h:80:33: note: suggested alternative: 'pthread_attr_init'
  729. int pthread_attr_setschedparam (pthread_attr_t *, const struct sched_param *);
  730. ^~~~~~~~~~~~~~
  731. pthread_attr_init
  732. C:/MinGW/msys/1.0/include/pthread.h:80:49: error: expected primary-expression before ',' token
  733. int pthread_attr_setschedparam (pthread_attr_t *, const struct sched_param *);
  734. ^
  735. C:/MinGW/msys/1.0/include/pthread.h:80:51: error: expected primary-expression before 'const'
  736. int pthread_attr_setschedparam (pthread_attr_t *, const struct sched_param *);
  737. ^~~~~
  738. C:/MinGW/msys/1.0/include/pthread.h:80:77: error: expression list treated as compound expression in initializer [-fpermissive]
  739. int pthread_attr_setschedparam (pthread_attr_t *, const struct sched_param *);
  740. ^
  741. C:/MinGW/msys/1.0/include/pthread.h:81:34: error: 'pthread_attr_t' was not declared in this scope
  742. int pthread_attr_setschedpolicy (pthread_attr_t *, int);
  743. ^~~~~~~~~~~~~~
  744. C:/MinGW/msys/1.0/include/pthread.h:81:34: note: suggested alternative: 'pthread_attr_init'
  745. int pthread_attr_setschedpolicy (pthread_attr_t *, int);
  746. ^~~~~~~~~~~~~~
  747. pthread_attr_init
  748. C:/MinGW/msys/1.0/include/pthread.h:81:50: error: expected primary-expression before ',' token
  749. int pthread_attr_setschedpolicy (pthread_attr_t *, int);
  750. ^
  751. C:/MinGW/msys/1.0/include/pthread.h:81:52: error: expected primary-expression before 'int'
  752. int pthread_attr_setschedpolicy (pthread_attr_t *, int);
  753. ^~~
  754. C:/MinGW/msys/1.0/include/pthread.h:81:55: error: expression list treated as compound expression in initializer [-fpermissive]
  755. int pthread_attr_setschedpolicy (pthread_attr_t *, int);
  756. ^
  757. C:/MinGW/msys/1.0/include/pthread.h:82:28: error: 'pthread_attr_t' was not declared in this scope
  758. int pthread_attr_setscope (pthread_attr_t *, int);
  759. ^~~~~~~~~~~~~~
  760. C:/MinGW/msys/1.0/include/pthread.h:82:28: note: suggested alternative: 'pthread_attr_init'
  761. int pthread_attr_setscope (pthread_attr_t *, int);
  762. ^~~~~~~~~~~~~~
  763. pthread_attr_init
  764. C:/MinGW/msys/1.0/include/pthread.h:82:44: error: expected primary-expression before ',' token
  765. int pthread_attr_setscope (pthread_attr_t *, int);
  766. ^
  767. C:/MinGW/msys/1.0/include/pthread.h:82:46: error: expected primary-expression before 'int'
  768. int pthread_attr_setscope (pthread_attr_t *, int);
  769. ^~~
  770. C:/MinGW/msys/1.0/include/pthread.h:82:49: error: expression list treated as compound expression in initializer [-fpermissive]
  771. int pthread_attr_setscope (pthread_attr_t *, int);
  772. ^
  773. C:/MinGW/msys/1.0/include/pthread.h:98:21: error: 'pthread_t' was not declared in this scope
  774. int pthread_cancel (pthread_t);
  775. ^~~~~~~~~
  776. C:/MinGW/msys/1.0/include/pthread.h:98:21: note: suggested alternative: '_threadid'
  777. int pthread_cancel (pthread_t);
  778. ^~~~~~~~~
  779. _threadid
  780. C:/MinGW/msys/1.0/include/pthread.h:111:29: error: 'pthread_cond_t' was not declared in this scope
  781. int pthread_cond_broadcast (pthread_cond_t *);
  782. ^~~~~~~~~~~~~~
  783. C:/MinGW/msys/1.0/include/pthread.h:111:29: note: suggested alternative: 'pthread_cancel'
  784. int pthread_cond_broadcast (pthread_cond_t *);
  785. ^~~~~~~~~~~~~~
  786. pthread_cancel
  787. C:/MinGW/msys/1.0/include/pthread.h:111:45: error: expected primary-expression before ')' token
  788. int pthread_cond_broadcast (pthread_cond_t *);
  789. ^
  790. C:/MinGW/msys/1.0/include/pthread.h:112:27: error: 'pthread_cond_t' was not declared in this scope
  791. int pthread_cond_destroy (pthread_cond_t *);
  792. ^~~~~~~~~~~~~~
  793. C:/MinGW/msys/1.0/include/pthread.h:112:27: note: suggested alternative: 'pthread_cancel'
  794. int pthread_cond_destroy (pthread_cond_t *);
  795. ^~~~~~~~~~~~~~
  796. pthread_cancel
  797. C:/MinGW/msys/1.0/include/pthread.h:112:43: error: expected primary-expression before ')' token
  798. int pthread_cond_destroy (pthread_cond_t *);
  799. ^
  800. C:/MinGW/msys/1.0/include/pthread.h:113:24: error: 'pthread_cond_t' was not declared in this scope
  801. int pthread_cond_init (pthread_cond_t *, const pthread_condattr_t *);
  802. ^~~~~~~~~~~~~~
  803. C:/MinGW/msys/1.0/include/pthread.h:113:24: note: suggested alternative: 'pthread_cond_init'
  804. int pthread_cond_init (pthread_cond_t *, const pthread_condattr_t *);
  805. ^~~~~~~~~~~~~~
  806. pthread_cond_init
  807. C:/MinGW/msys/1.0/include/pthread.h:113:40: error: expected primary-expression before ',' token
  808. int pthread_cond_init (pthread_cond_t *, const pthread_condattr_t *);
  809. ^
  810. C:/MinGW/msys/1.0/include/pthread.h:113:42: error: expected primary-expression before 'const'
  811. int pthread_cond_init (pthread_cond_t *, const pthread_condattr_t *);
  812. ^~~~~
  813. C:/MinGW/msys/1.0/include/pthread.h:113:68: error: expression list treated as compound expression in initializer [-fpermissive]
  814. int pthread_cond_init (pthread_cond_t *, const pthread_condattr_t *);
  815. ^
  816. C:/MinGW/msys/1.0/include/pthread.h:114:26: error: 'pthread_cond_t' was not declared in this scope
  817. int pthread_cond_signal (pthread_cond_t *);
  818. ^~~~~~~~~~~~~~
  819. C:/MinGW/msys/1.0/include/pthread.h:114:26: note: suggested alternative: 'pthread_cond_init'
  820. int pthread_cond_signal (pthread_cond_t *);
  821. ^~~~~~~~~~~~~~
  822. pthread_cond_init
  823. C:/MinGW/msys/1.0/include/pthread.h:114:42: error: expected primary-expression before ')' token
  824. int pthread_cond_signal (pthread_cond_t *);
  825. ^
  826. C:/MinGW/msys/1.0/include/pthread.h:115:29: error: 'pthread_cond_t' was not declared in this scope
  827. int pthread_cond_timedwait (pthread_cond_t *,
  828. ^~~~~~~~~~~~~~
  829. C:/MinGW/msys/1.0/include/pthread.h:115:29: note: suggested alternative: 'pthread_cond_init'
  830. int pthread_cond_timedwait (pthread_cond_t *,
  831. ^~~~~~~~~~~~~~
  832. pthread_cond_init
  833. C:/MinGW/msys/1.0/include/pthread.h:115:45: error: expected primary-expression before ',' token
  834. int pthread_cond_timedwait (pthread_cond_t *,
  835. ^
  836. C:/MinGW/msys/1.0/include/pthread.h:116:8: error: 'pthread_mutex_t' was not declared in this scope
  837. pthread_mutex_t *, const struct timespec *);
  838. ^~~~~~~~~~~~~~~
  839. C:/MinGW/msys/1.0/include/pthread.h:116:8: note: suggested alternative: 'pthread_cancel'
  840. pthread_mutex_t *, const struct timespec *);
  841. ^~~~~~~~~~~~~~~
  842. pthread_cancel
  843. C:/MinGW/msys/1.0/include/pthread.h:116:25: error: expected primary-expression before ',' token
  844. pthread_mutex_t *, const struct timespec *);
  845. ^
  846. C:/MinGW/msys/1.0/include/pthread.h:116:27: error: expected primary-expression before 'const'
  847. pthread_mutex_t *, const struct timespec *);
  848. ^~~~~
  849. C:/MinGW/msys/1.0/include/pthread.h:116:50: error: expression list treated as compound expression in initializer [-fpermissive]
  850. pthread_mutex_t *, const struct timespec *);
  851. ^
  852. C:/MinGW/msys/1.0/include/pthread.h:117:24: error: 'pthread_cond_t' was not declared in this scope
  853. int pthread_cond_wait (pthread_cond_t *, pthread_mutex_t *);
  854. ^~~~~~~~~~~~~~
  855. C:/MinGW/msys/1.0/include/pthread.h:117:24: note: suggested alternative: 'pthread_cond_wait'
  856. int pthread_cond_wait (pthread_cond_t *, pthread_mutex_t *);
  857. ^~~~~~~~~~~~~~
  858. pthread_cond_wait
  859. C:/MinGW/msys/1.0/include/pthread.h:117:40: error: expected primary-expression before ',' token
  860. int pthread_cond_wait (pthread_cond_t *, pthread_mutex_t *);
  861. ^
  862. C:/MinGW/msys/1.0/include/pthread.h:117:42: error: 'pthread_mutex_t' was not declared in this scope
  863. int pthread_cond_wait (pthread_cond_t *, pthread_mutex_t *);
  864. ^~~~~~~~~~~~~~~
  865. C:/MinGW/msys/1.0/include/pthread.h:117:42: note: suggested alternative: 'pthread_cancel'
  866. int pthread_cond_wait (pthread_cond_t *, pthread_mutex_t *);
  867. ^~~~~~~~~~~~~~~
  868. pthread_cancel
  869. C:/MinGW/msys/1.0/include/pthread.h:117:59: error: expected primary-expression before ')' token
  870. int pthread_cond_wait (pthread_cond_t *, pthread_mutex_t *);
  871. ^
  872. C:/MinGW/msys/1.0/include/pthread.h:117:59: error: expression list treated as compound expression in initializer [-fpermissive]
  873. C:/MinGW/msys/1.0/include/pthread.h:118:31: error: 'pthread_condattr_t' was not declared in this scope
  874. int pthread_condattr_destroy (pthread_condattr_t *);
  875. ^~~~~~~~~~~~~~~~~~
  876. C:/MinGW/msys/1.0/include/pthread.h:118:31: note: suggested alternative: 'pthread_cond_wait'
  877. int pthread_condattr_destroy (pthread_condattr_t *);
  878. ^~~~~~~~~~~~~~~~~~
  879. pthread_cond_wait
  880. C:/MinGW/msys/1.0/include/pthread.h:118:51: error: expected primary-expression before ')' token
  881. int pthread_condattr_destroy (pthread_condattr_t *);
  882. ^
  883. C:/MinGW/msys/1.0/include/pthread.h:119:40: error: 'pthread_condattr_t' does not name a type; did you mean 'pthread_cond_wait'?
  884. int pthread_condattr_getpshared (const pthread_condattr_t *, int *);
  885. ^~~~~~~~~~~~~~~~~~
  886. pthread_cond_wait
  887. C:/MinGW/msys/1.0/include/pthread.h:120:28: error: 'pthread_condattr_t' was not declared in this scope
  888. int pthread_condattr_init (pthread_condattr_t *);
  889. ^~~~~~~~~~~~~~~~~~
  890. C:/MinGW/msys/1.0/include/pthread.h:120:28: note: suggested alternative: 'pthread_condattr_init'
  891. int pthread_condattr_init (pthread_condattr_t *);
  892. ^~~~~~~~~~~~~~~~~~
  893. pthread_condattr_init
  894. C:/MinGW/msys/1.0/include/pthread.h:120:48: error: expected primary-expression before ')' token
  895. int pthread_condattr_init (pthread_condattr_t *);
  896. ^
  897. C:/MinGW/msys/1.0/include/pthread.h:121:34: error: 'pthread_condattr_t' was not declared in this scope
  898. int pthread_condattr_setpshared (pthread_condattr_t *, int);
  899. ^~~~~~~~~~~~~~~~~~
  900. C:/MinGW/msys/1.0/include/pthread.h:121:34: note: suggested alternative: 'pthread_condattr_init'
  901. int pthread_condattr_setpshared (pthread_condattr_t *, int);
  902. ^~~~~~~~~~~~~~~~~~
  903. pthread_condattr_init
  904. C:/MinGW/msys/1.0/include/pthread.h:121:54: error: expected primary-expression before ',' token
  905. int pthread_condattr_setpshared (pthread_condattr_t *, int);
  906. ^
  907. C:/MinGW/msys/1.0/include/pthread.h:121:56: error: expected primary-expression before 'int'
  908. int pthread_condattr_setpshared (pthread_condattr_t *, int);
  909. ^~~
  910. C:/MinGW/msys/1.0/include/pthread.h:121:59: error: expression list treated as compound expression in initializer [-fpermissive]
  911. int pthread_condattr_setpshared (pthread_condattr_t *, int);
  912. ^
  913. C:/MinGW/msys/1.0/include/pthread.h:123:21: error: 'pthread_t' was not declared in this scope
  914. int pthread_create (pthread_t *, const pthread_attr_t *,
  915. ^~~~~~~~~
  916. C:/MinGW/msys/1.0/include/pthread.h:123:21: note: suggested alternative: '_threadid'
  917. int pthread_create (pthread_t *, const pthread_attr_t *,
  918. ^~~~~~~~~
  919. _threadid
  920. C:/MinGW/msys/1.0/include/pthread.h:123:32: error: expected primary-expression before ',' token
  921. int pthread_create (pthread_t *, const pthread_attr_t *,
  922. ^
  923. C:/MinGW/msys/1.0/include/pthread.h:123:34: error: expected primary-expression before 'const'
  924. int pthread_create (pthread_t *, const pthread_attr_t *,
  925. ^~~~~
  926. C:/MinGW/msys/1.0/include/pthread.h:124:7: error: expected primary-expression before 'void'
  927. void *(*)(void *), void *);
  928. ^~~~
  929. C:/MinGW/msys/1.0/include/pthread.h:124:26: error: expected primary-expression before 'void'
  930. void *(*)(void *), void *);
  931. ^~~~
  932. C:/MinGW/msys/1.0/include/pthread.h:124:32: error: expression list treated as compound expression in initializer [-fpermissive]
  933. void *(*)(void *), void *);
  934. ^
  935. C:/MinGW/msys/1.0/include/pthread.h:125:21: error: 'pthread_t' was not declared in this scope
  936. int pthread_detach (pthread_t);
  937. ^~~~~~~~~
  938. C:/MinGW/msys/1.0/include/pthread.h:125:21: note: suggested alternative: '_threadid'
  939. int pthread_detach (pthread_t);
  940. ^~~~~~~~~
  941. _threadid
  942. C:/MinGW/msys/1.0/include/pthread.h:126:20: error: 'pthread_t' was not declared in this scope
  943. int pthread_equal (pthread_t, pthread_t);
  944. ^~~~~~~~~
  945. C:/MinGW/msys/1.0/include/pthread.h:126:20: note: suggested alternative: '_threadid'
  946. int pthread_equal (pthread_t, pthread_t);
  947. ^~~~~~~~~
  948. _threadid
  949. C:/MinGW/msys/1.0/include/pthread.h:126:31: error: 'pthread_t' was not declared in this scope
  950. int pthread_equal (pthread_t, pthread_t);
  951. ^~~~~~~~~
  952. C:/MinGW/msys/1.0/include/pthread.h:126:31: note: suggested alternative: '_threadid'
  953. int pthread_equal (pthread_t, pthread_t);
  954. ^~~~~~~~~
  955. _threadid
  956. C:/MinGW/msys/1.0/include/pthread.h:126:40: error: expression list treated as compound expression in initializer [-fpermissive]
  957. int pthread_equal (pthread_t, pthread_t);
  958. ^
  959. C:/MinGW/msys/1.0/include/pthread.h:128:28: error: 'pthread_t' was not declared in this scope
  960. int pthread_getschedparam (pthread_t, int *, struct sched_param *);
  961. ^~~~~~~~~
  962. C:/MinGW/msys/1.0/include/pthread.h:128:28: note: suggested alternative: 'pthread_exit'
  963. int pthread_getschedparam (pthread_t, int *, struct sched_param *);
  964. ^~~~~~~~~
  965. pthread_exit
  966. C:/MinGW/msys/1.0/include/pthread.h:128:39: error: expected primary-expression before 'int'
  967. int pthread_getschedparam (pthread_t, int *, struct sched_param *);
  968. ^~~
  969. C:/MinGW/msys/1.0/include/pthread.h:128:46: error: expected primary-expression before 'struct'
  970. int pthread_getschedparam (pthread_t, int *, struct sched_param *);
  971. ^~~~~~
  972. C:/MinGW/msys/1.0/include/pthread.h:128:66: error: expression list treated as compound expression in initializer [-fpermissive]
  973. int pthread_getschedparam (pthread_t, int *, struct sched_param *);
  974. ^
  975. C:/MinGW/msys/1.0/include/pthread.h:129:28: error: 'pthread_key_t' was not declared in this scope
  976. void *pthread_getspecific (pthread_key_t);
  977. ^~~~~~~~~~~~~
  978. C:/MinGW/msys/1.0/include/pthread.h:129:28: note: suggested alternative: 'pthread_exit'
  979. void *pthread_getspecific (pthread_key_t);
  980. ^~~~~~~~~~~~~
  981. pthread_exit
  982. C:/MinGW/msys/1.0/include/pthread.h:130:19: error: 'pthread_t' was not declared in this scope
  983. int pthread_join (pthread_t, void **);
  984. ^~~~~~~~~
  985. C:/MinGW/msys/1.0/include/pthread.h:130:19: note: suggested alternative: 'pthread_exit'
  986. int pthread_join (pthread_t, void **);
  987. ^~~~~~~~~
  988. pthread_exit
  989. C:/MinGW/msys/1.0/include/pthread.h:130:30: error: expected primary-expression before 'void'
  990. int pthread_join (pthread_t, void **);
  991. ^~~~
  992. C:/MinGW/msys/1.0/include/pthread.h:130:37: error: expression list treated as compound expression in initializer [-fpermissive]
  993. int pthread_join (pthread_t, void **);
  994. ^
  995. C:/MinGW/msys/1.0/include/pthread.h:131:25: error: 'pthread_key_t' was not declared in this scope
  996. int pthread_key_create (pthread_key_t *, void (*)(void *));
  997. ^~~~~~~~~~~~~
  998. C:/MinGW/msys/1.0/include/pthread.h:131:25: note: suggested alternative: 'pthread_exit'
  999. int pthread_key_create (pthread_key_t *, void (*)(void *));
  1000. ^~~~~~~~~~~~~
  1001. pthread_exit
  1002. C:/MinGW/msys/1.0/include/pthread.h:131:40: error: expected primary-expression before ',' token
  1003. int pthread_key_create (pthread_key_t *, void (*)(void *));
  1004. ^
  1005. C:/MinGW/msys/1.0/include/pthread.h:131:42: error: expected primary-expression before 'void'
  1006. int pthread_key_create (pthread_key_t *, void (*)(void *));
  1007. ^~~~
  1008. C:/MinGW/msys/1.0/include/pthread.h:131:58: error: expression list treated as compound expression in initializer [-fpermissive]
  1009. int pthread_key_create (pthread_key_t *, void (*)(void *));
  1010. ^
  1011. C:/MinGW/msys/1.0/include/pthread.h:132:25: error: 'pthread_key_t' was not declared in this scope
  1012. int pthread_key_delete (pthread_key_t);
  1013. ^~~~~~~~~~~~~
  1014. C:/MinGW/msys/1.0/include/pthread.h:132:25: note: suggested alternative: 'pthread_exit'
  1015. int pthread_key_delete (pthread_key_t);
  1016. ^~~~~~~~~~~~~
  1017. pthread_exit
  1018. C:/MinGW/msys/1.0/include/pthread.h:135:28: error: 'pthread_mutex_t' was not declared in this scope
  1019. int pthread_mutex_destroy (pthread_mutex_t *);
  1020. ^~~~~~~~~~~~~~~
  1021. C:/MinGW/msys/1.0/include/pthread.h:135:28: note: suggested alternative: 'pthread_exit'
  1022. int pthread_mutex_destroy (pthread_mutex_t *);
  1023. ^~~~~~~~~~~~~~~
  1024. pthread_exit
  1025. C:/MinGW/msys/1.0/include/pthread.h:135:45: error: expected primary-expression before ')' token
  1026. int pthread_mutex_destroy (pthread_mutex_t *);
  1027. ^
  1028. C:/MinGW/msys/1.0/include/pthread.h:136:41: error: 'pthread_mutex_t' does not name a type; did you mean 'pthread_exit'?
  1029. int pthread_mutex_getprioceiling (const pthread_mutex_t *, int *);
  1030. ^~~~~~~~~~~~~~~
  1031. pthread_exit
  1032. C:/MinGW/msys/1.0/include/pthread.h:137:25: error: 'pthread_mutex_t' was not declared in this scope
  1033. int pthread_mutex_init (pthread_mutex_t *, const pthread_mutexattr_t *);
  1034. ^~~~~~~~~~~~~~~
  1035. C:/MinGW/msys/1.0/include/pthread.h:137:25: note: suggested alternative: 'pthread_mutex_init'
  1036. int pthread_mutex_init (pthread_mutex_t *, const pthread_mutexattr_t *);
  1037. ^~~~~~~~~~~~~~~
  1038. pthread_mutex_init
  1039. C:/MinGW/msys/1.0/include/pthread.h:137:42: error: expected primary-expression before ',' token
  1040. int pthread_mutex_init (pthread_mutex_t *, const pthread_mutexattr_t *);
  1041. ^
  1042. C:/MinGW/msys/1.0/include/pthread.h:137:44: error: expected primary-expression before 'const'
  1043. int pthread_mutex_init (pthread_mutex_t *, const pthread_mutexattr_t *);
  1044. ^~~~~
  1045. C:/MinGW/msys/1.0/include/pthread.h:137:71: error: expression list treated as compound expression in initializer [-fpermissive]
  1046. int pthread_mutex_init (pthread_mutex_t *, const pthread_mutexattr_t *);
  1047. ^
  1048. C:/MinGW/msys/1.0/include/pthread.h:138:25: error: 'pthread_mutex_t' was not declared in this scope
  1049. int pthread_mutex_lock (pthread_mutex_t *);
  1050. ^~~~~~~~~~~~~~~
  1051. C:/MinGW/msys/1.0/include/pthread.h:138:25: note: suggested alternative: 'pthread_mutex_init'
  1052. int pthread_mutex_lock (pthread_mutex_t *);
  1053. ^~~~~~~~~~~~~~~
  1054. pthread_mutex_init
  1055. C:/MinGW/msys/1.0/include/pthread.h:138:42: error: expected primary-expression before ')' token
  1056. int pthread_mutex_lock (pthread_mutex_t *);
  1057. ^
  1058. C:/MinGW/msys/1.0/include/pthread.h:139:35: error: 'pthread_mutex_t' was not declared in this scope
  1059. int pthread_mutex_setprioceiling (pthread_mutex_t *, int, int *);
  1060. ^~~~~~~~~~~~~~~
  1061. C:/MinGW/msys/1.0/include/pthread.h:139:35: note: suggested alternative: 'pthread_mutex_init'
  1062. int pthread_mutex_setprioceiling (pthread_mutex_t *, int, int *);
  1063. ^~~~~~~~~~~~~~~
  1064. pthread_mutex_init
  1065. C:/MinGW/msys/1.0/include/pthread.h:139:52: error: expected primary-expression before ',' token
  1066. int pthread_mutex_setprioceiling (pthread_mutex_t *, int, int *);
  1067. ^
  1068. C:/MinGW/msys/1.0/include/pthread.h:139:54: error: expected primary-expression before 'int'
  1069. int pthread_mutex_setprioceiling (pthread_mutex_t *, int, int *);
  1070. ^~~
  1071. C:/MinGW/msys/1.0/include/pthread.h:139:59: error: expected primary-expression before 'int'
  1072. int pthread_mutex_setprioceiling (pthread_mutex_t *, int, int *);
  1073. ^~~
  1074. C:/MinGW/msys/1.0/include/pthread.h:139:64: error: expression list treated as compound expression in initializer [-fpermissive]
  1075. int pthread_mutex_setprioceiling (pthread_mutex_t *, int, int *);
  1076. ^
  1077. C:/MinGW/msys/1.0/include/pthread.h:140:28: error: 'pthread_mutex_t' was not declared in this scope
  1078. int pthread_mutex_trylock (pthread_mutex_t *);
  1079. ^~~~~~~~~~~~~~~
  1080. C:/MinGW/msys/1.0/include/pthread.h:140:28: note: suggested alternative: 'pthread_mutex_init'
  1081. int pthread_mutex_trylock (pthread_mutex_t *);
  1082. ^~~~~~~~~~~~~~~
  1083. pthread_mutex_init
  1084. C:/MinGW/msys/1.0/include/pthread.h:140:45: error: expected primary-expression before ')' token
  1085. int pthread_mutex_trylock (pthread_mutex_t *);
  1086. ^
  1087. C:/MinGW/msys/1.0/include/pthread.h:141:27: error: 'pthread_mutex_t' was not declared in this scope
  1088. int pthread_mutex_unlock (pthread_mutex_t *);
  1089. ^~~~~~~~~~~~~~~
  1090. C:/MinGW/msys/1.0/include/pthread.h:141:27: note: suggested alternative: 'pthread_mutex_init'
  1091. int pthread_mutex_unlock (pthread_mutex_t *);
  1092. ^~~~~~~~~~~~~~~
  1093. pthread_mutex_init
  1094. C:/MinGW/msys/1.0/include/pthread.h:141:44: error: expected primary-expression before ')' token
  1095. int pthread_mutex_unlock (pthread_mutex_t *);
  1096. ^
  1097. C:/MinGW/msys/1.0/include/pthread.h:142:32: error: 'pthread_mutexattr_t' was not declared in this scope
  1098. int pthread_mutexattr_destroy (pthread_mutexattr_t *);
  1099. ^~~~~~~~~~~~~~~~~~~
  1100. C:/MinGW/msys/1.0/include/pthread.h:142:32: note: suggested alternative: 'pthread_mutex_init'
  1101. int pthread_mutexattr_destroy (pthread_mutexattr_t *);
  1102. ^~~~~~~~~~~~~~~~~~~
  1103. pthread_mutex_init
  1104. C:/MinGW/msys/1.0/include/pthread.h:142:53: error: expected primary-expression before ')' token
  1105. int pthread_mutexattr_destroy (pthread_mutexattr_t *);
  1106. ^
  1107. C:/MinGW/msys/1.0/include/pthread.h:143:45: error: 'pthread_mutexattr_t' does not name a type; did you mean 'pthread_mutex_init'?
  1108. int pthread_mutexattr_getprioceiling (const pthread_mutexattr_t *, int *);
  1109. ^~~~~~~~~~~~~~~~~~~
  1110. pthread_mutex_init
  1111. C:/MinGW/msys/1.0/include/pthread.h:144:42: error: 'pthread_mutexattr_t' does not name a type; did you mean 'pthread_mutex_init'?
  1112. int pthread_mutexattr_getprotocol (const pthread_mutexattr_t *, int *);
  1113. ^~~~~~~~~~~~~~~~~~~
  1114. pthread_mutex_init
  1115. C:/MinGW/msys/1.0/include/pthread.h:145:41: error: 'pthread_mutexattr_t' does not name a type; did you mean 'pthread_mutex_init'?
  1116. int pthread_mutexattr_getpshared (const pthread_mutexattr_t *, int *);
  1117. ^~~~~~~~~~~~~~~~~~~
  1118. pthread_mutex_init
  1119. C:/MinGW/msys/1.0/include/pthread.h:146:38: error: 'pthread_mutexattr_t' does not name a type; did you mean 'pthread_mutex_init'?
  1120. int pthread_mutexattr_gettype (const pthread_mutexattr_t *, int *);
  1121. ^~~~~~~~~~~~~~~~~~~
  1122. pthread_mutex_init
  1123. C:/MinGW/msys/1.0/include/pthread.h:147:29: error: 'pthread_mutexattr_t' was not declared in this scope
  1124. int pthread_mutexattr_init (pthread_mutexattr_t *);
  1125. ^~~~~~~~~~~~~~~~~~~
  1126. C:/MinGW/msys/1.0/include/pthread.h:147:29: note: suggested alternative: 'pthread_mutexattr_init'
  1127. int pthread_mutexattr_init (pthread_mutexattr_t *);
  1128. ^~~~~~~~~~~~~~~~~~~
  1129. pthread_mutexattr_init
  1130. C:/MinGW/msys/1.0/include/pthread.h:147:50: error: expected primary-expression before ')' token
  1131. int pthread_mutexattr_init (pthread_mutexattr_t *);
  1132. ^
  1133. C:/MinGW/msys/1.0/include/pthread.h:148:39: error: 'pthread_mutexattr_t' was not declared in this scope
  1134. int pthread_mutexattr_setprioceiling (pthread_mutexattr_t *, int);
  1135. ^~~~~~~~~~~~~~~~~~~
  1136. C:/MinGW/msys/1.0/include/pthread.h:148:39: note: suggested alternative: 'pthread_mutexattr_init'
  1137. int pthread_mutexattr_setprioceiling (pthread_mutexattr_t *, int);
  1138. ^~~~~~~~~~~~~~~~~~~
  1139. pthread_mutexattr_init
  1140. C:/MinGW/msys/1.0/include/pthread.h:148:60: error: expected primary-expression before ',' token
  1141. int pthread_mutexattr_setprioceiling (pthread_mutexattr_t *, int);
  1142. ^
  1143. C:/MinGW/msys/1.0/include/pthread.h:148:62: error: expected primary-expression before 'int'
  1144. int pthread_mutexattr_setprioceiling (pthread_mutexattr_t *, int);
  1145. ^~~
  1146. C:/MinGW/msys/1.0/include/pthread.h:148:65: error: expression list treated as compound expression in initializer [-fpermissive]
  1147. int pthread_mutexattr_setprioceiling (pthread_mutexattr_t *, int);
  1148. ^
  1149. C:/MinGW/msys/1.0/include/pthread.h:149:36: error: 'pthread_mutexattr_t' was not declared in this scope
  1150. int pthread_mutexattr_setprotocol (pthread_mutexattr_t *, int);
  1151. ^~~~~~~~~~~~~~~~~~~
  1152. C:/MinGW/msys/1.0/include/pthread.h:149:36: note: suggested alternative: 'pthread_mutexattr_init'
  1153. int pthread_mutexattr_setprotocol (pthread_mutexattr_t *, int);
  1154. ^~~~~~~~~~~~~~~~~~~
  1155. pthread_mutexattr_init
  1156. C:/MinGW/msys/1.0/include/pthread.h:149:57: error: expected primary-expression before ',' token
  1157. int pthread_mutexattr_setprotocol (pthread_mutexattr_t *, int);
  1158. ^
  1159. C:/MinGW/msys/1.0/include/pthread.h:149:59: error: expected primary-expression before 'int'
  1160. int pthread_mutexattr_setprotocol (pthread_mutexattr_t *, int);
  1161. ^~~
  1162. C:/MinGW/msys/1.0/include/pthread.h:149:62: error: expression list treated as compound expression in initializer [-fpermissive]
  1163. int pthread_mutexattr_setprotocol (pthread_mutexattr_t *, int);
  1164. ^
  1165. C:/MinGW/msys/1.0/include/pthread.h:150:35: error: 'pthread_mutexattr_t' was not declared in this scope
  1166. int pthread_mutexattr_setpshared (pthread_mutexattr_t *, int);
  1167. ^~~~~~~~~~~~~~~~~~~
  1168. C:/MinGW/msys/1.0/include/pthread.h:150:35: note: suggested alternative: 'pthread_mutexattr_init'
  1169. int pthread_mutexattr_setpshared (pthread_mutexattr_t *, int);
  1170. ^~~~~~~~~~~~~~~~~~~
  1171. pthread_mutexattr_init
  1172. C:/MinGW/msys/1.0/include/pthread.h:150:56: error: expected primary-expression before ',' token
  1173. int pthread_mutexattr_setpshared (pthread_mutexattr_t *, int);
  1174. ^
  1175. C:/MinGW/msys/1.0/include/pthread.h:150:58: error: expected primary-expression before 'int'
  1176. int pthread_mutexattr_setpshared (pthread_mutexattr_t *, int);
  1177. ^~~
  1178. C:/MinGW/msys/1.0/include/pthread.h:150:61: error: expression list treated as compound expression in initializer [-fpermissive]
  1179. int pthread_mutexattr_setpshared (pthread_mutexattr_t *, int);
  1180. ^
  1181. C:/MinGW/msys/1.0/include/pthread.h:151:32: error: 'pthread_mutexattr_t' was not declared in this scope
  1182. int pthread_mutexattr_settype (pthread_mutexattr_t *, int);
  1183. ^~~~~~~~~~~~~~~~~~~
  1184. C:/MinGW/msys/1.0/include/pthread.h:151:32: note: suggested alternative: 'pthread_mutexattr_init'
  1185. int pthread_mutexattr_settype (pthread_mutexattr_t *, int);
  1186. ^~~~~~~~~~~~~~~~~~~
  1187. pthread_mutexattr_init
  1188. C:/MinGW/msys/1.0/include/pthread.h:151:53: error: expected primary-expression before ',' token
  1189. int pthread_mutexattr_settype (pthread_mutexattr_t *, int);
  1190. ^
  1191. C:/MinGW/msys/1.0/include/pthread.h:151:55: error: expected primary-expression before 'int'
  1192. int pthread_mutexattr_settype (pthread_mutexattr_t *, int);
  1193. ^~~
  1194. C:/MinGW/msys/1.0/include/pthread.h:151:58: error: expression list treated as compound expression in initializer [-fpermissive]
  1195. int pthread_mutexattr_settype (pthread_mutexattr_t *, int);
  1196. ^
  1197. C:/MinGW/msys/1.0/include/pthread.h:153:19: error: 'pthread_once_t' was not declared in this scope
  1198. int pthread_once (pthread_once_t *, void (*)(void));
  1199. ^~~~~~~~~~~~~~
  1200. C:/MinGW/msys/1.0/include/pthread.h:153:19: note: suggested alternative: 'pthread_once'
  1201. int pthread_once (pthread_once_t *, void (*)(void));
  1202. ^~~~~~~~~~~~~~
  1203. pthread_once
  1204. C:/MinGW/msys/1.0/include/pthread.h:153:35: error: expected primary-expression before ',' token
  1205. int pthread_once (pthread_once_t *, void (*)(void));
  1206. ^
  1207. C:/MinGW/msys/1.0/include/pthread.h:153:37: error: expected primary-expression before 'void'
  1208. int pthread_once (pthread_once_t *, void (*)(void));
  1209. ^~~~
  1210. C:/MinGW/msys/1.0/include/pthread.h:153:51: error: expression list treated as compound expression in initializer [-fpermissive]
  1211. int pthread_once (pthread_once_t *, void (*)(void));
  1212. ^
  1213. C:/MinGW/msys/1.0/include/pthread.h:160:1: error: 'pthread_t' does not name a type; did you mean 'pthread_exit'?
  1214. pthread_t pthread_self (void);
  1215. ^~~~~~~~~
  1216. pthread_exit
  1217. C:/MinGW/msys/1.0/include/pthread.h:163:28: error: 'pthread_t' was not declared in this scope
  1218. int pthread_setschedparam (pthread_t, int, const struct sched_param *);
  1219. ^~~~~~~~~
  1220. C:/MinGW/msys/1.0/include/pthread.h:163:28: note: suggested alternative: 'pthread_exit'
  1221. int pthread_setschedparam (pthread_t, int, const struct sched_param *);
  1222. ^~~~~~~~~
  1223. pthread_exit
  1224. C:/MinGW/msys/1.0/include/pthread.h:163:39: error: expected primary-expression before 'int'
  1225. int pthread_setschedparam (pthread_t, int, const struct sched_param *);
  1226. ^~~
  1227. C:/MinGW/msys/1.0/include/pthread.h:163:44: error: expected primary-expression before 'const'
  1228. int pthread_setschedparam (pthread_t, int, const struct sched_param *);
  1229. ^~~~~
  1230. C:/MinGW/msys/1.0/include/pthread.h:163:70: error: expression list treated as compound expression in initializer [-fpermissive]
  1231. int pthread_setschedparam (pthread_t, int, const struct sched_param *);
  1232. ^
  1233. C:/MinGW/msys/1.0/include/pthread.h:164:26: error: 'pthread_key_t' was not declared in this scope
  1234. int pthread_setspecific (pthread_key_t, const void *);
  1235. ^~~~~~~~~~~~~
  1236. C:/MinGW/msys/1.0/include/pthread.h:164:26: note: suggested alternative: 'pthread_exit'
  1237. int pthread_setspecific (pthread_key_t, const void *);
  1238. ^~~~~~~~~~~~~
  1239. pthread_exit
  1240. C:/MinGW/msys/1.0/include/pthread.h:164:41: error: expected primary-expression before 'const'
  1241. int pthread_setspecific (pthread_key_t, const void *);
  1242. ^~~~~
  1243. C:/MinGW/msys/1.0/include/pthread.h:164:53: error: expression list treated as compound expression in initializer [-fpermissive]
  1244. int pthread_setspecific (pthread_key_t, const void *);
  1245. ^
  1246. C:/MinGW/msys/1.0/include/pthread.h:169:22: error: 'pthread_t' was not declared in this scope
  1247. int pthread_suspend (pthread_t);
  1248. ^~~~~~~~~
  1249. C:/MinGW/msys/1.0/include/pthread.h:169:22: note: suggested alternative: 'pthread_exit'
  1250. int pthread_suspend (pthread_t);
  1251. ^~~~~~~~~
  1252. pthread_exit
  1253. C:/MinGW/msys/1.0/include/pthread.h:170:23: error: 'pthread_t' was not declared in this scope
  1254. int pthread_continue (pthread_t);
  1255. ^~~~~~~~~
  1256. C:/MinGW/msys/1.0/include/pthread.h:170:23: note: suggested alternative: 'pthread_exit'
  1257. int pthread_continue (pthread_t);
  1258. ^~~~~~~~~
  1259. pthread_exit
  1260. In file included from c:/Qt14/Tools/mingw810_64/lib/gcc/x86_64-w64-mingw32/8.1.0/include/c++/x86_64-w64-mingw32/bits/gthr.h:148,
  1261. from c:/Qt14/Tools/mingw810_64/lib/gcc/x86_64-w64-mingw32/8.1.0/include/c++/ext/atomicity.h:35,
  1262. from c:/Qt14/Tools/mingw810_64/lib/gcc/x86_64-w64-mingw32/8.1.0/include/c++/bits/basic_string.h:39,
  1263. from c:/Qt14/Tools/mingw810_64/lib/gcc/x86_64-w64-mingw32/8.1.0/include/c++/string:52,
  1264. from C:/Qt14/5.15.0/mingw81_64/include/QtCore/qbytearray.h:52,
  1265. from C:/Qt14/5.15.0/mingw81_64/include/QtCore/qstring.h:50,
  1266. from C:/Qt14/5.15.0/mingw81_64/include/QtPrintSupport/qprinter.h:44,
  1267. from C:/Qt14/5.15.0/mingw81_64/include/QtPrintSupport/QPrinter:1,
  1268. from Impresora.h:16,
  1269. from Impresora.cpp:13:
  1270. c:/Qt14/Tools/mingw810_64/lib/gcc/x86_64-w64-mingw32/8.1.0/include/c++/x86_64-w64-mingw32/bits/gthr-default.h:47:9: error: 'pthread_t' does not name a type; did you mean 'pthread_exit'?
  1271. typedef pthread_t __gthread_t;
  1272. ^~~~~~~~~
  1273. pthread_exit
  1274. c:/Qt14/Tools/mingw810_64/lib/gcc/x86_64-w64-mingw32/8.1.0/include/c++/x86_64-w64-mingw32/bits/gthr-default.h:48:9: error: 'pthread_key_t' does not name a type; did you mean 'pthread_exit'?
  1275. typedef pthread_key_t __gthread_key_t;
  1276. ^~~~~~~~~~~~~
  1277. pthread_exit
  1278. c:/Qt14/Tools/mingw810_64/lib/gcc/x86_64-w64-mingw32/8.1.0/include/c++/x86_64-w64-mingw32/bits/gthr-default.h:49:9: error: 'pthread_once_t' does not name a type; did you mean 'pthread_once'?
  1279. typedef pthread_once_t __gthread_once_t;
  1280. ^~~~~~~~~~~~~~
  1281. pthread_once
  1282. c:/Qt14/Tools/mingw810_64/lib/gcc/x86_64-w64-mingw32/8.1.0/include/c++/x86_64-w64-mingw32/bits/gthr-default.h:50:9: error: 'pthread_mutex_t' does not name a type; did you mean 'pthread_mutex_init'?
  1283. typedef pthread_mutex_t __gthread_mutex_t;
  1284. ^~~~~~~~~~~~~~~
  1285. pthread_mutex_init
  1286. c:/Qt14/Tools/mingw810_64/lib/gcc/x86_64-w64-mingw32/8.1.0/include/c++/x86_64-w64-mingw32/bits/gthr-default.h:51:9: error: 'pthread_mutex_t' does not name a type; did you mean 'pthread_mutex_init'?
  1287. typedef pthread_mutex_t __gthread_recursive_mutex_t;
  1288. ^~~~~~~~~~~~~~~
  1289. pthread_mutex_init
  1290. c:/Qt14/Tools/mingw810_64/lib/gcc/x86_64-w64-mingw32/8.1.0/include/c++/x86_64-w64-mingw32/bits/gthr-default.h:52:9: error: 'pthread_cond_t' does not name a type; did you mean 'pthread_cond_wait'?
  1291. typedef pthread_cond_t __gthread_cond_t;
  1292. ^~~~~~~~~~~~~~
  1293. pthread_cond_wait
  1294. c:/Qt14/Tools/mingw810_64/lib/gcc/x86_64-w64-mingw32/8.1.0/include/c++/x86_64-w64-mingw32/bits/gthr-default.h:659:19: error: '__gthread_t' was not declared in this scope
  1295. __gthread_create (__gthread_t *__threadid, void *(*__func) (void*),
  1296. ^~~~~~~~~~~
  1297. c:/Qt14/Tools/mingw810_64/lib/gcc/x86_64-w64-mingw32/8.1.0/include/c++/x86_64-w64-mingw32/bits/gthr-default.h:659:19: note: suggested alternative: '__threadid'
  1298. __gthread_create (__gthread_t *__threadid, void *(*__func) (void*),
  1299. ^~~~~~~~~~~
  1300. __threadid
  1301. c:/Qt14/Tools/mingw810_64/lib/gcc/x86_64-w64-mingw32/8.1.0/include/c++/x86_64-w64-mingw32/bits/gthr-default.h:659:44: error: expected primary-expression before 'void'
  1302. __gthread_create (__gthread_t *__threadid, void *(*__func) (void*),
  1303. ^~~~
  1304. c:/Qt14/Tools/mingw810_64/lib/gcc/x86_64-w64-mingw32/8.1.0/include/c++/x86_64-w64-mingw32/bits/gthr-default.h:660:5: error: expected primary-expression before 'void'
  1305. void *__args)
  1306. ^~~~
  1307. c:/Qt14/Tools/mingw810_64/lib/gcc/x86_64-w64-mingw32/8.1.0/include/c++/x86_64-w64-mingw32/bits/gthr-default.h:660:17: error: expression list treated as compound expression in initializer [-fpermissive]
  1308. void *__args)
  1309. ^
  1310. c:/Qt14/Tools/mingw810_64/lib/gcc/x86_64-w64-mingw32/8.1.0/include/c++/x86_64-w64-mingw32/bits/gthr-default.h:666:17: error: '__gthread_t' was not declared in this scope
  1311. __gthread_join (__gthread_t __threadid, void **__value_ptr)
  1312. ^~~~~~~~~~~
  1313. c:/Qt14/Tools/mingw810_64/lib/gcc/x86_64-w64-mingw32/8.1.0/include/c++/x86_64-w64-mingw32/bits/gthr-default.h:666:17: note: suggested alternative: '__threadid'
  1314. __gthread_join (__gthread_t __threadid, void **__value_ptr)
  1315. ^~~~~~~~~~~
  1316. __threadid
  1317. c:/Qt14/Tools/mingw810_64/lib/gcc/x86_64-w64-mingw32/8.1.0/include/c++/x86_64-w64-mingw32/bits/gthr-default.h:666:41: error: expected primary-expression before 'void'
  1318. __gthread_join (__gthread_t __threadid, void **__value_ptr)
  1319. ^~~~
  1320. c:/Qt14/Tools/mingw810_64/lib/gcc/x86_64-w64-mingw32/8.1.0/include/c++/x86_64-w64-mingw32/bits/gthr-default.h:666:59: error: expression list treated as compound expression in initializer [-fpermissive]
  1321. __gthread_join (__gthread_t __threadid, void **__value_ptr)
  1322. ^
  1323. c:/Qt14/Tools/mingw810_64/lib/gcc/x86_64-w64-mingw32/8.1.0/include/c++/x86_64-w64-mingw32/bits/gthr-default.h:672:19: error: '__gthread_t' was not declared in this scope
  1324. __gthread_detach (__gthread_t __threadid)
  1325. ^~~~~~~~~~~
  1326. c:/Qt14/Tools/mingw810_64/lib/gcc/x86_64-w64-mingw32/8.1.0/include/c++/x86_64-w64-mingw32/bits/gthr-default.h:672:19: note: suggested alternative: '__threadid'
  1327. __gthread_detach (__gthread_t __threadid)
  1328. ^~~~~~~~~~~
  1329. __threadid
  1330. c:/Qt14/Tools/mingw810_64/lib/gcc/x86_64-w64-mingw32/8.1.0/include/c++/x86_64-w64-mingw32/bits/gthr-default.h:678:18: error: '__gthread_t' was not declared in this scope
  1331. __gthread_equal (__gthread_t __t1, __gthread_t __t2)
  1332. ^~~~~~~~~~~
  1333. c:/Qt14/Tools/mingw810_64/lib/gcc/x86_64-w64-mingw32/8.1.0/include/c++/x86_64-w64-mingw32/bits/gthr-default.h:678:18: note: suggested alternative: '__threadid'
  1334. __gthread_equal (__gthread_t __t1, __gthread_t __t2)
  1335. ^~~~~~~~~~~
  1336. __threadid
  1337. c:/Qt14/Tools/mingw810_64/lib/gcc/x86_64-w64-mingw32/8.1.0/include/c++/x86_64-w64-mingw32/bits/gthr-default.h:678:36: error: '__gthread_t' was not declared in this scope
  1338. __gthread_equal (__gthread_t __t1, __gthread_t __t2)
  1339. ^~~~~~~~~~~
  1340. c:/Qt14/Tools/mingw810_64/lib/gcc/x86_64-w64-mingw32/8.1.0/include/c++/x86_64-w64-mingw32/bits/gthr-default.h:678:36: note: suggested alternative: '__threadid'
  1341. __gthread_equal (__gthread_t __t1, __gthread_t __t2)
  1342. ^~~~~~~~~~~
  1343. __threadid
  1344. c:/Qt14/Tools/mingw810_64/lib/gcc/x86_64-w64-mingw32/8.1.0/include/c++/x86_64-w64-mingw32/bits/gthr-default.h:678:52: error: expression list treated as compound expression in initializer [-fpermissive]
  1345. __gthread_equal (__gthread_t __t1, __gthread_t __t2)
  1346. ^
  1347. c:/Qt14/Tools/mingw810_64/lib/gcc/x86_64-w64-mingw32/8.1.0/include/c++/x86_64-w64-mingw32/bits/gthr-default.h:683:15: error: '__gthread_t' does not name a type; did you mean '__threadid'?
  1348. static inline __gthread_t
  1349. ^~~~~~~~~~~
  1350. __threadid
  1351. c:/Qt14/Tools/mingw810_64/lib/gcc/x86_64-w64-mingw32/8.1.0/include/c++/x86_64-w64-mingw32/bits/gthr-default.h:696:17: error: '__gthread_once_t' was not declared in this scope
  1352. __gthread_once (__gthread_once_t *__once, void (*__func) (void))
  1353. ^~~~~~~~~~~~~~~~
  1354. c:/Qt14/Tools/mingw810_64/lib/gcc/x86_64-w64-mingw32/8.1.0/include/c++/x86_64-w64-mingw32/bits/gthr-default.h:696:17: note: suggested alternative: '__gthread_once'
  1355. __gthread_once (__gthread_once_t *__once, void (*__func) (void))
  1356. ^~~~~~~~~~~~~~~~
  1357. __gthread_once
  1358. c:/Qt14/Tools/mingw810_64/lib/gcc/x86_64-w64-mingw32/8.1.0/include/c++/x86_64-w64-mingw32/bits/gthr-default.h:696:35: error: '__once' was not declared in this scope
  1359. __gthread_once (__gthread_once_t *__once, void (*__func) (void))
  1360. ^~~~~~
  1361. c:/Qt14/Tools/mingw810_64/lib/gcc/x86_64-w64-mingw32/8.1.0/include/c++/x86_64-w64-mingw32/bits/gthr-default.h:696:50: error: '__func' was not declared in this scope
  1362. __gthread_once (__gthread_once_t *__once, void (*__func) (void))
  1363. ^~~~~~
  1364. c:/Qt14/Tools/mingw810_64/lib/gcc/x86_64-w64-mingw32/8.1.0/include/c++/x86_64-w64-mingw32/bits/gthr-default.h:696:59: error: expected primary-expression before 'void'
  1365. __gthread_once (__gthread_once_t *__once, void (*__func) (void))
  1366. ^~~~
  1367. c:/Qt14/Tools/mingw810_64/lib/gcc/x86_64-w64-mingw32/8.1.0/include/c++/x86_64-w64-mingw32/bits/gthr-default.h:696:64: error: expression list treated as compound expression in initializer [-fpermissive]
  1368. __gthread_once (__gthread_once_t *__once, void (*__func) (void))
  1369. ^
  1370. c:/Qt14/Tools/mingw810_64/lib/gcc/x86_64-w64-mingw32/8.1.0/include/c++/x86_64-w64-mingw32/bits/gthr-default.h:705:23: error: '__gthread_key_t' was not declared in this scope
  1371. __gthread_key_create (__gthread_key_t *__key, void (*__dtor) (void *))
  1372. ^~~~~~~~~~~~~~~
  1373. c:/Qt14/Tools/mingw810_64/lib/gcc/x86_64-w64-mingw32/8.1.0/include/c++/x86_64-w64-mingw32/bits/gthr-default.h:705:23: note: suggested alternative: '__gthread_time_t'
  1374. __gthread_key_create (__gthread_key_t *__key, void (*__dtor) (void *))
  1375. ^~~~~~~~~~~~~~~
  1376. __gthread_time_t
  1377. c:/Qt14/Tools/mingw810_64/lib/gcc/x86_64-w64-mingw32/8.1.0/include/c++/x86_64-w64-mingw32/bits/gthr-default.h:705:40: error: '__key' was not declared in this scope
  1378. __gthread_key_create (__gthread_key_t *__key, void (*__dtor) (void *))
  1379. ^~~~~
  1380. c:/Qt14/Tools/mingw810_64/lib/gcc/x86_64-w64-mingw32/8.1.0/include/c++/x86_64-w64-mingw32/bits/gthr-default.h:705:54: error: '__dtor' was not declared in this scope
  1381. __gthread_key_create (__gthread_key_t *__key, void (*__dtor) (void *))
  1382. ^~~~~~
  1383. c:/Qt14/Tools/mingw810_64/lib/gcc/x86_64-w64-mingw32/8.1.0/include/c++/x86_64-w64-mingw32/bits/gthr-default.h:705:54: note: suggested alternative: '_dtoa_r'
  1384. __gthread_key_create (__gthread_key_t *__key, void (*__dtor) (void *))
  1385. ^~~~~~
  1386. _dtoa_r
  1387. c:/Qt14/Tools/mingw810_64/lib/gcc/x86_64-w64-mingw32/8.1.0/include/c++/x86_64-w64-mingw32/bits/gthr-default.h:705:63: error: expected primary-expression before 'void'
  1388. __gthread_key_create (__gthread_key_t *__key, void (*__dtor) (void *))
  1389. ^~~~
  1390. c:/Qt14/Tools/mingw810_64/lib/gcc/x86_64-w64-mingw32/8.1.0/include/c++/x86_64-w64-mingw32/bits/gthr-default.h:705:70: error: expression list treated as compound expression in initializer [-fpermissive]
  1391. __gthread_key_create (__gthread_key_t *__key, void (*__dtor) (void *))
  1392. ^
  1393. c:/Qt14/Tools/mingw810_64/lib/gcc/x86_64-w64-mingw32/8.1.0/include/c++/x86_64-w64-mingw32/bits/gthr-default.h:711:23: error: '__gthread_key_t' was not declared in this scope
  1394. __gthread_key_delete (__gthread_key_t __key)
  1395. ^~~~~~~~~~~~~~~
  1396. c:/Qt14/Tools/mingw810_64/lib/gcc/x86_64-w64-mingw32/8.1.0/include/c++/x86_64-w64-mingw32/bits/gthr-default.h:711:23: note: suggested alternative: '__gthread_time_t'
  1397. __gthread_key_delete (__gthread_key_t __key)
  1398. ^~~~~~~~~~~~~~~
  1399. __gthread_time_t
  1400. c:/Qt14/Tools/mingw810_64/lib/gcc/x86_64-w64-mingw32/8.1.0/include/c++/x86_64-w64-mingw32/bits/gthr-default.h:717:24: error: '__gthread_key_t' was not declared in this scope
  1401. __gthread_getspecific (__gthread_key_t __key)
  1402. ^~~~~~~~~~~~~~~
  1403. c:/Qt14/Tools/mingw810_64/lib/gcc/x86_64-w64-mingw32/8.1.0/include/c++/x86_64-w64-mingw32/bits/gthr-default.h:717:24: note: suggested alternative: '__gthread_time_t'
  1404. __gthread_getspecific (__gthread_key_t __key)
  1405. ^~~~~~~~~~~~~~~
  1406. __gthread_time_t
  1407. c:/Qt14/Tools/mingw810_64/lib/gcc/x86_64-w64-mingw32/8.1.0/include/c++/x86_64-w64-mingw32/bits/gthr-default.h:723:24: error: '__gthread_key_t' was not declared in this scope
  1408. __gthread_setspecific (__gthread_key_t __key, const void *__ptr)
  1409. ^~~~~~~~~~~~~~~
  1410. c:/Qt14/Tools/mingw810_64/lib/gcc/x86_64-w64-mingw32/8.1.0/include/c++/x86_64-w64-mingw32/bits/gthr-default.h:723:24: note: suggested alternative: '__gthread_time_t'
  1411. __gthread_setspecific (__gthread_key_t __key, const void *__ptr)
  1412. ^~~~~~~~~~~~~~~
  1413. __gthread_time_t
  1414. c:/Qt14/Tools/mingw810_64/lib/gcc/x86_64-w64-mingw32/8.1.0/include/c++/x86_64-w64-mingw32/bits/gthr-default.h:723:47: error: expected primary-expression before 'const'
  1415. __gthread_setspecific (__gthread_key_t __key, const void *__ptr)
  1416. ^~~~~
  1417. c:/Qt14/Tools/mingw810_64/lib/gcc/x86_64-w64-mingw32/8.1.0/include/c++/x86_64-w64-mingw32/bits/gthr-default.h:723:64: error: expression list treated as compound expression in initializer [-fpermissive]
  1418. __gthread_setspecific (__gthread_key_t __key, const void *__ptr)
  1419. ^
  1420. c:/Qt14/Tools/mingw810_64/lib/gcc/x86_64-w64-mingw32/8.1.0/include/c++/x86_64-w64-mingw32/bits/gthr-default.h:729:32: error: variable or field '__gthread_mutex_init_function' declared void
  1421. __gthread_mutex_init_function (__gthread_mutex_t *__mutex)
  1422. ^~~~~~~~~~~~~~~~~
  1423. c:/Qt14/Tools/mingw810_64/lib/gcc/x86_64-w64-mingw32/8.1.0/include/c++/x86_64-w64-mingw32/bits/gthr-default.h:729:32: error: '__gthread_mutex_t' was not declared in this scope
  1424. c:/Qt14/Tools/mingw810_64/lib/gcc/x86_64-w64-mingw32/8.1.0/include/c++/x86_64-w64-mingw32/bits/gthr-default.h:729:32: note: suggested alternative: '__gthread_time_t'
  1425. __gthread_mutex_init_function (__gthread_mutex_t *__mutex)
  1426. ^~~~~~~~~~~~~~~~~
  1427. __gthread_time_t
  1428. c:/Qt14/Tools/mingw810_64/lib/gcc/x86_64-w64-mingw32/8.1.0/include/c++/x86_64-w64-mingw32/bits/gthr-default.h:729:51: error: '__mutex' was not declared in this scope
  1429. __gthread_mutex_init_function (__gthread_mutex_t *__mutex)
  1430. ^~~~~~~
  1431. c:/Qt14/Tools/mingw810_64/lib/gcc/x86_64-w64-mingw32/8.1.0/include/c++/x86_64-w64-mingw32/bits/gthr-default.h:729:51: note: suggested alternative: '__multc3'
  1432. __gthread_mutex_init_function (__gthread_mutex_t *__mutex)
  1433. ^~~~~~~
  1434. __multc3
  1435. c:/Qt14/Tools/mingw810_64/lib/gcc/x86_64-w64-mingw32/8.1.0/include/c++/x86_64-w64-mingw32/bits/gthr-default.h:736:26: error: '__gthread_mutex_t' was not declared in this scope
  1436. __gthread_mutex_destroy (__gthread_mutex_t *__mutex)
  1437. ^~~~~~~~~~~~~~~~~
  1438. c:/Qt14/Tools/mingw810_64/lib/gcc/x86_64-w64-mingw32/8.1.0/include/c++/x86_64-w64-mingw32/bits/gthr-default.h:736:26: note: suggested alternative: '__gthread_time_t'
  1439. __gthread_mutex_destroy (__gthread_mutex_t *__mutex)
  1440. ^~~~~~~~~~~~~~~~~
  1441. __gthread_time_t
  1442. c:/Qt14/Tools/mingw810_64/lib/gcc/x86_64-w64-mingw32/8.1.0/include/c++/x86_64-w64-mingw32/bits/gthr-default.h:736:45: error: '__mutex' was not declared in this scope
  1443. __gthread_mutex_destroy (__gthread_mutex_t *__mutex)
  1444. ^~~~~~~
  1445. c:/Qt14/Tools/mingw810_64/lib/gcc/x86_64-w64-mingw32/8.1.0/include/c++/x86_64-w64-mingw32/bits/gthr-default.h:736:45: note: suggested alternative: '__multc3'
  1446. __gthread_mutex_destroy (__gthread_mutex_t *__mutex)
  1447. ^~~~~~~
  1448. __multc3
  1449. c:/Qt14/Tools/mingw810_64/lib/gcc/x86_64-w64-mingw32/8.1.0/include/c++/x86_64-w64-mingw32/bits/gthr-default.h:745:23: error: '__gthread_mutex_t' was not declared in this scope
  1450. __gthread_mutex_lock (__gthread_mutex_t *__mutex)
  1451. ^~~~~~~~~~~~~~~~~
  1452. c:/Qt14/Tools/mingw810_64/lib/gcc/x86_64-w64-mingw32/8.1.0/include/c++/x86_64-w64-mingw32/bits/gthr-default.h:745:23: note: suggested alternative: '__gthread_mutex_lock'
  1453. __gthread_mutex_lock (__gthread_mutex_t *__mutex)
  1454. ^~~~~~~~~~~~~~~~~
  1455. __gthread_mutex_lock
  1456. c:/Qt14/Tools/mingw810_64/lib/gcc/x86_64-w64-mingw32/8.1.0/include/c++/x86_64-w64-mingw32/bits/gthr-default.h:745:42: error: '__mutex' was not declared in this scope
  1457. __gthread_mutex_lock (__gthread_mutex_t *__mutex)
  1458. ^~~~~~~
  1459. c:/Qt14/Tools/mingw810_64/lib/gcc/x86_64-w64-mingw32/8.1.0/include/c++/x86_64-w64-mingw32/bits/gthr-default.h:745:42: note: suggested alternative: '__multc3'
  1460. __gthread_mutex_lock (__gthread_mutex_t *__mutex)
  1461. ^~~~~~~
  1462. __multc3
  1463. c:/Qt14/Tools/mingw810_64/lib/gcc/x86_64-w64-mingw32/8.1.0/include/c++/x86_64-w64-mingw32/bits/gthr-default.h:754:26: error: '__gthread_mutex_t' was not declared in this scope
  1464. __gthread_mutex_trylock (__gthread_mutex_t *__mutex)
  1465. ^~~~~~~~~~~~~~~~~
  1466. c:/Qt14/Tools/mingw810_64/lib/gcc/x86_64-w64-mingw32/8.1.0/include/c++/x86_64-w64-mingw32/bits/gthr-default.h:754:26: note: suggested alternative: '__gthread_mutex_lock'
  1467. __gthread_mutex_trylock (__gthread_mutex_t *__mutex)
  1468. ^~~~~~~~~~~~~~~~~
  1469. __gthread_mutex_lock
  1470. c:/Qt14/Tools/mingw810_64/lib/gcc/x86_64-w64-mingw32/8.1.0/include/c++/x86_64-w64-mingw32/bits/gthr-default.h:754:45: error: '__mutex' was not declared in this scope
  1471. __gthread_mutex_trylock (__gthread_mutex_t *__mutex)
  1472. ^~~~~~~
  1473. c:/Qt14/Tools/mingw810_64/lib/gcc/x86_64-w64-mingw32/8.1.0/include/c++/x86_64-w64-mingw32/bits/gthr-default.h:754:45: note: suggested alternative: '__multc3'
  1474. __gthread_mutex_trylock (__gthread_mutex_t *__mutex)
  1475. ^~~~~~~
  1476. __multc3
  1477. c:/Qt14/Tools/mingw810_64/lib/gcc/x86_64-w64-mingw32/8.1.0/include/c++/x86_64-w64-mingw32/bits/gthr-default.h:764:28: error: '__gthread_mutex_t' was not declared in this scope
  1478. __gthread_mutex_timedlock (__gthread_mutex_t *__mutex,
  1479. ^~~~~~~~~~~~~~~~~
  1480. c:/Qt14/Tools/mingw810_64/lib/gcc/x86_64-w64-mingw32/8.1.0/include/c++/x86_64-w64-mingw32/bits/gthr-default.h:764:28: note: suggested alternative: '__gthread_mutex_lock'
  1481. __gthread_mutex_timedlock (__gthread_mutex_t *__mutex,
  1482. ^~~~~~~~~~~~~~~~~
  1483. __gthread_mutex_lock
  1484. c:/Qt14/Tools/mingw810_64/lib/gcc/x86_64-w64-mingw32/8.1.0/include/c++/x86_64-w64-mingw32/bits/gthr-default.h:764:47: error: '__mutex' was not declared in this scope
  1485. __gthread_mutex_timedlock (__gthread_mutex_t *__mutex,
  1486. ^~~~~~~
  1487. c:/Qt14/Tools/mingw810_64/lib/gcc/x86_64-w64-mingw32/8.1.0/include/c++/x86_64-w64-mingw32/bits/gthr-default.h:764:47: note: suggested alternative: '__multc3'
  1488. __gthread_mutex_timedlock (__gthread_mutex_t *__mutex,
  1489. ^~~~~~~
  1490. __multc3
  1491. c:/Qt14/Tools/mingw810_64/lib/gcc/x86_64-w64-mingw32/8.1.0/include/c++/x86_64-w64-mingw32/bits/gthr-default.h:765:7: error: expected primary-expression before 'const'
  1492. const __gthread_time_t *__abs_timeout)
  1493. ^~~~~
  1494. c:/Qt14/Tools/mingw810_64/lib/gcc/x86_64-w64-mingw32/8.1.0/include/c++/x86_64-w64-mingw32/bits/gthr-default.h:765:44: error: expression list treated as compound expression in initializer [-fpermissive]
  1495. const __gthread_time_t *__abs_timeout)
  1496. ^
  1497. c:/Qt14/Tools/mingw810_64/lib/gcc/x86_64-w64-mingw32/8.1.0/include/c++/x86_64-w64-mingw32/bits/gthr-default.h:775:25: error: '__gthread_mutex_t' was not declared in this scope
  1498. __gthread_mutex_unlock (__gthread_mutex_t *__mutex)
  1499. ^~~~~~~~~~~~~~~~~
  1500. c:/Qt14/Tools/mingw810_64/lib/gcc/x86_64-w64-mingw32/8.1.0/include/c++/x86_64-w64-mingw32/bits/gthr-default.h:775:25: note: suggested alternative: '__gthread_mutex_lock'
  1501. __gthread_mutex_unlock (__gthread_mutex_t *__mutex)
  1502. ^~~~~~~~~~~~~~~~~
  1503. __gthread_mutex_lock
  1504. c:/Qt14/Tools/mingw810_64/lib/gcc/x86_64-w64-mingw32/8.1.0/include/c++/x86_64-w64-mingw32/bits/gthr-default.h:775:44: error: '__mutex' was not declared in this scope
  1505. __gthread_mutex_unlock (__gthread_mutex_t *__mutex)
  1506. ^~~~~~~
  1507. c:/Qt14/Tools/mingw810_64/lib/gcc/x86_64-w64-mingw32/8.1.0/include/c++/x86_64-w64-mingw32/bits/gthr-default.h:775:44: note: suggested alternative: '__multc3'
  1508. __gthread_mutex_unlock (__gthread_mutex_t *__mutex)
  1509. ^~~~~~~
  1510. __multc3
  1511. c:/Qt14/Tools/mingw810_64/lib/gcc/x86_64-w64-mingw32/8.1.0/include/c++/x86_64-w64-mingw32/bits/gthr-default.h:786:42: error: '__gthread_recursive_mutex_t' was not declared in this scope
  1512. __gthread_recursive_mutex_init_function (__gthread_recursive_mutex_t *__mutex)
  1513. ^~~~~~~~~~~~~~~~~~~~~~~~~~~
  1514. c:/Qt14/Tools/mingw810_64/lib/gcc/x86_64-w64-mingw32/8.1.0/include/c++/x86_64-w64-mingw32/bits/gthr-default.h:786:42: note: suggested alternative: '__gthread_recursive_mutex_init_function'
  1515. __gthread_recursive_mutex_init_function (__gthread_recursive_mutex_t *__mutex)
  1516. ^~~~~~~~~~~~~~~~~~~~~~~~~~~
  1517. __gthread_recursive_mutex_init_function
  1518. c:/Qt14/Tools/mingw810_64/lib/gcc/x86_64-w64-mingw32/8.1.0/include/c++/x86_64-w64-mingw32/bits/gthr-default.h:786:71: error: '__mutex' was not declared in this scope
  1519. __gthread_recursive_mutex_init_function (__gthread_recursive_mutex_t *__mutex)
  1520. ^~~~~~~
  1521. c:/Qt14/Tools/mingw810_64/lib/gcc/x86_64-w64-mingw32/8.1.0/include/c++/x86_64-w64-mingw32/bits/gthr-default.h:786:71: note: suggested alternative: '__multc3'
  1522. __gthread_recursive_mutex_init_function (__gthread_recursive_mutex_t *__mutex)
  1523. ^~~~~~~
  1524. __multc3
  1525. c:/Qt14/Tools/mingw810_64/lib/gcc/x86_64-w64-mingw32/8.1.0/include/c++/x86_64-w64-mingw32/bits/gthr-default.h:808:33: error: '__gthread_recursive_mutex_t' was not declared in this scope
  1526. __gthread_recursive_mutex_lock (__gthread_recursive_mutex_t *__mutex)
  1527. ^~~~~~~~~~~~~~~~~~~~~~~~~~~
  1528. c:/Qt14/Tools/mingw810_64/lib/gcc/x86_64-w64-mingw32/8.1.0/include/c++/x86_64-w64-mingw32/bits/gthr-default.h:808:33: note: suggested alternative: '__gthread_recursive_mutex_lock'
  1529. __gthread_recursive_mutex_lock (__gthread_recursive_mutex_t *__mutex)
  1530. ^~~~~~~~~~~~~~~~~~~~~~~~~~~
  1531. __gthread_recursive_mutex_lock
  1532. c:/Qt14/Tools/mingw810_64/lib/gcc/x86_64-w64-mingw32/8.1.0/include/c++/x86_64-w64-mingw32/bits/gthr-default.h:808:62: error: '__mutex' was not declared in this scope
  1533. __gthread_recursive_mutex_lock (__gthread_recursive_mutex_t *__mutex)
  1534. ^~~~~~~
  1535. c:/Qt14/Tools/mingw810_64/lib/gcc/x86_64-w64-mingw32/8.1.0/include/c++/x86_64-w64-mingw32/bits/gthr-default.h:808:62: note: suggested alternative: '__multc3'
  1536. __gthread_recursive_mutex_lock (__gthread_recursive_mutex_t *__mutex)
  1537. ^~~~~~~
  1538. __multc3
  1539. c:/Qt14/Tools/mingw810_64/lib/gcc/x86_64-w64-mingw32/8.1.0/include/c++/x86_64-w64-mingw32/bits/gthr-default.h:814:36: error: '__gthread_recursive_mutex_t' was not declared in this scope
  1540. __gthread_recursive_mutex_trylock (__gthread_recursive_mutex_t *__mutex)
  1541. ^~~~~~~~~~~~~~~~~~~~~~~~~~~
  1542. c:/Qt14/Tools/mingw810_64/lib/gcc/x86_64-w64-mingw32/8.1.0/include/c++/x86_64-w64-mingw32/bits/gthr-default.h:814:36: note: suggested alternative: '__gthread_recursive_mutex_lock'
  1543. __gthread_recursive_mutex_trylock (__gthread_recursive_mutex_t *__mutex)
  1544. ^~~~~~~~~~~~~~~~~~~~~~~~~~~
  1545. __gthread_recursive_mutex_lock
  1546. c:/Qt14/Tools/mingw810_64/lib/gcc/x86_64-w64-mingw32/8.1.0/include/c++/x86_64-w64-mingw32/bits/gthr-default.h:814:65: error: '__mutex' was not declared in this scope
  1547. __gthread_recursive_mutex_trylock (__gthread_recursive_mutex_t *__mutex)
  1548. ^~~~~~~
  1549. c:/Qt14/Tools/mingw810_64/lib/gcc/x86_64-w64-mingw32/8.1.0/include/c++/x86_64-w64-mingw32/bits/gthr-default.h:814:65: note: suggested alternative: '__multc3'
  1550. __gthread_recursive_mutex_trylock (__gthread_recursive_mutex_t *__mutex)
  1551. ^~~~~~~
  1552. __multc3
  1553. c:/Qt14/Tools/mingw810_64/lib/gcc/x86_64-w64-mingw32/8.1.0/include/c++/x86_64-w64-mingw32/bits/gthr-default.h:821:38: error: '__gthread_recursive_mutex_t' was not declared in this scope
  1554. __gthread_recursive_mutex_timedlock (__gthread_recursive_mutex_t *__mutex,
  1555. ^~~~~~~~~~~~~~~~~~~~~~~~~~~
  1556. c:/Qt14/Tools/mingw810_64/lib/gcc/x86_64-w64-mingw32/8.1.0/include/c++/x86_64-w64-mingw32/bits/gthr-default.h:821:38: note: suggested alternative: '__gthread_recursive_mutex_lock'
  1557. __gthread_recursive_mutex_timedlock (__gthread_recursive_mutex_t *__mutex,
  1558. ^~~~~~~~~~~~~~~~~~~~~~~~~~~
  1559. __gthread_recursive_mutex_lock
  1560. c:/Qt14/Tools/mingw810_64/lib/gcc/x86_64-w64-mingw32/8.1.0/include/c++/x86_64-w64-mingw32/bits/gthr-default.h:821:67: error: '__mutex' was not declared in this scope
  1561. __gthread_recursive_mutex_timedlock (__gthread_recursive_mutex_t *__mutex,
  1562. ^~~~~~~
  1563. c:/Qt14/Tools/mingw810_64/lib/gcc/x86_64-w64-mingw32/8.1.0/include/c++/x86_64-w64-mingw32/bits/gthr-default.h:821:67: note: suggested alternative: '__multc3'
  1564. __gthread_recursive_mutex_timedlock (__gthread_recursive_mutex_t *__mutex,
  1565. ^~~~~~~
  1566. __multc3
  1567. c:/Qt14/Tools/mingw810_64/lib/gcc/x86_64-w64-mingw32/8.1.0/include/c++/x86_64-w64-mingw32/bits/gthr-default.h:822:10: error: expected primary-expression before 'const'
  1568. const __gthread_time_t *__abs_timeout)
  1569. ^~~~~
  1570. c:/Qt14/Tools/mingw810_64/lib/gcc/x86_64-w64-mingw32/8.1.0/include/c++/x86_64-w64-mingw32/bits/gthr-default.h:822:47: error: expression list treated as compound expression in initializer [-fpermissive]
  1571. const __gthread_time_t *__abs_timeout)
  1572. ^
  1573. c:/Qt14/Tools/mingw810_64/lib/gcc/x86_64-w64-mingw32/8.1.0/include/c++/x86_64-w64-mingw32/bits/gthr-default.h:829:35: error: '__gthread_recursive_mutex_t' was not declared in this scope
  1574. __gthread_recursive_mutex_unlock (__gthread_recursive_mutex_t *__mutex)
  1575. ^~~~~~~~~~~~~~~~~~~~~~~~~~~
  1576. c:/Qt14/Tools/mingw810_64/lib/gcc/x86_64-w64-mingw32/8.1.0/include/c++/x86_64-w64-mingw32/bits/gthr-default.h:829:35: note: suggested alternative: '__gthread_recursive_mutex_lock'
  1577. __gthread_recursive_mutex_unlock (__gthread_recursive_mutex_t *__mutex)
  1578. ^~~~~~~~~~~~~~~~~~~~~~~~~~~
  1579. __gthread_recursive_mutex_lock
  1580. c:/Qt14/Tools/mingw810_64/lib/gcc/x86_64-w64-mingw32/8.1.0/include/c++/x86_64-w64-mingw32/bits/gthr-default.h:829:64: error: '__mutex' was not declared in this scope
  1581. __gthread_recursive_mutex_unlock (__gthread_recursive_mutex_t *__mutex)
  1582. ^~~~~~~
  1583. c:/Qt14/Tools/mingw810_64/lib/gcc/x86_64-w64-mingw32/8.1.0/include/c++/x86_64-w64-mingw32/bits/gthr-default.h:829:64: note: suggested alternative: '__multc3'
  1584. __gthread_recursive_mutex_unlock (__gthread_recursive_mutex_t *__mutex)
  1585. ^~~~~~~
  1586. __multc3
  1587. c:/Qt14/Tools/mingw810_64/lib/gcc/x86_64-w64-mingw32/8.1.0/include/c++/x86_64-w64-mingw32/bits/gthr-default.h:835:36: error: '__gthread_recursive_mutex_t' was not declared in this scope
  1588. __gthread_recursive_mutex_destroy (__gthread_recursive_mutex_t *__mutex)
  1589. ^~~~~~~~~~~~~~~~~~~~~~~~~~~
  1590. c:/Qt14/Tools/mingw810_64/lib/gcc/x86_64-w64-mingw32/8.1.0/include/c++/x86_64-w64-mingw32/bits/gthr-default.h:835:36: note: suggested alternative: '__gthread_recursive_mutex_lock'
  1591. __gthread_recursive_mutex_destroy (__gthread_recursive_mutex_t *__mutex)
  1592. ^~~~~~~~~~~~~~~~~~~~~~~~~~~
  1593. __gthread_recursive_mutex_lock
  1594. c:/Qt14/Tools/mingw810_64/lib/gcc/x86_64-w64-mingw32/8.1.0/include/c++/x86_64-w64-mingw32/bits/gthr-default.h:835:65: error: '__mutex' was not declared in this scope
  1595. __gthread_recursive_mutex_destroy (__gthread_recursive_mutex_t *__mutex)
  1596. ^~~~~~~
  1597. c:/Qt14/Tools/mingw810_64/lib/gcc/x86_64-w64-mingw32/8.1.0/include/c++/x86_64-w64-mingw32/bits/gthr-default.h:835:65: note: suggested alternative: '__multc3'
  1598. __gthread_recursive_mutex_destroy (__gthread_recursive_mutex_t *__mutex)
  1599. ^~~~~~~
  1600. __multc3
  1601. c:/Qt14/Tools/mingw810_64/lib/gcc/x86_64-w64-mingw32/8.1.0/include/c++/x86_64-w64-mingw32/bits/gthr-default.h:850:27: error: '__gthread_cond_t' was not declared in this scope
  1602. __gthread_cond_broadcast (__gthread_cond_t *__cond)
  1603. ^~~~~~~~~~~~~~~~
  1604. c:/Qt14/Tools/mingw810_64/lib/gcc/x86_64-w64-mingw32/8.1.0/include/c++/x86_64-w64-mingw32/bits/gthr-default.h:850:27: note: suggested alternative: '__gthread_once'
  1605. __gthread_cond_broadcast (__gthread_cond_t *__cond)
  1606. ^~~~~~~~~~~~~~~~
  1607. __gthread_once
  1608. c:/Qt14/Tools/mingw810_64/lib/gcc/x86_64-w64-mingw32/8.1.0/include/c++/x86_64-w64-mingw32/bits/gthr-default.h:850:45: error: '__cond' was not declared in this scope
  1609. __gthread_cond_broadcast (__gthread_cond_t *__cond)
  1610. ^~~~~~
  1611. c:/Qt14/Tools/mingw810_64/lib/gcc/x86_64-w64-mingw32/8.1.0/include/c++/x86_64-w64-mingw32/bits/gthr-default.h:850:45: note: suggested alternative: 'u_long'
  1612. __gthread_cond_broadcast (__gthread_cond_t *__cond)
  1613. ^~~~~~
  1614. u_long
  1615. c:/Qt14/Tools/mingw810_64/lib/gcc/x86_64-w64-mingw32/8.1.0/include/c++/x86_64-w64-mingw32/bits/gthr-default.h:856:24: error: '__gthread_cond_t' was not declared in this scope
  1616. __gthread_cond_signal (__gthread_cond_t *__cond)
  1617. ^~~~~~~~~~~~~~~~
  1618. c:/Qt14/Tools/mingw810_64/lib/gcc/x86_64-w64-mingw32/8.1.0/include/c++/x86_64-w64-mingw32/bits/gthr-default.h:856:24: note: suggested alternative: '__gthread_once'
  1619. __gthread_cond_signal (__gthread_cond_t *__cond)
  1620. ^~~~~~~~~~~~~~~~
  1621. __gthread_once
  1622. c:/Qt14/Tools/mingw810_64/lib/gcc/x86_64-w64-mingw32/8.1.0/include/c++/x86_64-w64-mingw32/bits/gthr-default.h:856:42: error: '__cond' was not declared in this scope
  1623. __gthread_cond_signal (__gthread_cond_t *__cond)
  1624. ^~~~~~
  1625. c:/Qt14/Tools/mingw810_64/lib/gcc/x86_64-w64-mingw32/8.1.0/include/c++/x86_64-w64-mingw32/bits/gthr-default.h:856:42: note: suggested alternative: 'u_long'
  1626. __gthread_cond_signal (__gthread_cond_t *__cond)
  1627. ^~~~~~
  1628. u_long
  1629. c:/Qt14/Tools/mingw810_64/lib/gcc/x86_64-w64-mingw32/8.1.0/include/c++/x86_64-w64-mingw32/bits/gthr-default.h:862:22: error: '__gthread_cond_t' was not declared in this scope
  1630. __gthread_cond_wait (__gthread_cond_t *__cond, __gthread_mutex_t *__mutex)
  1631. ^~~~~~~~~~~~~~~~
  1632. c:/Qt14/Tools/mingw810_64/lib/gcc/x86_64-w64-mingw32/8.1.0/include/c++/x86_64-w64-mingw32/bits/gthr-default.h:862:22: note: suggested alternative: '__gthread_cond_wait'
  1633. __gthread_cond_wait (__gthread_cond_t *__cond, __gthread_mutex_t *__mutex)
  1634. ^~~~~~~~~~~~~~~~
  1635. __gthread_cond_wait
  1636. c:/Qt14/Tools/mingw810_64/lib/gcc/x86_64-w64-mingw32/8.1.0/include/c++/x86_64-w64-mingw32/bits/gthr-default.h:862:40: error: '__cond' was not declared in this scope
  1637. __gthread_cond_wait (__gthread_cond_t *__cond, __gthread_mutex_t *__mutex)
  1638. ^~~~~~
  1639. c:/Qt14/Tools/mingw810_64/lib/gcc/x86_64-w64-mingw32/8.1.0/include/c++/x86_64-w64-mingw32/bits/gthr-default.h:862:40: note: suggested alternative: 'u_long'
  1640. __gthread_cond_wait (__gthread_cond_t *__cond, __gthread_mutex_t *__mutex)
  1641. ^~~~~~
  1642. u_long
  1643. c:/Qt14/Tools/mingw810_64/lib/gcc/x86_64-w64-mingw32/8.1.0/include/c++/x86_64-w64-mingw32/bits/gthr-default.h:862:48: error: '__gthread_mutex_t' was not declared in this scope
  1644. __gthread_cond_wait (__gthread_cond_t *__cond, __gthread_mutex_t *__mutex)
  1645. ^~~~~~~~~~~~~~~~~
  1646. c:/Qt14/Tools/mingw810_64/lib/gcc/x86_64-w64-mingw32/8.1.0/include/c++/x86_64-w64-mingw32/bits/gthr-default.h:862:48: note: suggested alternative: '__gthread_mutex_lock'
  1647. __gthread_cond_wait (__gthread_cond_t *__cond, __gthread_mutex_t *__mutex)
  1648. ^~~~~~~~~~~~~~~~~
  1649. __gthread_mutex_lock
  1650. c:/Qt14/Tools/mingw810_64/lib/gcc/x86_64-w64-mingw32/8.1.0/include/c++/x86_64-w64-mingw32/bits/gthr-default.h:862:67: error: '__mutex' was not declared in this scope
  1651. __gthread_cond_wait (__gthread_cond_t *__cond, __gthread_mutex_t *__mutex)
  1652. ^~~~~~~
  1653. c:/Qt14/Tools/mingw810_64/lib/gcc/x86_64-w64-mingw32/8.1.0/include/c++/x86_64-w64-mingw32/bits/gthr-default.h:862:67: note: suggested alternative: '__multc3'
  1654. __gthread_cond_wait (__gthread_cond_t *__cond, __gthread_mutex_t *__mutex)
  1655. ^~~~~~~
  1656. __multc3
  1657. c:/Qt14/Tools/mingw810_64/lib/gcc/x86_64-w64-mingw32/8.1.0/include/c++/x86_64-w64-mingw32/bits/gthr-default.h:862:74: error: expression list treated as compound expression in initializer [-fpermissive]
  1658. __gthread_cond_wait (__gthread_cond_t *__cond, __gthread_mutex_t *__mutex)
  1659. ^
  1660. c:/Qt14/Tools/mingw810_64/lib/gcc/x86_64-w64-mingw32/8.1.0/include/c++/x86_64-w64-mingw32/bits/gthr-default.h:868:27: error: '__gthread_cond_t' was not declared in this scope
  1661. __gthread_cond_timedwait (__gthread_cond_t *__cond, __gthread_mutex_t *__mutex,
  1662. ^~~~~~~~~~~~~~~~
  1663. c:/Qt14/Tools/mingw810_64/lib/gcc/x86_64-w64-mingw32/8.1.0/include/c++/x86_64-w64-mingw32/bits/gthr-default.h:868:27: note: suggested alternative: '__gthread_cond_wait'
  1664. __gthread_cond_timedwait (__gthread_cond_t *__cond, __gthread_mutex_t *__mutex,
  1665. ^~~~~~~~~~~~~~~~
  1666. __gthread_cond_wait
  1667. c:/Qt14/Tools/mingw810_64/lib/gcc/x86_64-w64-mingw32/8.1.0/include/c++/x86_64-w64-mingw32/bits/gthr-default.h:868:45: error: '__cond' was not declared in this scope
  1668. __gthread_cond_timedwait (__gthread_cond_t *__cond, __gthread_mutex_t *__mutex,
  1669. ^~~~~~
  1670. c:/Qt14/Tools/mingw810_64/lib/gcc/x86_64-w64-mingw32/8.1.0/include/c++/x86_64-w64-mingw32/bits/gthr-default.h:868:45: note: suggested alternative: 'u_long'
  1671. __gthread_cond_timedwait (__gthread_cond_t *__cond, __gthread_mutex_t *__mutex,
  1672. ^~~~~~
  1673. u_long
  1674. c:/Qt14/Tools/mingw810_64/lib/gcc/x86_64-w64-mingw32/8.1.0/include/c++/x86_64-w64-mingw32/bits/gthr-default.h:868:53: error: '__gthread_mutex_t' was not declared in this scope
  1675. __gthread_cond_timedwait (__gthread_cond_t *__cond, __gthread_mutex_t *__mutex,
  1676. ^~~~~~~~~~~~~~~~~
  1677. c:/Qt14/Tools/mingw810_64/lib/gcc/x86_64-w64-mingw32/8.1.0/include/c++/x86_64-w64-mingw32/bits/gthr-default.h:868:53: note: suggested alternative: '__gthread_mutex_lock'
  1678. __gthread_cond_timedwait (__gthread_cond_t *__cond, __gthread_mutex_t *__mutex,
  1679. ^~~~~~~~~~~~~~~~~
  1680. __gthread_mutex_lock
  1681. c:/Qt14/Tools/mingw810_64/lib/gcc/x86_64-w64-mingw32/8.1.0/include/c++/x86_64-w64-mingw32/bits/gthr-default.h:868:72: error: '__mutex' was not declared in this scope
  1682. __gthread_cond_timedwait (__gthread_cond_t *__cond, __gthread_mutex_t *__mutex,
  1683. ^~~~~~~
  1684. c:/Qt14/Tools/mingw810_64/lib/gcc/x86_64-w64-mingw32/8.1.0/include/c++/x86_64-w64-mingw32/bits/gthr-default.h:868:72: note: suggested alternative: '__multc3'
  1685. __gthread_cond_timedwait (__gthread_cond_t *__cond, __gthread_mutex_t *__mutex,
  1686. ^~~~~~~
  1687. __multc3
  1688. c:/Qt14/Tools/mingw810_64/lib/gcc/x86_64-w64-mingw32/8.1.0/include/c++/x86_64-w64-mingw32/bits/gthr-default.h:869:6: error: expected primary-expression before 'const'
  1689. const __gthread_time_t *__abs_timeout)
  1690. ^~~~~
  1691. c:/Qt14/Tools/mingw810_64/lib/gcc/x86_64-w64-mingw32/8.1.0/include/c++/x86_64-w64-mingw32/bits/gthr-default.h:869:43: error: expression list treated as compound expression in initializer [-fpermissive]
  1692. const __gthread_time_t *__abs_timeout)
  1693. ^
  1694. c:/Qt14/Tools/mingw810_64/lib/gcc/x86_64-w64-mingw32/8.1.0/include/c++/x86_64-w64-mingw32/bits/gthr-default.h:875:32: error: '__gthread_cond_t' was not declared in this scope
  1695. __gthread_cond_wait_recursive (__gthread_cond_t *__cond,
  1696. ^~~~~~~~~~~~~~~~
  1697. c:/Qt14/Tools/mingw810_64/lib/gcc/x86_64-w64-mingw32/8.1.0/include/c++/x86_64-w64-mingw32/bits/gthr-default.h:875:32: note: suggested alternative: '__gthread_cond_wait'
  1698. __gthread_cond_wait_recursive (__gthread_cond_t *__cond,
  1699. ^~~~~~~~~~~~~~~~
  1700. __gthread_cond_wait
  1701. c:/Qt14/Tools/mingw810_64/lib/gcc/x86_64-w64-mingw32/8.1.0/include/c++/x86_64-w64-mingw32/bits/gthr-default.h:875:50: error: '__cond' was not declared in this scope
  1702. __gthread_cond_wait_recursive (__gthread_cond_t *__cond,
  1703. ^~~~~~
  1704. c:/Qt14/Tools/mingw810_64/lib/gcc/x86_64-w64-mingw32/8.1.0/include/c++/x86_64-w64-mingw32/bits/gthr-default.h:875:50: note: suggested alternative: 'u_long'
  1705. __gthread_cond_wait_recursive (__gthread_cond_t *__cond,
  1706. ^~~~~~
  1707. u_long
  1708. c:/Qt14/Tools/mingw810_64/lib/gcc/x86_64-w64-mingw32/8.1.0/include/c++/x86_64-w64-mingw32/bits/gthr-default.h:876:11: error: '__gthread_recursive_mutex_t' was not declared in this scope
  1709. __gthread_recursive_mutex_t *__mutex)
  1710. ^~~~~~~~~~~~~~~~~~~~~~~~~~~
  1711. c:/Qt14/Tools/mingw810_64/lib/gcc/x86_64-w64-mingw32/8.1.0/include/c++/x86_64-w64-mingw32/bits/gthr-default.h:876:11: note: suggested alternative: '__gthread_recursive_mutex_lock'
  1712. __gthread_recursive_mutex_t *__mutex)
  1713. ^~~~~~~~~~~~~~~~~~~~~~~~~~~
  1714. __gthread_recursive_mutex_lock
  1715. c:/Qt14/Tools/mingw810_64/lib/gcc/x86_64-w64-mingw32/8.1.0/include/c++/x86_64-w64-mingw32/bits/gthr-default.h:876:40: error: '__mutex' was not declared in this scope
  1716. __gthread_recursive_mutex_t *__mutex)
  1717. ^~~~~~~
  1718. c:/Qt14/Tools/mingw810_64/lib/gcc/x86_64-w64-mingw32/8.1.0/include/c++/x86_64-w64-mingw32/bits/gthr-default.h:876:40: note: suggested alternative: '__multc3'
  1719. __gthread_recursive_mutex_t *__mutex)
  1720. ^~~~~~~
  1721. __multc3
  1722. c:/Qt14/Tools/mingw810_64/lib/gcc/x86_64-w64-mingw32/8.1.0/include/c++/x86_64-w64-mingw32/bits/gthr-default.h:876:47: error: expression list treated as compound expression in initializer [-fpermissive]
  1723. __gthread_recursive_mutex_t *__mutex)
  1724. ^
  1725. c:/Qt14/Tools/mingw810_64/lib/gcc/x86_64-w64-mingw32/8.1.0/include/c++/x86_64-w64-mingw32/bits/gthr-default.h:882:25: error: '__gthread_cond_t' was not declared in this scope
  1726. __gthread_cond_destroy (__gthread_cond_t* __cond)
  1727. ^~~~~~~~~~~~~~~~
  1728. c:/Qt14/Tools/mingw810_64/lib/gcc/x86_64-w64-mingw32/8.1.0/include/c++/x86_64-w64-mingw32/bits/gthr-default.h:882:25: note: suggested alternative: '__gthread_cond_wait'
  1729. __gthread_cond_destroy (__gthread_cond_t* __cond)
  1730. ^~~~~~~~~~~~~~~~
  1731. __gthread_cond_wait
  1732. c:/Qt14/Tools/mingw810_64/lib/gcc/x86_64-w64-mingw32/8.1.0/include/c++/x86_64-w64-mingw32/bits/gthr-default.h:882:43: error: '__cond' was not declared in this scope
  1733. __gthread_cond_destroy (__gthread_cond_t* __cond)
  1734. ^~~~~~
  1735. c:/Qt14/Tools/mingw810_64/lib/gcc/x86_64-w64-mingw32/8.1.0/include/c++/x86_64-w64-mingw32/bits/gthr-default.h:882:43: note: suggested alternative: 'u_long'
  1736. __gthread_cond_destroy (__gthread_cond_t* __cond)
  1737. ^~~~~~
  1738. u_long
  1739. In file included from C:/MinGW/msys/1.0/include/errno.h:1,
  1740. from c:/Qt14/Tools/mingw810_64/lib/gcc/x86_64-w64-mingw32/8.1.0/include/c++/cerrno:42,
  1741. from c:/Qt14/Tools/mingw810_64/lib/gcc/x86_64-w64-mingw32/8.1.0/include/c++/ext/string_conversions.h:44,
  1742. from c:/Qt14/Tools/mingw810_64/lib/gcc/x86_64-w64-mingw32/8.1.0/include/c++/bits/basic_string.h:6361,
  1743. from c:/Qt14/Tools/mingw810_64/lib/gcc/x86_64-w64-mingw32/8.1.0/include/c++/string:52,
  1744. from C:/Qt14/5.15.0/mingw81_64/include/QtCore/qbytearray.h:52,
  1745. from C:/Qt14/5.15.0/mingw81_64/include/QtCore/qstring.h:50,
  1746. from C:/Qt14/5.15.0/mingw81_64/include/QtPrintSupport/qprinter.h:44,
  1747. from C:/Qt14/5.15.0/mingw81_64/include/QtPrintSupport/QPrinter:1,
  1748. from Impresora.h:16,
  1749. from Impresora.cpp:13:
  1750. C:/MinGW/msys/1.0/include/sys/errno.h:20:51: error: conflicting declaration 'const char* const _sys_errlist []'
  1751. extern __IMPORT _CONST char * _CONST _sys_errlist[];
  1752. ^
  1753. In file included from c:/Qt14/Tools/mingw810_64/lib/gcc/x86_64-w64-mingw32/8.1.0/include/c++/cstdlib:75,
  1754. from c:/Qt14/Tools/mingw810_64/lib/gcc/x86_64-w64-mingw32/8.1.0/include/c++/bits/stl_algo.h:59,
  1755. from c:/Qt14/Tools/mingw810_64/lib/gcc/x86_64-w64-mingw32/8.1.0/include/c++/algorithm:62,
  1756. from C:/Qt14/5.15.0/mingw81_64/include/QtCore/qglobal.h:142,
  1757. from C:/Qt14/5.15.0/mingw81_64/include/QtGui/qtguiglobal.h:43,
  1758. from C:/Qt14/5.15.0/mingw81_64/include/QtWidgets/qtwidgetsglobal.h:43,
  1759. from C:/Qt14/5.15.0/mingw81_64/include/QtPrintSupport/qtprintsupportglobal.h:43,
  1760. from C:/Qt14/5.15.0/mingw81_64/include/QtPrintSupport/qprinter.h:43,
  1761. from C:/Qt14/5.15.0/mingw81_64/include/QtPrintSupport/QPrinter:1,
  1762. from Impresora.h:16,
  1763. from Impresora.cpp:13:
  1764. c:/Qt14/Tools/mingw810_64/x86_64-w64-mingw32/include/stdlib.h:172:38: note: previous declaration as 'char* _sys_errlist [1]'
  1765. extern __declspec(dllimport) char *_sys_errlist[1];
  1766. ^~~~~~~~~~~~
  1767. In file included from C:/MinGW/msys/1.0/include/errno.h:1,
  1768. from c:/Qt14/Tools/mingw810_64/lib/gcc/x86_64-w64-mingw32/8.1.0/include/c++/cerrno:42,
  1769. from c:/Qt14/Tools/mingw810_64/lib/gcc/x86_64-w64-mingw32/8.1.0/include/c++/ext/string_conversions.h:44,
  1770. from c:/Qt14/Tools/mingw810_64/lib/gcc/x86_64-w64-mingw32/8.1.0/include/c++/bits/basic_string.h:6361,
  1771. from c:/Qt14/Tools/mingw810_64/lib/gcc/x86_64-w64-mingw32/8.1.0/include/c++/string:52,
  1772. from C:/Qt14/5.15.0/mingw81_64/include/QtCore/qbytearray.h:52,
  1773. from C:/Qt14/5.15.0/mingw81_64/include/QtCore/qstring.h:50,
  1774. from C:/Qt14/5.15.0/mingw81_64/include/QtPrintSupport/qprinter.h:44,
  1775. from C:/Qt14/5.15.0/mingw81_64/include/QtPrintSupport/QPrinter:1,
  1776. from Impresora.h:16,
  1777. from Impresora.cpp:13:
  1778. C:/MinGW/msys/1.0/include/sys/errno.h:21:28: error: conflicting declaration 'const int _sys_nerr'
  1779. extern __IMPORT _CONST int _sys_nerr;
  1780. ^~~~~~~~~
  1781. In file included from c:/Qt14/Tools/mingw810_64/lib/gcc/x86_64-w64-mingw32/8.1.0/include/c++/cstdlib:75,
  1782. from c:/Qt14/Tools/mingw810_64/lib/gcc/x86_64-w64-mingw32/8.1.0/include/c++/bits/stl_algo.h:59,
  1783. from c:/Qt14/Tools/mingw810_64/lib/gcc/x86_64-w64-mingw32/8.1.0/include/c++/algorithm:62,
  1784. from C:/Qt14/5.15.0/mingw81_64/include/QtCore/qglobal.h:142,
  1785. from C:/Qt14/5.15.0/mingw81_64/include/QtGui/qtguiglobal.h:43,
  1786. from C:/Qt14/5.15.0/mingw81_64/include/QtWidgets/qtwidgetsglobal.h:43,
  1787. from C:/Qt14/5.15.0/mingw81_64/include/QtPrintSupport/qtprintsupportglobal.h:43,
  1788. from C:/Qt14/5.15.0/mingw81_64/include/QtPrintSupport/qprinter.h:43,
  1789. from C:/Qt14/5.15.0/mingw81_64/include/QtPrintSupport/QPrinter:1,
  1790. from Impresora.h:16,
  1791. from Impresora.cpp:13:
  1792. c:/Qt14/Tools/mingw810_64/x86_64-w64-mingw32/include/stdlib.h:173:36: note: previous declaration as 'int _sys_nerr'
  1793. extern __declspec(dllimport) int _sys_nerr;
  1794. ^~~~~~~~~
  1795. In file included from c:/Qt14/Tools/mingw810_64/lib/gcc/x86_64-w64-mingw32/8.1.0/include/c++/string:52,
  1796. from C:/Qt14/5.15.0/mingw81_64/include/QtCore/qbytearray.h:52,
  1797. from C:/Qt14/5.15.0/mingw81_64/include/QtCore/qstring.h:50,
  1798. from C:/Qt14/5.15.0/mingw81_64/include/QtPrintSupport/qprinter.h:44,
  1799. from C:/Qt14/5.15.0/mingw81_64/include/QtPrintSupport/QPrinter:1,
  1800. from Impresora.h:16,
  1801. from Impresora.cpp:13:
  1802. c:/Qt14/Tools/mingw810_64/lib/gcc/x86_64-w64-mingw32/8.1.0/include/c++/bits/basic_string.h: In function 'long long int std::__cxx11::stoll(const wstring&, std::size_t*, int)':
  1803. c:/Qt14/Tools/mingw810_64/lib/gcc/x86_64-w64-mingw32/8.1.0/include/c++/bits/basic_string.h:6493:36: error: 'wcstoll' is not a member of 'std'
  1804. { return __gnu_cxx::__stoa(&std::wcstoll, "stoll", __str.c_str(),
  1805. ^~~~~~~
  1806. c:/Qt14/Tools/mingw810_64/lib/gcc/x86_64-w64-mingw32/8.1.0/include/c++/bits/basic_string.h: In function 'long long unsigned int std::__cxx11::stoull(const wstring&, std::size_t*, int)':
  1807. c:/Qt14/Tools/mingw810_64/lib/gcc/x86_64-w64-mingw32/8.1.0/include/c++/bits/basic_string.h:6498:36: error: 'wcstoull' is not a member of 'std'
  1808. { return __gnu_cxx::__stoa(&std::wcstoull, "stoull", __str.c_str(),
  1809. ^~~~~~~~
  1810. c:/Qt14/Tools/mingw810_64/lib/gcc/x86_64-w64-mingw32/8.1.0/include/c++/bits/basic_string.h: In function 'std::__cxx11::wstring std::__cxx11::to_wstring(int)':
  1811. c:/Qt14/Tools/mingw810_64/lib/gcc/x86_64-w64-mingw32/8.1.0/include/c++/bits/basic_string.h:6518:51: error: 'vswprintf' is not a member of 'std'
  1812. { return __gnu_cxx::__to_xstring<wstring>(&std::vswprintf, 4 * sizeof(int),
  1813. ^~~~~~~~~
  1814. c:/Qt14/Tools/mingw810_64/lib/gcc/x86_64-w64-mingw32/8.1.0/include/c++/bits/basic_string.h:6518:51: note: suggested alternative: 'isprint'
  1815. { return __gnu_cxx::__to_xstring<wstring>(&std::vswprintf, 4 * sizeof(int),
  1816. ^~~~~~~~~
  1817. isprint
  1818. c:/Qt14/Tools/mingw810_64/lib/gcc/x86_64-w64-mingw32/8.1.0/include/c++/bits/basic_string.h: In function 'std::__cxx11::wstring std::__cxx11::to_wstring(unsigned int)':
  1819. c:/Qt14/Tools/mingw810_64/lib/gcc/x86_64-w64-mingw32/8.1.0/include/c++/bits/basic_string.h:6523:51: error: 'vswprintf' is not a member of 'std'
  1820. { return __gnu_cxx::__to_xstring<wstring>(&std::vswprintf,
  1821. ^~~~~~~~~
  1822. c:/Qt14/Tools/mingw810_64/lib/gcc/x86_64-w64-mingw32/8.1.0/include/c++/bits/basic_string.h:6523:51: note: suggested alternative: 'isprint'
  1823. { return __gnu_cxx::__to_xstring<wstring>(&std::vswprintf,
  1824. ^~~~~~~~~
  1825. isprint
  1826. c:/Qt14/Tools/mingw810_64/lib/gcc/x86_64-w64-mingw32/8.1.0/include/c++/bits/basic_string.h: In function 'std::__cxx11::wstring std::__cxx11::to_wstring(long int)':
  1827. c:/Qt14/Tools/mingw810_64/lib/gcc/x86_64-w64-mingw32/8.1.0/include/c++/bits/basic_string.h:6529:51: error: 'vswprintf' is not a member of 'std'
  1828. { return __gnu_cxx::__to_xstring<wstring>(&std::vswprintf, 4 * sizeof(long),
  1829. ^~~~~~~~~
  1830. c:/Qt14/Tools/mingw810_64/lib/gcc/x86_64-w64-mingw32/8.1.0/include/c++/bits/basic_string.h:6529:51: note: suggested alternative: 'isprint'
  1831. { return __gnu_cxx::__to_xstring<wstring>(&std::vswprintf, 4 * sizeof(long),
  1832. ^~~~~~~~~
  1833. isprint
  1834. c:/Qt14/Tools/mingw810_64/lib/gcc/x86_64-w64-mingw32/8.1.0/include/c++/bits/basic_string.h: In function 'std::__cxx11::wstring std::__cxx11::to_wstring(long unsigned int)':
  1835. c:/Qt14/Tools/mingw810_64/lib/gcc/x86_64-w64-mingw32/8.1.0/include/c++/bits/basic_string.h:6534:51: error: 'vswprintf' is not a member of 'std'
  1836. { return __gnu_cxx::__to_xstring<wstring>(&std::vswprintf,
  1837. ^~~~~~~~~
  1838. c:/Qt14/Tools/mingw810_64/lib/gcc/x86_64-w64-mingw32/8.1.0/include/c++/bits/basic_string.h:6534:51: note: suggested alternative: 'isprint'
  1839. { return __gnu_cxx::__to_xstring<wstring>(&std::vswprintf,
  1840. ^~~~~~~~~
  1841. isprint
  1842. c:/Qt14/Tools/mingw810_64/lib/gcc/x86_64-w64-mingw32/8.1.0/include/c++/bits/basic_string.h: In function 'std::__cxx11::wstring std::__cxx11::to_wstring(long long int)':
  1843. c:/Qt14/Tools/mingw810_64/lib/gcc/x86_64-w64-mingw32/8.1.0/include/c++/bits/basic_string.h:6540:51: error: 'vswprintf' is not a member of 'std'
  1844. { return __gnu_cxx::__to_xstring<wstring>(&std::vswprintf,
  1845. ^~~~~~~~~
  1846. c:/Qt14/Tools/mingw810_64/lib/gcc/x86_64-w64-mingw32/8.1.0/include/c++/bits/basic_string.h:6540:51: note: suggested alternative: 'isprint'
  1847. { return __gnu_cxx::__to_xstring<wstring>(&std::vswprintf,
  1848. ^~~~~~~~~
  1849. isprint
  1850. c:/Qt14/Tools/mingw810_64/lib/gcc/x86_64-w64-mingw32/8.1.0/include/c++/bits/basic_string.h: In function 'std::__cxx11::wstring std::__cxx11::to_wstring(long long unsigned int)':
  1851. c:/Qt14/Tools/mingw810_64/lib/gcc/x86_64-w64-mingw32/8.1.0/include/c++/bits/basic_string.h:6546:51: error: 'vswprintf' is not a member of 'std'
  1852. { return __gnu_cxx::__to_xstring<wstring>(&std::vswprintf,
  1853. ^~~~~~~~~
  1854. c:/Qt14/Tools/mingw810_64/lib/gcc/x86_64-w64-mingw32/8.1.0/include/c++/bits/basic_string.h:6546:51: note: suggested alternative: 'isprint'
  1855. { return __gnu_cxx::__to_xstring<wstring>(&std::vswprintf,
  1856. ^~~~~~~~~
  1857. isprint
  1858. c:/Qt14/Tools/mingw810_64/lib/gcc/x86_64-w64-mingw32/8.1.0/include/c++/bits/basic_string.h: In function 'std::__cxx11::wstring std::__cxx11::to_wstring(float)':
  1859. c:/Qt14/Tools/mingw810_64/lib/gcc/x86_64-w64-mingw32/8.1.0/include/c++/bits/basic_string.h:6555:51: error: 'vswprintf' is not a member of 'std'
  1860. return __gnu_cxx::__to_xstring<wstring>(&std::vswprintf, __n,
  1861. ^~~~~~~~~
  1862. c:/Qt14/Tools/mingw810_64/lib/gcc/x86_64-w64-mingw32/8.1.0/include/c++/bits/basic_string.h:6555:51: note: suggested alternative: 'isprint'
  1863. return __gnu_cxx::__to_xstring<wstring>(&std::vswprintf, __n,
  1864. ^~~~~~~~~
  1865. isprint
  1866. c:/Qt14/Tools/mingw810_64/lib/gcc/x86_64-w64-mingw32/8.1.0/include/c++/bits/basic_string.h: In function 'std::__cxx11::wstring std::__cxx11::to_wstring(double)':
  1867. c:/Qt14/Tools/mingw810_64/lib/gcc/x86_64-w64-mingw32/8.1.0/include/c++/bits/basic_string.h:6564:51: error: 'vswprintf' is not a member of 'std'
  1868. return __gnu_cxx::__to_xstring<wstring>(&std::vswprintf, __n,
  1869. ^~~~~~~~~
  1870. c:/Qt14/Tools/mingw810_64/lib/gcc/x86_64-w64-mingw32/8.1.0/include/c++/bits/basic_string.h:6564:51: note: suggested alternative: 'isprint'
  1871. return __gnu_cxx::__to_xstring<wstring>(&std::vswprintf, __n,
  1872. ^~~~~~~~~
  1873. isprint
  1874. c:/Qt14/Tools/mingw810_64/lib/gcc/x86_64-w64-mingw32/8.1.0/include/c++/bits/basic_string.h: In function 'std::__cxx11::wstring std::__cxx11::to_wstring(long double)':
  1875. c:/Qt14/Tools/mingw810_64/lib/gcc/x86_64-w64-mingw32/8.1.0/include/c++/bits/basic_string.h:6573:51: error: 'vswprintf' is not a member of 'std'
  1876. return __gnu_cxx::__to_xstring<wstring>(&std::vswprintf, __n,
  1877. ^~~~~~~~~
  1878. c:/Qt14/Tools/mingw810_64/lib/gcc/x86_64-w64-mingw32/8.1.0/include/c++/bits/basic_string.h:6573:51: note: suggested alternative: 'isprint'
  1879. return __gnu_cxx::__to_xstring<wstring>(&std::vswprintf, __n,
  1880. ^~~~~~~~~
  1881. isprint
  1882. In file included from c:/Qt14/Tools/mingw810_64/lib/gcc/x86_64-w64-mingw32/8.1.0/include/c++/bits/ios_base.h:41,
  1883. from c:/Qt14/Tools/mingw810_64/lib/gcc/x86_64-w64-mingw32/8.1.0/include/c++/ios:42,
  1884. from c:/Qt14/Tools/mingw810_64/lib/gcc/x86_64-w64-mingw32/8.1.0/include/c++/ostream:38,
  1885. from c:/Qt14/Tools/mingw810_64/lib/gcc/x86_64-w64-mingw32/8.1.0/include/c++/iterator:64,
  1886. from C:/Qt14/5.15.0/mingw81_64/include/QtCore/qbytearray.h:53,
  1887. from C:/Qt14/5.15.0/mingw81_64/include/QtCore/qstring.h:50,
  1888. from C:/Qt14/5.15.0/mingw81_64/include/QtPrintSupport/qprinter.h:44,
  1889. from C:/Qt14/5.15.0/mingw81_64/include/QtPrintSupport/QPrinter:1,
  1890. from Impresora.h:16,
  1891. from Impresora.cpp:13:
  1892. c:/Qt14/Tools/mingw810_64/lib/gcc/x86_64-w64-mingw32/8.1.0/include/c++/bits/locale_classes.h: At global scope:
  1893. c:/Qt14/Tools/mingw810_64/lib/gcc/x86_64-w64-mingw32/8.1.0/include/c++/bits/locale_classes.h:336:12: error: '__gthread_once_t' does not name a type; did you mean '__gthread_once'?
  1894. static __gthread_once_t _S_once;
  1895. ^~~~~~~~~~~~~~~~
  1896. __gthread_once
  1897. c:/Qt14/Tools/mingw810_64/lib/gcc/x86_64-w64-mingw32/8.1.0/include/c++/bits/locale_classes.h:386:12: error: '__gthread_once_t' does not name a type; did you mean '__gthread_once'?
  1898. static __gthread_once_t _S_once;
  1899. ^~~~~~~~~~~~~~~~
  1900. __gthread_once
  1901. In file included from c:/Qt14/Tools/mingw810_64/lib/gcc/x86_64-w64-mingw32/8.1.0/include/c++/system_error:39,
  1902. from c:/Qt14/Tools/mingw810_64/lib/gcc/x86_64-w64-mingw32/8.1.0/include/c++/bits/ios_base.h:46,
  1903. from c:/Qt14/Tools/mingw810_64/lib/gcc/x86_64-w64-mingw32/8.1.0/include/c++/ios:42,
  1904. from c:/Qt14/Tools/mingw810_64/lib/gcc/x86_64-w64-mingw32/8.1.0/include/c++/ostream:38,
  1905. from c:/Qt14/Tools/mingw810_64/lib/gcc/x86_64-w64-mingw32/8.1.0/include/c++/iterator:64,
  1906. from C:/Qt14/5.15.0/mingw81_64/include/QtCore/qbytearray.h:53,
  1907. from C:/Qt14/5.15.0/mingw81_64/include/QtCore/qstring.h:50,
  1908. from C:/Qt14/5.15.0/mingw81_64/include/QtPrintSupport/qprinter.h:44,
  1909. from C:/Qt14/5.15.0/mingw81_64/include/QtPrintSupport/QPrinter:1,
  1910. from Impresora.h:16,
  1911. from Impresora.cpp:13:
  1912. c:/Qt14/Tools/mingw810_64/lib/gcc/x86_64-w64-mingw32/8.1.0/include/c++/x86_64-w64-mingw32/bits/error_constants.h:73:34: error: 'EILSEQ' was not declared in this scope
  1913. illegal_byte_sequence = EILSEQ,
  1914. ^~~~~~
  1915. c:/Qt14/Tools/mingw810_64/lib/gcc/x86_64-w64-mingw32/8.1.0/include/c++/x86_64-w64-mingw32/bits/error_constants.h:73:34: note: suggested alternative: 'FILE'
  1916. illegal_byte_sequence = EILSEQ,
  1917. ^~~~~~
  1918. FILE
  1919. c:/Qt14/Tools/mingw810_64/lib/gcc/x86_64-w64-mingw32/8.1.0/include/c++/x86_64-w64-mingw32/bits/error_constants.h:119:31: error: 'ECANCELED' was not declared in this scope
  1920. operation_canceled = ECANCELED,
  1921. ^~~~~~~~~
  1922. c:/Qt14/Tools/mingw810_64/lib/gcc/x86_64-w64-mingw32/8.1.0/include/c++/x86_64-w64-mingw32/bits/error_constants.h:119:31: note: suggested alternative: 'WSAECANCELLED'
  1923. operation_canceled = ECANCELED,
  1924. ^~~~~~~~~
  1925. WSAECANCELLED
  1926. c:/Qt14/Tools/mingw810_64/lib/gcc/x86_64-w64-mingw32/8.1.0/include/c++/x86_64-w64-mingw32/bits/error_constants.h:129:24: error: 'EOWNERDEAD' was not declared in this scope
  1927. owner_dead = EOWNERDEAD,
  1928. ^~~~~~~~~~
  1929. c:/Qt14/Tools/mingw810_64/lib/gcc/x86_64-w64-mingw32/8.1.0/include/c++/x86_64-w64-mingw32/bits/error_constants.h:129:24: note: suggested alternative: 'TOKEN_READ'
  1930. owner_dead = EOWNERDEAD,
  1931. ^~~~~~~~~~
  1932. TOKEN_READ
  1933. c:/Qt14/Tools/mingw810_64/lib/gcc/x86_64-w64-mingw32/8.1.0/include/c++/x86_64-w64-mingw32/bits/error_constants.h:139:34: error: 'ENOTRECOVERABLE' was not declared in this scope
  1934. state_not_recoverable = ENOTRECOVERABLE,
  1935. ^~~~~~~~~~~~~~~
  1936. c:/Qt14/Tools/mingw810_64/lib/gcc/x86_64-w64-mingw32/8.1.0/include/c++/x86_64-w64-mingw32/bits/error_constants.h:139:34: note: suggested alternative: 'NO_RECOVERY'
  1937. state_not_recoverable = ENOTRECOVERABLE,
  1938. ^~~~~~~~~~~~~~~
  1939. NO_RECOVERY
  1940. c:/Qt14/Tools/mingw810_64/lib/gcc/x86_64-w64-mingw32/8.1.0/include/c++/x86_64-w64-mingw32/bits/error_constants.h:155:28: error: 'EOVERFLOW' was not declared in this scope
  1941. value_too_large = EOVERFLOW,
  1942. ^~~~~~~~~
  1943. c:/Qt14/Tools/mingw810_64/lib/gcc/x86_64-w64-mingw32/8.1.0/include/c++/x86_64-w64-mingw32/bits/error_constants.h:155:28: note: suggested alternative: 'OVERFLOW'
  1944. value_too_large = EOVERFLOW,
  1945. ^~~~~~~~~
  1946. OVERFLOW
  1947. In file included from c:/Qt14/Tools/mingw810_64/lib/gcc/x86_64-w64-mingw32/8.1.0/include/c++/cctype:42,
  1948. from c:/Qt14/Tools/mingw810_64/lib/gcc/x86_64-w64-mingw32/8.1.0/include/c++/bits/localefwd.h:42,
  1949. from c:/Qt14/Tools/mingw810_64/lib/gcc/x86_64-w64-mingw32/8.1.0/include/c++/string:43,
  1950. from C:/Qt14/5.15.0/mingw81_64/include/QtCore/qbytearray.h:52,
  1951. from C:/Qt14/5.15.0/mingw81_64/include/QtCore/qstring.h:50,
  1952. from C:/Qt14/5.15.0/mingw81_64/include/QtPrintSupport/qprinter.h:44,
  1953. from C:/Qt14/5.15.0/mingw81_64/include/QtPrintSupport/QPrinter:1,
  1954. from Impresora.h:16,
  1955. from Impresora.cpp:13:
  1956. c:/Qt14/Tools/mingw810_64/x86_64-w64-mingw32/include/wctype.h:135:29: error: expected ',' or '...' before numeric constant
  1957. int __cdecl iswblank(wint_t _C);
  1958. ^~
  1959. In file included from c:/Qt14/Tools/mingw810_64/lib/gcc/x86_64-w64-mingw32/8.1.0/include/c++/memory:74,
  1960. from C:/Qt14/5.15.0/mingw81_64/include/QtCore/qsharedpointer_impl.h:70,
  1961. from C:/Qt14/5.15.0/mingw81_64/include/QtCore/qsharedpointer.h:48,
  1962. from C:/Qt14/5.15.0/mingw81_64/include/QtGui/qpagelayout.h:44,
  1963. from C:/Qt14/5.15.0/mingw81_64/include/QtGui/qpagedpaintdevice.h:45,
  1964. from C:/Qt14/5.15.0/mingw81_64/include/QtPrintSupport/qprinter.h:46,
  1965. from C:/Qt14/5.15.0/mingw81_64/include/QtPrintSupport/QPrinter:1,
  1966. from Impresora.h:16,
  1967. from Impresora.cpp:13:
  1968. c:/Qt14/Tools/mingw810_64/lib/gcc/x86_64-w64-mingw32/8.1.0/include/c++/ext/concurrence.h:124:5: error: '__gthread_mutex_t' does not name a type; did you mean '__gthread_mutex_lock'?
  1969. __gthread_mutex_t _M_mutex;
  1970. ^~~~~~~~~~~~~~~~~
  1971. __gthread_mutex_lock
  1972. c:/Qt14/Tools/mingw810_64/lib/gcc/x86_64-w64-mingw32/8.1.0/include/c++/ext/concurrence.h:169:5: error: '__gthread_mutex_t' does not name a type; did you mean '__gthread_mutex_lock'?
  1973. __gthread_mutex_t* gthread_mutex(void)
  1974. ^~~~~~~~~~~~~~~~~
  1975. __gthread_mutex_lock
  1976. c:/Qt14/Tools/mingw810_64/lib/gcc/x86_64-w64-mingw32/8.1.0/include/c++/ext/concurrence.h: In constructor '__gnu_cxx::__mutex::__mutex()':
  1977. c:/Qt14/Tools/mingw810_64/lib/gcc/x86_64-w64-mingw32/8.1.0/include/c++/ext/concurrence.h:135:33: error: '_M_mutex' was not declared in this scope
  1978. __GTHREAD_MUTEX_INIT_FUNCTION(&_M_mutex);
  1979. ^~~~~~~~
  1980. c:/Qt14/Tools/mingw810_64/lib/gcc/x86_64-w64-mingw32/8.1.0/include/c++/ext/concurrence.h:135:33: note: suggested alternative: '__mutex'
  1981. __GTHREAD_MUTEX_INIT_FUNCTION(&_M_mutex);
  1982. ^~~~~~~~
  1983. __mutex
  1984. In file included from c:/Qt14/Tools/mingw810_64/lib/gcc/x86_64-w64-mingw32/8.1.0/include/c++/x86_64-w64-mingw32/bits/gthr.h:148,
  1985. from c:/Qt14/Tools/mingw810_64/lib/gcc/x86_64-w64-mingw32/8.1.0/include/c++/ext/atomicity.h:35,
  1986. from c:/Qt14/Tools/mingw810_64/lib/gcc/x86_64-w64-mingw32/8.1.0/include/c++/bits/basic_string.h:39,
  1987. from c:/Qt14/Tools/mingw810_64/lib/gcc/x86_64-w64-mingw32/8.1.0/include/c++/string:52,
  1988. from C:/Qt14/5.15.0/mingw81_64/include/QtCore/qbytearray.h:52,
  1989. from C:/Qt14/5.15.0/mingw81_64/include/QtCore/qstring.h:50,
  1990. from C:/Qt14/5.15.0/mingw81_64/include/QtPrintSupport/qprinter.h:44,
  1991. from C:/Qt14/5.15.0/mingw81_64/include/QtPrintSupport/QPrinter:1,
  1992. from Impresora.h:16,
  1993. from Impresora.cpp:13:
  1994. c:/Qt14/Tools/mingw810_64/lib/gcc/x86_64-w64-mingw32/8.1.0/include/c++/ext/concurrence.h:135:2: error: '__gthread_mutex_init_function' was not declared in this scope
  1995. __GTHREAD_MUTEX_INIT_FUNCTION(&_M_mutex);
  1996. ^~~~~~~~~~~~~~~~~~~~~~~~~~~~~
  1997. c:/Qt14/Tools/mingw810_64/lib/gcc/x86_64-w64-mingw32/8.1.0/include/c++/ext/concurrence.h:135:2: note: suggested alternative: '__gthread_recursive_mutex_init_function'
  1998. In file included from c:/Qt14/Tools/mingw810_64/lib/gcc/x86_64-w64-mingw32/8.1.0/include/c++/memory:74,
  1999. from C:/Qt14/5.15.0/mingw81_64/include/QtCore/qsharedpointer_impl.h:70,
  2000. from C:/Qt14/5.15.0/mingw81_64/include/QtCore/qsharedpointer.h:48,
  2001. from C:/Qt14/5.15.0/mingw81_64/include/QtGui/qpagelayout.h:44,
  2002. from C:/Qt14/5.15.0/mingw81_64/include/QtGui/qpagedpaintdevice.h:45,
  2003. from C:/Qt14/5.15.0/mingw81_64/include/QtPrintSupport/qprinter.h:46,
  2004. from C:/Qt14/5.15.0/mingw81_64/include/QtPrintSupport/QPrinter:1,
  2005. from Impresora.h:16,
  2006. from Impresora.cpp:13:
  2007. c:/Qt14/Tools/mingw810_64/lib/gcc/x86_64-w64-mingw32/8.1.0/include/c++/ext/concurrence.h: In destructor '__gnu_cxx::__mutex::~__mutex()':
  2008. c:/Qt14/Tools/mingw810_64/lib/gcc/x86_64-w64-mingw32/8.1.0/include/c++/ext/concurrence.h:143:27: error: '_M_mutex' was not declared in this scope
  2009. __gthread_mutex_destroy(&_M_mutex);
  2010. ^~~~~~~~
  2011. c:/Qt14/Tools/mingw810_64/lib/gcc/x86_64-w64-mingw32/8.1.0/include/c++/ext/concurrence.h:143:27: note: suggested alternative: '__mutex'
  2012. __gthread_mutex_destroy(&_M_mutex);
  2013. ^~~~~~~~
  2014. __mutex
  2015. c:/Qt14/Tools/mingw810_64/lib/gcc/x86_64-w64-mingw32/8.1.0/include/c++/ext/concurrence.h:143:35: error: '__gthread_mutex_destroy' cannot be used as a function
  2016. __gthread_mutex_destroy(&_M_mutex);
  2017. ^
  2018. c:/Qt14/Tools/mingw810_64/lib/gcc/x86_64-w64-mingw32/8.1.0/include/c++/ext/concurrence.h: In member function 'void __gnu_cxx::__mutex::lock()':
  2019. c:/Qt14/Tools/mingw810_64/lib/gcc/x86_64-w64-mingw32/8.1.0/include/c++/ext/concurrence.h:152:30: error: '_M_mutex' was not declared in this scope
  2020. if (__gthread_mutex_lock(&_M_mutex) != 0)
  2021. ^~~~~~~~
  2022. c:/Qt14/Tools/mingw810_64/lib/gcc/x86_64-w64-mingw32/8.1.0/include/c++/ext/concurrence.h:152:30: note: suggested alternative: '__mutex'
  2023. if (__gthread_mutex_lock(&_M_mutex) != 0)
  2024. ^~~~~~~~
  2025. __mutex
  2026. c:/Qt14/Tools/mingw810_64/lib/gcc/x86_64-w64-mingw32/8.1.0/include/c++/ext/concurrence.h:152:38: error: '__gthread_mutex_lock' cannot be used as a function
  2027. if (__gthread_mutex_lock(&_M_mutex) != 0)
  2028. ^
  2029. c:/Qt14/Tools/mingw810_64/lib/gcc/x86_64-w64-mingw32/8.1.0/include/c++/ext/concurrence.h: In member function 'void __gnu_cxx::__mutex::unlock()':
  2030. c:/Qt14/Tools/mingw810_64/lib/gcc/x86_64-w64-mingw32/8.1.0/include/c++/ext/concurrence.h:163:32: error: '_M_mutex' was not declared in this scope
  2031. if (__gthread_mutex_unlock(&_M_mutex) != 0)
  2032. ^~~~~~~~
  2033. c:/Qt14/Tools/mingw810_64/lib/gcc/x86_64-w64-mingw32/8.1.0/include/c++/ext/concurrence.h:163:32: note: suggested alternative: '__mutex'
  2034. if (__gthread_mutex_unlock(&_M_mutex) != 0)
  2035. ^~~~~~~~
  2036. __mutex
  2037. c:/Qt14/Tools/mingw810_64/lib/gcc/x86_64-w64-mingw32/8.1.0/include/c++/ext/concurrence.h:163:40: error: '__gthread_mutex_unlock' cannot be used as a function
  2038. if (__gthread_mutex_unlock(&_M_mutex) != 0)
  2039. ^
  2040. c:/Qt14/Tools/mingw810_64/lib/gcc/x86_64-w64-mingw32/8.1.0/include/c++/ext/concurrence.h: At global scope:
  2041. c:/Qt14/Tools/mingw810_64/lib/gcc/x86_64-w64-mingw32/8.1.0/include/c++/ext/concurrence.h:179:5: error: '__gthread_recursive_mutex_t' does not name a type; did you mean '__gthread_recursive_mutex_lock'?
  2042. __gthread_recursive_mutex_t _M_mutex;
  2043. ^~~~~~~~~~~~~~~~~~~~~~~~~~~
  2044. __gthread_recursive_mutex_lock
  2045. c:/Qt14/Tools/mingw810_64/lib/gcc/x86_64-w64-mingw32/8.1.0/include/c++/ext/concurrence.h:224:5: error: '__gthread_recursive_mutex_t' does not name a type; did you mean '__gthread_recursive_mutex_lock'?
  2046. __gthread_recursive_mutex_t* gthread_recursive_mutex(void)
  2047. ^~~~~~~~~~~~~~~~~~~~~~~~~~~
  2048. __gthread_recursive_mutex_lock
  2049. c:/Qt14/Tools/mingw810_64/lib/gcc/x86_64-w64-mingw32/8.1.0/include/c++/ext/concurrence.h: In constructor '__gnu_cxx::__recursive_mutex::__recursive_mutex()':
  2050. c:/Qt14/Tools/mingw810_64/lib/gcc/x86_64-w64-mingw32/8.1.0/include/c++/ext/concurrence.h:190:43: error: '_M_mutex' was not declared in this scope
  2051. __GTHREAD_RECURSIVE_MUTEX_INIT_FUNCTION(&_M_mutex);
  2052. ^~~~~~~~
  2053. c:/Qt14/Tools/mingw810_64/lib/gcc/x86_64-w64-mingw32/8.1.0/include/c++/ext/concurrence.h:190:43: note: suggested alternative: '__mutex'
  2054. __GTHREAD_RECURSIVE_MUTEX_INIT_FUNCTION(&_M_mutex);
  2055. ^~~~~~~~
  2056. __mutex
  2057. c:/Qt14/Tools/mingw810_64/lib/gcc/x86_64-w64-mingw32/8.1.0/include/c++/ext/concurrence.h:190:51: error: '__gthread_recursive_mutex_init_function' cannot be used as a function
  2058. __GTHREAD_RECURSIVE_MUTEX_INIT_FUNCTION(&_M_mutex);
  2059. ^
  2060. c:/Qt14/Tools/mingw810_64/lib/gcc/x86_64-w64-mingw32/8.1.0/include/c++/ext/concurrence.h: In destructor '__gnu_cxx::__recursive_mutex::~__recursive_mutex()':
  2061. c:/Qt14/Tools/mingw810_64/lib/gcc/x86_64-w64-mingw32/8.1.0/include/c++/ext/concurrence.h:198:37: error: '_M_mutex' was not declared in this scope
  2062. __gthread_recursive_mutex_destroy(&_M_mutex);
  2063. ^~~~~~~~
  2064. c:/Qt14/Tools/mingw810_64/lib/gcc/x86_64-w64-mingw32/8.1.0/include/c++/ext/concurrence.h:198:37: note: suggested alternative: '__mutex'
  2065. __gthread_recursive_mutex_destroy(&_M_mutex);
  2066. ^~~~~~~~
  2067. __mutex
  2068. c:/Qt14/Tools/mingw810_64/lib/gcc/x86_64-w64-mingw32/8.1.0/include/c++/ext/concurrence.h:198:45: error: '__gthread_recursive_mutex_destroy' cannot be used as a function
  2069. __gthread_recursive_mutex_destroy(&_M_mutex);
  2070. ^
  2071. c:/Qt14/Tools/mingw810_64/lib/gcc/x86_64-w64-mingw32/8.1.0/include/c++/ext/concurrence.h: In member function 'void __gnu_cxx::__recursive_mutex::lock()':
  2072. c:/Qt14/Tools/mingw810_64/lib/gcc/x86_64-w64-mingw32/8.1.0/include/c++/ext/concurrence.h:207:40: error: '_M_mutex' was not declared in this scope
  2073. if (__gthread_recursive_mutex_lock(&_M_mutex) != 0)
  2074. ^~~~~~~~
  2075. c:/Qt14/Tools/mingw810_64/lib/gcc/x86_64-w64-mingw32/8.1.0/include/c++/ext/concurrence.h:207:40: note: suggested alternative: '__mutex'
  2076. if (__gthread_recursive_mutex_lock(&_M_mutex) != 0)
  2077. ^~~~~~~~
  2078. __mutex
  2079. c:/Qt14/Tools/mingw810_64/lib/gcc/x86_64-w64-mingw32/8.1.0/include/c++/ext/concurrence.h:207:48: error: '__gthread_recursive_mutex_lock' cannot be used as a function
  2080. if (__gthread_recursive_mutex_lock(&_M_mutex) != 0)
  2081. ^
  2082. c:/Qt14/Tools/mingw810_64/lib/gcc/x86_64-w64-mingw32/8.1.0/include/c++/ext/concurrence.h: In member function 'void __gnu_cxx::__recursive_mutex::unlock()':
  2083. c:/Qt14/Tools/mingw810_64/lib/gcc/x86_64-w64-mingw32/8.1.0/include/c++/ext/concurrence.h:218:42: error: '_M_mutex' was not declared in this scope
  2084. if (__gthread_recursive_mutex_unlock(&_M_mutex) != 0)
  2085. ^~~~~~~~
  2086. c:/Qt14/Tools/mingw810_64/lib/gcc/x86_64-w64-mingw32/8.1.0/include/c++/ext/concurrence.h:218:42: note: suggested alternative: '__mutex'
  2087. if (__gthread_recursive_mutex_unlock(&_M_mutex) != 0)
  2088. ^~~~~~~~
  2089. __mutex
  2090. c:/Qt14/Tools/mingw810_64/lib/gcc/x86_64-w64-mingw32/8.1.0/include/c++/ext/concurrence.h:218:50: error: '__gthread_recursive_mutex_unlock' cannot be used as a function
  2091. if (__gthread_recursive_mutex_unlock(&_M_mutex) != 0)
  2092. ^
  2093. c:/Qt14/Tools/mingw810_64/lib/gcc/x86_64-w64-mingw32/8.1.0/include/c++/ext/concurrence.h: At global scope:
  2094. c:/Qt14/Tools/mingw810_64/lib/gcc/x86_64-w64-mingw32/8.1.0/include/c++/ext/concurrence.h:255:5: error: '__gthread_cond_t' does not name a type; did you mean '__gthread_cond_wait'?
  2095. __gthread_cond_t _M_cond = __GTHREAD_COND_INIT;
  2096. ^~~~~~~~~~~~~~~~
  2097. __gthread_cond_wait
  2098. c:/Qt14/Tools/mingw810_64/lib/gcc/x86_64-w64-mingw32/8.1.0/include/c++/ext/concurrence.h: In member function 'void __gnu_cxx::__cond::broadcast()':
  2099. c:/Qt14/Tools/mingw810_64/lib/gcc/x86_64-w64-mingw32/8.1.0/include/c++/ext/concurrence.h:285:34: error: '_M_cond' was not declared in this scope
  2100. if (__gthread_cond_broadcast(&_M_cond) != 0)
  2101. ^~~~~~~
  2102. c:/Qt14/Tools/mingw810_64/lib/gcc/x86_64-w64-mingw32/8.1.0/include/c++/ext/concurrence.h:285:34: note: suggested alternative: '__cond'
  2103. if (__gthread_cond_broadcast(&_M_cond) != 0)
  2104. ^~~~~~~
  2105. __cond
  2106. c:/Qt14/Tools/mingw810_64/lib/gcc/x86_64-w64-mingw32/8.1.0/include/c++/ext/concurrence.h:285:41: error: '__gthread_cond_broadcast' cannot be used as a function
  2107. if (__gthread_cond_broadcast(&_M_cond) != 0)
  2108. ^
  2109. c:/Qt14/Tools/mingw810_64/lib/gcc/x86_64-w64-mingw32/8.1.0/include/c++/ext/concurrence.h: In member function 'void __gnu_cxx::__cond::wait(__gnu_cxx::__mutex*)':
  2110. c:/Qt14/Tools/mingw810_64/lib/gcc/x86_64-w64-mingw32/8.1.0/include/c++/ext/concurrence.h:295:29: error: '_M_cond' was not declared in this scope
  2111. if (__gthread_cond_wait(&_M_cond, mutex->gthread_mutex()) != 0)
  2112. ^~~~~~~
  2113. c:/Qt14/Tools/mingw810_64/lib/gcc/x86_64-w64-mingw32/8.1.0/include/c++/ext/concurrence.h:295:29: note: suggested alternative: '__cond'
  2114. if (__gthread_cond_wait(&_M_cond, mutex->gthread_mutex()) != 0)
  2115. ^~~~~~~
  2116. __cond
  2117. c:/Qt14/Tools/mingw810_64/lib/gcc/x86_64-w64-mingw32/8.1.0/include/c++/ext/concurrence.h:295:45: error: 'class __gnu_cxx::__mutex' has no member named 'gthread_mutex'
  2118. if (__gthread_cond_wait(&_M_cond, mutex->gthread_mutex()) != 0)
  2119. ^~~~~~~~~~~~~
  2120. c:/Qt14/Tools/mingw810_64/lib/gcc/x86_64-w64-mingw32/8.1.0/include/c++/ext/concurrence.h:295:60: error: '__gthread_cond_wait' cannot be used as a function
  2121. if (__gthread_cond_wait(&_M_cond, mutex->gthread_mutex()) != 0)
  2122. ^
  2123. c:/Qt14/Tools/mingw810_64/lib/gcc/x86_64-w64-mingw32/8.1.0/include/c++/ext/concurrence.h: In member function 'void __gnu_cxx::__cond::wait_recursive(__gnu_cxx::__recursive_mutex*)':
  2124. c:/Qt14/Tools/mingw810_64/lib/gcc/x86_64-w64-mingw32/8.1.0/include/c++/ext/concurrence.h:305:39: error: '_M_cond' was not declared in this scope
  2125. if (__gthread_cond_wait_recursive(&_M_cond,
  2126. ^~~~~~~
  2127. c:/Qt14/Tools/mingw810_64/lib/gcc/x86_64-w64-mingw32/8.1.0/include/c++/ext/concurrence.h:305:39: note: suggested alternative: '__cond'
  2128. if (__gthread_cond_wait_recursive(&_M_cond,
  2129. ^~~~~~~
  2130. __cond
  2131. c:/Qt14/Tools/mingw810_64/lib/gcc/x86_64-w64-mingw32/8.1.0/include/c++/ext/concurrence.h:306:17: error: 'class __gnu_cxx::__recursive_mutex' has no member named 'gthread_recursive_mutex'; did you mean '__recursive_mutex'?
  2132. mutex->gthread_recursive_mutex())
  2133. ^~~~~~~~~~~~~~~~~~~~~~~
  2134. __recursive_mutex
  2135. c:/Qt14/Tools/mingw810_64/lib/gcc/x86_64-w64-mingw32/8.1.0/include/c++/ext/concurrence.h:306:42: error: '__gthread_cond_wait_recursive' cannot be used as a function
  2136. mutex->gthread_recursive_mutex())
  2137. ^
  2138. In file included from Impresora.h:19,
  2139. from Impresora.cpp:13:
  2140. Silo_SaS.h: At global scope:
  2141. Silo_SaS.h:18:32: warning: unknown option after '#pragma GCC diagnostic' kind [-Wpragmas]
  2142. #pragma GCC diagnostic ignored "-Wdeprecated-copy"
  2143. ^~~~~~~~~~~~~~~~~~~
  2144. In file included from c:/Qt14/Tools/mingw810_64/lib/gcc/x86_64-w64-mingw32/8.1.0/include/c++/bits/locale_facets_nonio.h:2013,
  2145. from c:/Qt14/Tools/mingw810_64/lib/gcc/x86_64-w64-mingw32/8.1.0/include/c++/locale:41,
  2146. from c:/Qt14/Tools/mingw810_64/lib/gcc/x86_64-w64-mingw32/8.1.0/include/c++/iomanip:43,
  2147. from Silo_SaS.h:63,
  2148. from Impresora.h:19,
  2149. from Impresora.cpp:13:
  2150. c:/Qt14/Tools/mingw810_64/lib/gcc/x86_64-w64-mingw32/8.1.0/include/c++/bits/codecvt.h:338:31: error: 'mbstate_t' was not declared in this scope
  2151. class codecvt<char, char, mbstate_t>
  2152. ^~~~~~~~~
  2153. c:/Qt14/Tools/mingw810_64/lib/gcc/x86_64-w64-mingw32/8.1.0/include/c++/bits/codecvt.h:338:31: note: suggested alternative: 'mstats'
  2154. class codecvt<char, char, mbstate_t>
  2155. ^~~~~~~~~
  2156. mstats
  2157. c:/Qt14/Tools/mingw810_64/lib/gcc/x86_64-w64-mingw32/8.1.0/include/c++/bits/codecvt.h:338:40: error: template argument 3 is invalid
  2158. class codecvt<char, char, mbstate_t>
  2159. ^
  2160. c:/Qt14/Tools/mingw810_64/lib/gcc/x86_64-w64-mingw32/8.1.0/include/c++/bits/codecvt.h:339:50: error: 'mbstate_t' was not declared in this scope
  2161. : public __codecvt_abstract_base<char, char, mbstate_t>
  2162. ^~~~~~~~~
  2163. c:/Qt14/Tools/mingw810_64/lib/gcc/x86_64-w64-mingw32/8.1.0/include/c++/bits/codecvt.h:339:50: note: suggested alternative: 'mstats'
  2164. : public __codecvt_abstract_base<char, char, mbstate_t>
  2165. ^~~~~~~~~
  2166. mstats
  2167. c:/Qt14/Tools/mingw810_64/lib/gcc/x86_64-w64-mingw32/8.1.0/include/c++/bits/codecvt.h:339:59: error: template argument 3 is invalid
  2168. : public __codecvt_abstract_base<char, char, mbstate_t>
  2169. ^
  2170. c:/Qt14/Tools/mingw810_64/lib/gcc/x86_64-w64-mingw32/8.1.0/include/c++/bits/codecvt.h:401:34: error: 'mbstate_t' was not declared in this scope
  2171. class codecvt<wchar_t, char, mbstate_t>
  2172. ^~~~~~~~~
  2173. c:/Qt14/Tools/mingw810_64/lib/gcc/x86_64-w64-mingw32/8.1.0/include/c++/bits/codecvt.h:401:34: note: suggested alternative: 'mstats'
  2174. class codecvt<wchar_t, char, mbstate_t>
  2175. ^~~~~~~~~
  2176. mstats
  2177. c:/Qt14/Tools/mingw810_64/lib/gcc/x86_64-w64-mingw32/8.1.0/include/c++/bits/codecvt.h:401:43: error: template argument 3 is invalid
  2178. class codecvt<wchar_t, char, mbstate_t>
  2179. ^
  2180. c:/Qt14/Tools/mingw810_64/lib/gcc/x86_64-w64-mingw32/8.1.0/include/c++/bits/codecvt.h:402:53: error: 'mbstate_t' was not declared in this scope
  2181. : public __codecvt_abstract_base<wchar_t, char, mbstate_t>
  2182. ^~~~~~~~~
  2183. c:/Qt14/Tools/mingw810_64/lib/gcc/x86_64-w64-mingw32/8.1.0/include/c++/bits/codecvt.h:402:53: note: suggested alternative: 'mstats'
  2184. : public __codecvt_abstract_base<wchar_t, char, mbstate_t>
  2185. ^~~~~~~~~
  2186. mstats
  2187. c:/Qt14/Tools/mingw810_64/lib/gcc/x86_64-w64-mingw32/8.1.0/include/c++/bits/codecvt.h:402:62: error: template argument 3 is invalid
  2188. : public __codecvt_abstract_base<wchar_t, char, mbstate_t>
  2189. ^
  2190. c:/Qt14/Tools/mingw810_64/lib/gcc/x86_64-w64-mingw32/8.1.0/include/c++/bits/codecvt.h:468:35: error: 'mbstate_t' was not declared in this scope
  2191. class codecvt<char16_t, char, mbstate_t>
  2192. ^~~~~~~~~
  2193. c:/Qt14/Tools/mingw810_64/lib/gcc/x86_64-w64-mingw32/8.1.0/include/c++/bits/codecvt.h:468:35: note: suggested alternative: 'mstats'
  2194. class codecvt<char16_t, char, mbstate_t>
  2195. ^~~~~~~~~
  2196. mstats
  2197. c:/Qt14/Tools/mingw810_64/lib/gcc/x86_64-w64-mingw32/8.1.0/include/c++/bits/codecvt.h:468:44: error: template argument 3 is invalid
  2198. class codecvt<char16_t, char, mbstate_t>
  2199. ^
  2200. c:/Qt14/Tools/mingw810_64/lib/gcc/x86_64-w64-mingw32/8.1.0/include/c++/bits/codecvt.h:469:54: error: 'mbstate_t' was not declared in this scope
  2201. : public __codecvt_abstract_base<char16_t, char, mbstate_t>
  2202. ^~~~~~~~~
  2203. c:/Qt14/Tools/mingw810_64/lib/gcc/x86_64-w64-mingw32/8.1.0/include/c++/bits/codecvt.h:469:54: note: suggested alternative: 'mstats'
  2204. : public __codecvt_abstract_base<char16_t, char, mbstate_t>
  2205. ^~~~~~~~~
  2206. mstats
  2207. c:/Qt14/Tools/mingw810_64/lib/gcc/x86_64-w64-mingw32/8.1.0/include/c++/bits/codecvt.h:469:63: error: template argument 3 is invalid
  2208. : public __codecvt_abstract_base<char16_t, char, mbstate_t>
  2209. ^
  2210. c:/Qt14/Tools/mingw810_64/lib/gcc/x86_64-w64-mingw32/8.1.0/include/c++/bits/codecvt.h:525:35: error: 'mbstate_t' was not declared in this scope
  2211. class codecvt<char32_t, char, mbstate_t>
  2212. ^~~~~~~~~
  2213. c:/Qt14/Tools/mingw810_64/lib/gcc/x86_64-w64-mingw32/8.1.0/include/c++/bits/codecvt.h:525:35: note: suggested alternative: 'mstats'
  2214. class codecvt<char32_t, char, mbstate_t>
  2215. ^~~~~~~~~
  2216. mstats
  2217. c:/Qt14/Tools/mingw810_64/lib/gcc/x86_64-w64-mingw32/8.1.0/include/c++/bits/codecvt.h:525:44: error: template argument 3 is invalid
  2218. class codecvt<char32_t, char, mbstate_t>
  2219. ^
  2220. c:/Qt14/Tools/mingw810_64/lib/gcc/x86_64-w64-mingw32/8.1.0/include/c++/bits/codecvt.h:526:54: error: 'mbstate_t' was not declared in this scope
  2221. : public __codecvt_abstract_base<char32_t, char, mbstate_t>
  2222. ^~~~~~~~~
  2223. c:/Qt14/Tools/mingw810_64/lib/gcc/x86_64-w64-mingw32/8.1.0/include/c++/bits/codecvt.h:526:54: note: suggested alternative: 'mstats'
  2224. : public __codecvt_abstract_base<char32_t, char, mbstate_t>
  2225. ^~~~~~~~~
  2226. mstats
  2227. c:/Qt14/Tools/mingw810_64/lib/gcc/x86_64-w64-mingw32/8.1.0/include/c++/bits/codecvt.h:526:63: error: template argument 3 is invalid
  2228. : public __codecvt_abstract_base<char32_t, char, mbstate_t>
  2229. ^
  2230. c:/Qt14/Tools/mingw810_64/lib/gcc/x86_64-w64-mingw32/8.1.0/include/c++/bits/codecvt.h:610:42: error: 'mbstate_t' was not declared in this scope
  2231. class codecvt_byname<char16_t, char, mbstate_t>
  2232. ^~~~~~~~~
  2233. c:/Qt14/Tools/mingw810_64/lib/gcc/x86_64-w64-mingw32/8.1.0/include/c++/bits/codecvt.h:610:42: note: suggested alternative: 'mstats'
  2234. class codecvt_byname<char16_t, char, mbstate_t>
  2235. ^~~~~~~~~
  2236. mstats
  2237. c:/Qt14/Tools/mingw810_64/lib/gcc/x86_64-w64-mingw32/8.1.0/include/c++/bits/codecvt.h:610:51: error: template argument 3 is invalid
  2238. class codecvt_byname<char16_t, char, mbstate_t>
  2239. ^
  2240. c:/Qt14/Tools/mingw810_64/lib/gcc/x86_64-w64-mingw32/8.1.0/include/c++/bits/codecvt.h:611:38: error: 'mbstate_t' was not declared in this scope
  2241. : public codecvt<char16_t, char, mbstate_t>
  2242. ^~~~~~~~~
  2243. c:/Qt14/Tools/mingw810_64/lib/gcc/x86_64-w64-mingw32/8.1.0/include/c++/bits/codecvt.h:611:38: note: suggested alternative: 'mstats'
  2244. : public codecvt<char16_t, char, mbstate_t>
  2245. ^~~~~~~~~
  2246. mstats
  2247. c:/Qt14/Tools/mingw810_64/lib/gcc/x86_64-w64-mingw32/8.1.0/include/c++/bits/codecvt.h:611:47: error: template argument 3 is invalid
  2248. : public codecvt<char16_t, char, mbstate_t>
  2249. ^
  2250. c:/Qt14/Tools/mingw810_64/lib/gcc/x86_64-w64-mingw32/8.1.0/include/c++/bits/codecvt.h:628:42: error: 'mbstate_t' was not declared in this scope
  2251. class codecvt_byname<char32_t, char, mbstate_t>
  2252. ^~~~~~~~~
  2253. c:/Qt14/Tools/mingw810_64/lib/gcc/x86_64-w64-mingw32/8.1.0/include/c++/bits/codecvt.h:628:42: note: suggested alternative: 'mstats'
  2254. class codecvt_byname<char32_t, char, mbstate_t>
  2255. ^~~~~~~~~
  2256. mstats
  2257. c:/Qt14/Tools/mingw810_64/lib/gcc/x86_64-w64-mingw32/8.1.0/include/c++/bits/codecvt.h:628:51: error: template argument 3 is invalid
  2258. class codecvt_byname<char32_t, char, mbstate_t>
  2259. ^
  2260. c:/Qt14/Tools/mingw810_64/lib/gcc/x86_64-w64-mingw32/8.1.0/include/c++/bits/codecvt.h:629:38: error: 'mbstate_t' was not declared in this scope
  2261. : public codecvt<char32_t, char, mbstate_t>
  2262. ^~~~~~~~~
  2263. c:/Qt14/Tools/mingw810_64/lib/gcc/x86_64-w64-mingw32/8.1.0/include/c++/bits/codecvt.h:629:38: note: suggested alternative: 'mstats'
  2264. : public codecvt<char32_t, char, mbstate_t>
  2265. ^~~~~~~~~
  2266. mstats
  2267. c:/Qt14/Tools/mingw810_64/lib/gcc/x86_64-w64-mingw32/8.1.0/include/c++/bits/codecvt.h:629:47: error: template argument 3 is invalid
  2268. : public codecvt<char32_t, char, mbstate_t>
  2269. ^
  2270. c:/Qt14/Tools/mingw810_64/lib/gcc/x86_64-w64-mingw32/8.1.0/include/c++/bits/codecvt.h:649:52: error: 'mbstate_t' was not declared in this scope
  2271. extern template class codecvt_byname<char, char, mbstate_t>;
  2272. ^~~~~~~~~
  2273. c:/Qt14/Tools/mingw810_64/lib/gcc/x86_64-w64-mingw32/8.1.0/include/c++/bits/codecvt.h:649:52: note: suggested alternative: 'mstats'
  2274. extern template class codecvt_byname<char, char, mbstate_t>;
  2275. ^~~~~~~~~
  2276. mstats
  2277. c:/Qt14/Tools/mingw810_64/lib/gcc/x86_64-w64-mingw32/8.1.0/include/c++/bits/codecvt.h:649:61: error: template argument 3 is invalid
  2278. extern template class codecvt_byname<char, char, mbstate_t>;
  2279. ^
  2280. c:/Qt14/Tools/mingw810_64/lib/gcc/x86_64-w64-mingw32/8.1.0/include/c++/bits/codecvt.h:652:31: error: 'mbstate_t' was not declared in this scope
  2281. const codecvt<char, char, mbstate_t>&
  2282. ^~~~~~~~~
  2283. c:/Qt14/Tools/mingw810_64/lib/gcc/x86_64-w64-mingw32/8.1.0/include/c++/bits/codecvt.h:652:31: note: suggested alternative: 'mstats'
  2284. const codecvt<char, char, mbstate_t>&
  2285. ^~~~~~~~~
  2286. mstats
  2287. c:/Qt14/Tools/mingw810_64/lib/gcc/x86_64-w64-mingw32/8.1.0/include/c++/bits/codecvt.h:652:40: error: template argument 3 is invalid
  2288. const codecvt<char, char, mbstate_t>&
  2289. ^
  2290. c:/Qt14/Tools/mingw810_64/lib/gcc/x86_64-w64-mingw32/8.1.0/include/c++/bits/codecvt.h:653:35: error: 'mbstate_t' was not declared in this scope
  2291. use_facet<codecvt<char, char, mbstate_t> >(const locale&);
  2292. ^~~~~~~~~
  2293. c:/Qt14/Tools/mingw810_64/lib/gcc/x86_64-w64-mingw32/8.1.0/include/c++/bits/codecvt.h:653:35: note: suggested alternative: 'mstats'
  2294. use_facet<codecvt<char, char, mbstate_t> >(const locale&);
  2295. ^~~~~~~~~
  2296. mstats
  2297. c:/Qt14/Tools/mingw810_64/lib/gcc/x86_64-w64-mingw32/8.1.0/include/c++/bits/codecvt.h:653:44: error: template argument 3 is invalid
  2298. use_facet<codecvt<char, char, mbstate_t> >(const locale&);
  2299. ^
  2300. c:/Qt14/Tools/mingw810_64/lib/gcc/x86_64-w64-mingw32/8.1.0/include/c++/bits/codecvt.h:653:5: error: template-id 'use_facet<<expression error> >' for 'const int& std::use_facet(const std::locale&)' does not match any template declaration
  2301. use_facet<codecvt<char, char, mbstate_t> >(const locale&);
  2302. ^~~~~~~~~~~~~~~~~~~~~~~~~~~~~~~~~~~~~~~~~~
  2303. In file included from c:/Qt14/Tools/mingw810_64/lib/gcc/x86_64-w64-mingw32/8.1.0/include/c++/bits/locale_classes.h:851,
  2304. from c:/Qt14/Tools/mingw810_64/lib/gcc/x86_64-w64-mingw32/8.1.0/include/c++/bits/ios_base.h:41,
  2305. from c:/Qt14/Tools/mingw810_64/lib/gcc/x86_64-w64-mingw32/8.1.0/include/c++/ios:42,
  2306. from c:/Qt14/Tools/mingw810_64/lib/gcc/x86_64-w64-mingw32/8.1.0/include/c++/ostream:38,
  2307. from c:/Qt14/Tools/mingw810_64/lib/gcc/x86_64-w64-mingw32/8.1.0/include/c++/iterator:64,
  2308. from C:/Qt14/5.15.0/mingw81_64/include/QtCore/qbytearray.h:53,
  2309. from C:/Qt14/5.15.0/mingw81_64/include/QtCore/qstring.h:50,
  2310. from C:/Qt14/5.15.0/mingw81_64/include/QtPrintSupport/qprinter.h:44,
  2311. from C:/Qt14/5.15.0/mingw81_64/include/QtPrintSupport/QPrinter:1,
  2312. from Impresora.h:16,
  2313. from Impresora.cpp:13:
  2314. c:/Qt14/Tools/mingw810_64/lib/gcc/x86_64-w64-mingw32/8.1.0/include/c++/bits/locale_classes.tcc:132:5: note: candidate is: 'template<class _Facet> const _Facet& std::use_facet(const std::locale&)'
  2315. use_facet(const locale& __loc)
  2316. ^~~~~~~~~
  2317. In file included from c:/Qt14/Tools/mingw810_64/lib/gcc/x86_64-w64-mingw32/8.1.0/include/c++/bits/locale_facets_nonio.h:2013,
  2318. from c:/Qt14/Tools/mingw810_64/lib/gcc/x86_64-w64-mingw32/8.1.0/include/c++/locale:41,
  2319. from c:/Qt14/Tools/mingw810_64/lib/gcc/x86_64-w64-mingw32/8.1.0/include/c++/iomanip:43,
  2320. from Silo_SaS.h:63,
  2321. from Impresora.h:19,
  2322. from Impresora.cpp:13:
  2323. c:/Qt14/Tools/mingw810_64/lib/gcc/x86_64-w64-mingw32/8.1.0/include/c++/bits/codecvt.h:657:35: error: 'mbstate_t' was not declared in this scope
  2324. has_facet<codecvt<char, char, mbstate_t> >(const locale&);
  2325. ^~~~~~~~~
  2326. c:/Qt14/Tools/mingw810_64/lib/gcc/x86_64-w64-mingw32/8.1.0/include/c++/bits/codecvt.h:657:35: note: suggested alternative: 'mstats'
  2327. has_facet<codecvt<char, char, mbstate_t> >(const locale&);
  2328. ^~~~~~~~~
  2329. mstats
  2330. c:/Qt14/Tools/mingw810_64/lib/gcc/x86_64-w64-mingw32/8.1.0/include/c++/bits/codecvt.h:657:44: error: template argument 3 is invalid
  2331. has_facet<codecvt<char, char, mbstate_t> >(const locale&);
  2332. ^
  2333. c:/Qt14/Tools/mingw810_64/lib/gcc/x86_64-w64-mingw32/8.1.0/include/c++/bits/codecvt.h:657:5: error: template-id 'has_facet<<expression error> >' for 'bool std::has_facet(const std::locale&)' does not match any template declaration
  2334. has_facet<codecvt<char, char, mbstate_t> >(const locale&);
  2335. ^~~~~~~~~~~~~~~~~~~~~~~~~~~~~~~~~~~~~~~~~~
  2336. In file included from c:/Qt14/Tools/mingw810_64/lib/gcc/x86_64-w64-mingw32/8.1.0/include/c++/bits/locale_classes.h:851,
  2337. from c:/Qt14/Tools/mingw810_64/lib/gcc/x86_64-w64-mingw32/8.1.0/include/c++/bits/ios_base.h:41,
  2338. from c:/Qt14/Tools/mingw810_64/lib/gcc/x86_64-w64-mingw32/8.1.0/include/c++/ios:42,
  2339. from c:/Qt14/Tools/mingw810_64/lib/gcc/x86_64-w64-mingw32/8.1.0/include/c++/ostream:38,
  2340. from c:/Qt14/Tools/mingw810_64/lib/gcc/x86_64-w64-mingw32/8.1.0/include/c++/iterator:64,
  2341. from C:/Qt14/5.15.0/mingw81_64/include/QtCore/qbytearray.h:53,
  2342. from C:/Qt14/5.15.0/mingw81_64/include/QtCore/qstring.h:50,
  2343. from C:/Qt14/5.15.0/mingw81_64/include/QtPrintSupport/qprinter.h:44,
  2344. from C:/Qt14/5.15.0/mingw81_64/include/QtPrintSupport/QPrinter:1,
  2345. from Impresora.h:16,
  2346. from Impresora.cpp:13:
  2347. c:/Qt14/Tools/mingw810_64/lib/gcc/x86_64-w64-mingw32/8.1.0/include/c++/bits/locale_classes.tcc:104:5: note: candidate is: 'template<class _Facet> bool std::has_facet(const std::locale&)'
  2348. has_facet(const locale& __loc) throw()
  2349. ^~~~~~~~~
  2350. In file included from c:/Qt14/Tools/mingw810_64/lib/gcc/x86_64-w64-mingw32/8.1.0/include/c++/bits/locale_facets_nonio.h:2013,
  2351. from c:/Qt14/Tools/mingw810_64/lib/gcc/x86_64-w64-mingw32/8.1.0/include/c++/locale:41,
  2352. from c:/Qt14/Tools/mingw810_64/lib/gcc/x86_64-w64-mingw32/8.1.0/include/c++/iomanip:43,
  2353. from Silo_SaS.h:63,
  2354. from Impresora.h:19,
  2355. from Impresora.cpp:13:
  2356. c:/Qt14/Tools/mingw810_64/lib/gcc/x86_64-w64-mingw32/8.1.0/include/c++/bits/codecvt.h:660:55: error: 'mbstate_t' was not declared in this scope
  2357. extern template class codecvt_byname<wchar_t, char, mbstate_t>;
  2358. ^~~~~~~~~
  2359. c:/Qt14/Tools/mingw810_64/lib/gcc/x86_64-w64-mingw32/8.1.0/include/c++/bits/codecvt.h:660:55: note: suggested alternative: 'mstats'
  2360. extern template class codecvt_byname<wchar_t, char, mbstate_t>;
  2361. ^~~~~~~~~
  2362. mstats
  2363. c:/Qt14/Tools/mingw810_64/lib/gcc/x86_64-w64-mingw32/8.1.0/include/c++/bits/codecvt.h:660:64: error: template argument 3 is invalid
  2364. extern template class codecvt_byname<wchar_t, char, mbstate_t>;
  2365. ^
  2366. c:/Qt14/Tools/mingw810_64/lib/gcc/x86_64-w64-mingw32/8.1.0/include/c++/bits/codecvt.h:663:34: error: 'mbstate_t' was not declared in this scope
  2367. const codecvt<wchar_t, char, mbstate_t>&
  2368. ^~~~~~~~~
  2369. c:/Qt14/Tools/mingw810_64/lib/gcc/x86_64-w64-mingw32/8.1.0/include/c++/bits/codecvt.h:663:34: note: suggested alternative: 'mstats'
  2370. const codecvt<wchar_t, char, mbstate_t>&
  2371. ^~~~~~~~~
  2372. mstats
  2373. c:/Qt14/Tools/mingw810_64/lib/gcc/x86_64-w64-mingw32/8.1.0/include/c++/bits/codecvt.h:663:43: error: template argument 3 is invalid
  2374. const codecvt<wchar_t, char, mbstate_t>&
  2375. ^
  2376. c:/Qt14/Tools/mingw810_64/lib/gcc/x86_64-w64-mingw32/8.1.0/include/c++/bits/codecvt.h:664:38: error: 'mbstate_t' was not declared in this scope
  2377. use_facet<codecvt<wchar_t, char, mbstate_t> >(const locale&);
  2378. ^~~~~~~~~
  2379. c:/Qt14/Tools/mingw810_64/lib/gcc/x86_64-w64-mingw32/8.1.0/include/c++/bits/codecvt.h:664:38: note: suggested alternative: 'mstats'
  2380. use_facet<codecvt<wchar_t, char, mbstate_t> >(const locale&);
  2381. ^~~~~~~~~
  2382. mstats
  2383. c:/Qt14/Tools/mingw810_64/lib/gcc/x86_64-w64-mingw32/8.1.0/include/c++/bits/codecvt.h:664:47: error: template argument 3 is invalid
  2384. use_facet<codecvt<wchar_t, char, mbstate_t> >(const locale&);
  2385. ^
  2386. c:/Qt14/Tools/mingw810_64/lib/gcc/x86_64-w64-mingw32/8.1.0/include/c++/bits/codecvt.h:664:5: error: template-id 'use_facet<<expression error> >' for 'const int& std::use_facet(const std::locale&)' does not match any template declaration
  2387. use_facet<codecvt<wchar_t, char, mbstate_t> >(const locale&);
  2388. ^~~~~~~~~~~~~~~~~~~~~~~~~~~~~~~~~~~~~~~~~~~~~
  2389. In file included from c:/Qt14/Tools/mingw810_64/lib/gcc/x86_64-w64-mingw32/8.1.0/include/c++/bits/locale_classes.h:851,
  2390. from c:/Qt14/Tools/mingw810_64/lib/gcc/x86_64-w64-mingw32/8.1.0/include/c++/bits/ios_base.h:41,
  2391. from c:/Qt14/Tools/mingw810_64/lib/gcc/x86_64-w64-mingw32/8.1.0/include/c++/ios:42,
  2392. from c:/Qt14/Tools/mingw810_64/lib/gcc/x86_64-w64-mingw32/8.1.0/include/c++/ostream:38,
  2393. from c:/Qt14/Tools/mingw810_64/lib/gcc/x86_64-w64-mingw32/8.1.0/include/c++/iterator:64,
  2394. from C:/Qt14/5.15.0/mingw81_64/include/QtCore/qbytearray.h:53,
  2395. from C:/Qt14/5.15.0/mingw81_64/include/QtCore/qstring.h:50,
  2396. from C:/Qt14/5.15.0/mingw81_64/include/QtPrintSupport/qprinter.h:44,
  2397. from C:/Qt14/5.15.0/mingw81_64/include/QtPrintSupport/QPrinter:1,
  2398. from Impresora.h:16,
  2399. from Impresora.cpp:13:
  2400. c:/Qt14/Tools/mingw810_64/lib/gcc/x86_64-w64-mingw32/8.1.0/include/c++/bits/locale_classes.tcc:132:5: note: candidate is: 'template<class _Facet> const _Facet& std::use_facet(const std::locale&)'
  2401. use_facet(const locale& __loc)
  2402. ^~~~~~~~~
  2403. In file included from c:/Qt14/Tools/mingw810_64/lib/gcc/x86_64-w64-mingw32/8.1.0/include/c++/bits/locale_facets_nonio.h:2013,
  2404. from c:/Qt14/Tools/mingw810_64/lib/gcc/x86_64-w64-mingw32/8.1.0/include/c++/locale:41,
  2405. from c:/Qt14/Tools/mingw810_64/lib/gcc/x86_64-w64-mingw32/8.1.0/include/c++/iomanip:43,
  2406. from Silo_SaS.h:63,
  2407. from Impresora.h:19,
  2408. from Impresora.cpp:13:
  2409. c:/Qt14/Tools/mingw810_64/lib/gcc/x86_64-w64-mingw32/8.1.0/include/c++/bits/codecvt.h:668:38: error: 'mbstate_t' was not declared in this scope
  2410. has_facet<codecvt<wchar_t, char, mbstate_t> >(const locale&);
  2411. ^~~~~~~~~
  2412. c:/Qt14/Tools/mingw810_64/lib/gcc/x86_64-w64-mingw32/8.1.0/include/c++/bits/codecvt.h:668:38: note: suggested alternative: 'mstats'
  2413. has_facet<codecvt<wchar_t, char, mbstate_t> >(const locale&);
  2414. ^~~~~~~~~
  2415. mstats
  2416. c:/Qt14/Tools/mingw810_64/lib/gcc/x86_64-w64-mingw32/8.1.0/include/c++/bits/codecvt.h:668:47: error: template argument 3 is invalid
  2417. has_facet<codecvt<wchar_t, char, mbstate_t> >(const locale&);
  2418. ^
  2419. c:/Qt14/Tools/mingw810_64/lib/gcc/x86_64-w64-mingw32/8.1.0/include/c++/bits/codecvt.h:668:5: error: template-id 'has_facet<<expression error> >' for 'bool std::has_facet(const std::locale&)' does not match any template declaration
  2420. has_facet<codecvt<wchar_t, char, mbstate_t> >(const locale&);
  2421. ^~~~~~~~~~~~~~~~~~~~~~~~~~~~~~~~~~~~~~~~~~~~~
  2422. In file included from c:/Qt14/Tools/mingw810_64/lib/gcc/x86_64-w64-mingw32/8.1.0/include/c++/bits/locale_classes.h:851,
  2423. from c:/Qt14/Tools/mingw810_64/lib/gcc/x86_64-w64-mingw32/8.1.0/include/c++/bits/ios_base.h:41,
  2424. from c:/Qt14/Tools/mingw810_64/lib/gcc/x86_64-w64-mingw32/8.1.0/include/c++/ios:42,
  2425. from c:/Qt14/Tools/mingw810_64/lib/gcc/x86_64-w64-mingw32/8.1.0/include/c++/ostream:38,
  2426. from c:/Qt14/Tools/mingw810_64/lib/gcc/x86_64-w64-mingw32/8.1.0/include/c++/iterator:64,
  2427. from C:/Qt14/5.15.0/mingw81_64/include/QtCore/qbytearray.h:53,
  2428. from C:/Qt14/5.15.0/mingw81_64/include/QtCore/qstring.h:50,
  2429. from C:/Qt14/5.15.0/mingw81_64/include/QtPrintSupport/qprinter.h:44,
  2430. from C:/Qt14/5.15.0/mingw81_64/include/QtPrintSupport/QPrinter:1,
  2431. from Impresora.h:16,
  2432. from Impresora.cpp:13:
  2433. c:/Qt14/Tools/mingw810_64/lib/gcc/x86_64-w64-mingw32/8.1.0/include/c++/bits/locale_classes.tcc:104:5: note: candidate is: 'template<class _Facet> bool std::has_facet(const std::locale&)'
  2434. has_facet(const locale& __loc) throw()
  2435. ^~~~~~~~~
  2436. In file included from c:/Qt14/Tools/mingw810_64/lib/gcc/x86_64-w64-mingw32/8.1.0/include/c++/bits/locale_facets_nonio.h:2013,
  2437. from c:/Qt14/Tools/mingw810_64/lib/gcc/x86_64-w64-mingw32/8.1.0/include/c++/locale:41,
  2438. from c:/Qt14/Tools/mingw810_64/lib/gcc/x86_64-w64-mingw32/8.1.0/include/c++/iomanip:43,
  2439. from Silo_SaS.h:63,
  2440. from Impresora.h:19,
  2441. from Impresora.cpp:13:
  2442. c:/Qt14/Tools/mingw810_64/lib/gcc/x86_64-w64-mingw32/8.1.0/include/c++/bits/codecvt.h:672:56: error: 'mbstate_t' was not declared in this scope
  2443. extern template class codecvt_byname<char16_t, char, mbstate_t>;
  2444. ^~~~~~~~~
  2445. c:/Qt14/Tools/mingw810_64/lib/gcc/x86_64-w64-mingw32/8.1.0/include/c++/bits/codecvt.h:672:56: note: suggested alternative: 'mstats'
  2446. extern template class codecvt_byname<char16_t, char, mbstate_t>;
  2447. ^~~~~~~~~
  2448. mstats
  2449. c:/Qt14/Tools/mingw810_64/lib/gcc/x86_64-w64-mingw32/8.1.0/include/c++/bits/codecvt.h:672:65: error: template argument 3 is invalid
  2450. extern template class codecvt_byname<char16_t, char, mbstate_t>;
  2451. ^
  2452. c:/Qt14/Tools/mingw810_64/lib/gcc/x86_64-w64-mingw32/8.1.0/include/c++/bits/codecvt.h:673:56: error: 'mbstate_t' was not declared in this scope
  2453. extern template class codecvt_byname<char32_t, char, mbstate_t>;
  2454. ^~~~~~~~~
  2455. c:/Qt14/Tools/mingw810_64/lib/gcc/x86_64-w64-mingw32/8.1.0/include/c++/bits/codecvt.h:673:56: note: suggested alternative: 'mstats'
  2456. extern template class codecvt_byname<char32_t, char, mbstate_t>;
  2457. ^~~~~~~~~
  2458. mstats
  2459. c:/Qt14/Tools/mingw810_64/lib/gcc/x86_64-w64-mingw32/8.1.0/include/c++/bits/codecvt.h:673:65: error: template argument 3 is invalid
  2460. extern template class codecvt_byname<char32_t, char, mbstate_t>;
  2461. ^
  2462. In file included from c:/Qt14/Tools/mingw810_64/lib/gcc/x86_64-w64-mingw32/8.1.0/include/c++/cctype:42,
  2463. from c:/Qt14/Tools/mingw810_64/lib/gcc/x86_64-w64-mingw32/8.1.0/include/c++/bits/localefwd.h:42,
  2464. from c:/Qt14/Tools/mingw810_64/lib/gcc/x86_64-w64-mingw32/8.1.0/include/c++/string:43,
  2465. from C:/Qt14/5.15.0/mingw81_64/include/QtCore/qbytearray.h:52,
  2466. from C:/Qt14/5.15.0/mingw81_64/include/QtCore/qstring.h:50,
  2467. from C:/Qt14/5.15.0/mingw81_64/include/QtPrintSupport/qprinter.h:44,
  2468. from C:/Qt14/5.15.0/mingw81_64/include/QtPrintSupport/QPrinter:1,
  2469. from Impresora.h:16,
  2470. from Impresora.cpp:13:
  2471. c:/Qt14/Tools/mingw810_64/x86_64-w64-mingw32/include/math.h:183:29: error: expected ',' or '...' before numeric constant
  2472. double __cdecl sin(double _X);
  2473. ^~
  2474. c:/Qt14/Tools/mingw810_64/x86_64-w64-mingw32/include/math.h:184:29: error: expected ',' or '...' before numeric constant
  2475. double __cdecl cos(double _X);
  2476. ^~
  2477. c:/Qt14/Tools/mingw810_64/x86_64-w64-mingw32/include/math.h:185:29: error: expected ',' or '...' before numeric constant
  2478. double __cdecl tan(double _X);
  2479. ^~
  2480. c:/Qt14/Tools/mingw810_64/x86_64-w64-mingw32/include/math.h:186:30: error: expected ',' or '...' before numeric constant
  2481. double __cdecl sinh(double _X);
  2482. ^~
  2483. c:/Qt14/Tools/mingw810_64/x86_64-w64-mingw32/include/math.h:187:30: error: expected ',' or '...' before numeric constant
  2484. double __cdecl cosh(double _X);
  2485. ^~
  2486. c:/Qt14/Tools/mingw810_64/x86_64-w64-mingw32/include/math.h:188:30: error: expected ',' or '...' before numeric constant
  2487. double __cdecl tanh(double _X);
  2488. ^~
  2489. c:/Qt14/Tools/mingw810_64/x86_64-w64-mingw32/include/math.h:189:30: error: expected ',' or '...' before numeric constant
  2490. double __cdecl asin(double _X);
  2491. ^~
  2492. c:/Qt14/Tools/mingw810_64/x86_64-w64-mingw32/include/math.h:190:30: error: expected ',' or '...' before numeric constant
  2493. double __cdecl acos(double _X);
  2494. ^~
  2495. c:/Qt14/Tools/mingw810_64/x86_64-w64-mingw32/include/math.h:191:30: error: expected ',' or '...' before numeric constant
  2496. double __cdecl atan(double _X);
  2497. ^~
  2498. c:/Qt14/Tools/mingw810_64/x86_64-w64-mingw32/include/math.h:192:41: error: expected ',' or '...' before numeric constant
  2499. double __cdecl atan2(double _Y,double _X);
  2500. ^~
  2501. c:/Qt14/Tools/mingw810_64/x86_64-w64-mingw32/include/math.h:193:29: error: expected ',' or '...' before numeric constant
  2502. double __cdecl exp(double _X);
  2503. ^~
  2504. c:/Qt14/Tools/mingw810_64/x86_64-w64-mingw32/include/math.h:194:29: error: expected ',' or '...' before numeric constant
  2505. double __cdecl log(double _X);
  2506. ^~
  2507. c:/Qt14/Tools/mingw810_64/x86_64-w64-mingw32/include/math.h:195:31: error: expected ',' or '...' before numeric constant
  2508. double __cdecl log10(double _X);
  2509. ^~
  2510. c:/Qt14/Tools/mingw810_64/x86_64-w64-mingw32/include/math.h:196:29: error: expected ',' or '...' before numeric constant
  2511. double __cdecl pow(double _X,double _Y);
  2512. ^~
  2513. c:/Qt14/Tools/mingw810_64/x86_64-w64-mingw32/include/math.h:197:30: error: expected ',' or '...' before numeric constant
  2514. double __cdecl sqrt(double _X);
  2515. ^~
  2516. c:/Qt14/Tools/mingw810_64/x86_64-w64-mingw32/include/math.h:198:30: error: expected ',' or '...' before numeric constant
  2517. double __cdecl ceil(double _X);
  2518. ^~
  2519. c:/Qt14/Tools/mingw810_64/x86_64-w64-mingw32/include/math.h:199:31: error: expected ',' or '...' before numeric constant
  2520. double __cdecl floor(double _X);
  2521. ^~
  2522. c:/Qt14/Tools/mingw810_64/x86_64-w64-mingw32/include/math.h:204:38: error: expected ',' or '...' before numeric constant
  2523. extern double __cdecl fabs (double _X);
  2524. ^~
  2525. c:/Qt14/Tools/mingw810_64/x86_64-w64-mingw32/include/math.h:243:31: error: expected ',' or '...' before numeric constant
  2526. double __cdecl ldexp(double _X,int _Y);
  2527. ^~
  2528. c:/Qt14/Tools/mingw810_64/x86_64-w64-mingw32/include/math.h:244:31: error: expected ',' or '...' before numeric constant
  2529. double __cdecl frexp(double _X,int *_Y);
  2530. ^~
  2531. c:/Qt14/Tools/mingw810_64/x86_64-w64-mingw32/include/math.h:245:30: error: expected ',' or '...' before numeric constant
  2532. double __cdecl modf(double _X,double *_Y);
  2533. ^~
  2534. c:/Qt14/Tools/mingw810_64/x86_64-w64-mingw32/include/math.h:246:30: error: expected ',' or '...' before numeric constant
  2535. double __cdecl fmod(double _X,double _Y);
  2536. ^~
  2537. c:/Qt14/Tools/mingw810_64/x86_64-w64-mingw32/include/math.h:277:32: error: expected ',' or '...' before numeric constant
  2538. double __cdecl _hypot(double _X,double _Y);
  2539. ^~
  2540. c:/Qt14/Tools/mingw810_64/x86_64-w64-mingw32/include/math.h:278:37: error: expected ',' or '...' before numeric constant
  2541. _CRTIMP double __cdecl _j0(double _X);
  2542. ^~
  2543. c:/Qt14/Tools/mingw810_64/x86_64-w64-mingw32/include/math.h:279:37: error: expected ',' or '...' before numeric constant
  2544. _CRTIMP double __cdecl _j1(double _X);
  2545. ^~
  2546. c:/Qt14/Tools/mingw810_64/x86_64-w64-mingw32/include/math.h:280:34: error: expected ',' or '...' before numeric constant
  2547. _CRTIMP double __cdecl _jn(int _X,double _Y);
  2548. ^~
  2549. c:/Qt14/Tools/mingw810_64/x86_64-w64-mingw32/include/math.h:281:37: error: expected ',' or '...' before numeric constant
  2550. _CRTIMP double __cdecl _y0(double _X);
  2551. ^~
  2552. c:/Qt14/Tools/mingw810_64/x86_64-w64-mingw32/include/math.h:282:37: error: expected ',' or '...' before numeric constant
  2553. _CRTIMP double __cdecl _y1(double _X);
  2554. ^~
  2555. c:/Qt14/Tools/mingw810_64/x86_64-w64-mingw32/include/math.h:283:34: error: expected ',' or '...' before numeric constant
  2556. _CRTIMP double __cdecl _yn(int _X,double _Y);
  2557. ^~
  2558. c:/Qt14/Tools/mingw810_64/x86_64-w64-mingw32/include/math.h:297:43: error: expected ',' or '...' before numeric constant
  2559. _CRTIMP double __cdecl _chgsign (double _X);
  2560. ^~
  2561. c:/Qt14/Tools/mingw810_64/x86_64-w64-mingw32/include/math.h:664:35: error: expected ',' or '...' before numeric constant
  2562. extern float __cdecl sinf(float _X);
  2563. ^~
  2564. c:/Qt14/Tools/mingw810_64/x86_64-w64-mingw32/include/math.h:667:35: error: expected ',' or '...' before numeric constant
  2565. extern float __cdecl cosf(float _X);
  2566. ^~
  2567. c:/Qt14/Tools/mingw810_64/x86_64-w64-mingw32/include/math.h:670:35: error: expected ',' or '...' before numeric constant
  2568. extern float __cdecl tanf(float _X);
  2569. ^~
  2570. c:/Qt14/Tools/mingw810_64/x86_64-w64-mingw32/include/math.h:672:36: error: expected ',' or '...' before numeric constant
  2571. extern float __cdecl asinf(float _X);
  2572. ^~
  2573. c:/Qt14/Tools/mingw810_64/x86_64-w64-mingw32/include/math.h:685:36: error: expected ',' or '...' before numeric constant
  2574. extern float __cdecl sinhf(float _X);
  2575. ^~
  2576. c:/Qt14/Tools/mingw810_64/x86_64-w64-mingw32/include/math.h:691:36: error: expected ',' or '...' before numeric constant
  2577. extern float __cdecl coshf(float _X);
  2578. ^~
  2579. c:/Qt14/Tools/mingw810_64/x86_64-w64-mingw32/include/math.h:697:36: error: expected ',' or '...' before numeric constant
  2580. extern float __cdecl tanhf(float _X);
  2581. ^~
  2582. c:/Qt14/Tools/mingw810_64/x86_64-w64-mingw32/include/math.h:721:35: error: expected ',' or '...' before numeric constant
  2583. extern float __cdecl expf(float _X);
  2584. ^~
  2585. c:/Qt14/Tools/mingw810_64/x86_64-w64-mingw32/include/math.h:739:29: error: expected ',' or '...' before numeric constant
  2586. extern float frexpf(float _X,int *_Y);
  2587. ^~
  2588. c:/Qt14/Tools/mingw810_64/x86_64-w64-mingw32/include/math.h:753:37: error: expected ',' or '...' before numeric constant
  2589. extern float __cdecl ldexpf(float _X,int _Y);
  2590. ^~
  2591. c:/Qt14/Tools/mingw810_64/x86_64-w64-mingw32/include/math.h:890:35: error: expected ',' or '...' before numeric constant
  2592. extern float __cdecl powf(float _X,float _Y);
  2593. ^~
  2594. c:/Qt14/Tools/mingw810_64/x86_64-w64-mingw32/include/math.h:1182:43: error: expected ',' or '...' before numeric constant
  2595. _CRTIMP float __cdecl _chgsignf (float _X);
  2596. ^~
  2597. c:/Qt14/Tools/mingw810_64/x86_64-w64-mingw32/include/math.h:1183:39: error: expected ',' or '...' before numeric constant
  2598. _CRTIMP float __cdecl _logbf(float _X);
  2599. ^~
  2600. c:/Qt14/Tools/mingw810_64/x86_64-w64-mingw32/include/math.h:1184:44: error: expected ',' or '...' before numeric constant
  2601. _CRTIMP float __cdecl _nextafterf(float _X,float _Y);
  2602. ^~
  2603. c:/Qt14/Tools/mingw810_64/x86_64-w64-mingw32/include/math.h:1185:39: error: expected ',' or '...' before numeric constant
  2604. _CRTIMP int __cdecl _finitef(float _X);
  2605. ^~
  2606. c:/Qt14/Tools/mingw810_64/x86_64-w64-mingw32/include/math.h:1186:38: error: expected ',' or '...' before numeric constant
  2607. _CRTIMP int __cdecl _isnanf(float _X);
  2608. ^~
  2609. c:/Qt14/Tools/mingw810_64/x86_64-w64-mingw32/include/math.h:1187:40: error: expected ',' or '...' before numeric constant
  2610. _CRTIMP int __cdecl _fpclassf(float _X);
  2611. ^~
  2612. In file included from c:/Qt14/Tools/mingw810_64/lib/gcc/x86_64-w64-mingw32/8.1.0/include/c++/x86_64-w64-mingw32/bits/basic_file.h:40,
  2613. from c:/Qt14/Tools/mingw810_64/lib/gcc/x86_64-w64-mingw32/8.1.0/include/c++/fstream:42,
  2614. from Silo_SaS.h:65,
  2615. from Impresora.h:19,
  2616. from Impresora.cpp:13:
  2617. c:/Qt14/Tools/mingw810_64/lib/gcc/x86_64-w64-mingw32/8.1.0/include/c++/x86_64-w64-mingw32/bits/c++io.h:42:11: error: '__gthread_mutex_t' does not name a type; did you mean '__gthread_mutex_lock'?
  2618. typedef __gthread_mutex_t __c_lock;
  2619. ^~~~~~~~~~~~~~~~~
  2620. __gthread_mutex_lock
  2621. In file included from c:/Qt14/Tools/mingw810_64/lib/gcc/x86_64-w64-mingw32/8.1.0/include/c++/fstream:42,
  2622. from Silo_SaS.h:65,
  2623. from Impresora.h:19,
  2624. from Impresora.cpp:13:
  2625. c:/Qt14/Tools/mingw810_64/lib/gcc/x86_64-w64-mingw32/8.1.0/include/c++/x86_64-w64-mingw32/bits/basic_file.h:63:28: error: expected ')' before '*' token
  2626. __basic_file(__c_lock* __lock = 0) throw ();
  2627. ~ ^
  2628. )
  2629. c:/Qt14/Tools/mingw810_64/lib/gcc/x86_64-w64-mingw32/8.1.0/include/c++/x86_64-w64-mingw32/bits/basic_file.h:66:41: error: '__c_lock' has not been declared
  2630. __basic_file(__basic_file&& __rv, __c_lock* = 0) noexcept
  2631. ^~~~~~~~
  2632. In file included from Silo_SaS.h:65,
  2633. from Impresora.h:19,
  2634. from Impresora.cpp:13:
  2635. c:/Qt14/Tools/mingw810_64/lib/gcc/x86_64-w64-mingw32/8.1.0/include/c++/fstream:115:7: error: '__c_lock' does not name a type; did you mean '__c_locale'?
  2636. __c_lock _M_lock;
  2637. ^~~~~~~~
  2638. __c_locale
  2639. In file included from c:/Qt14/Tools/mingw810_64/lib/gcc/x86_64-w64-mingw32/8.1.0/include/c++/fstream:1169,
  2640. from Silo_SaS.h:65,
  2641. from Impresora.h:19,
  2642. from Impresora.cpp:13:
  2643. c:/Qt14/Tools/mingw810_64/lib/gcc/x86_64-w64-mingw32/8.1.0/include/c++/bits/fstream.tcc: In constructor 'std::basic_filebuf<_CharT, _Traits>::basic_filebuf()':
  2644. c:/Qt14/Tools/mingw810_64/lib/gcc/x86_64-w64-mingw32/8.1.0/include/c++/bits/fstream.tcc:80:43: error: class 'std::basic_filebuf<_CharT, _Traits>' does not have any field named '_M_lock'
  2645. basic_filebuf() : __streambuf_type(), _M_lock(), _M_file(&_M_lock),
  2646. ^~~~~~~
  2647. c:/Qt14/Tools/mingw810_64/lib/gcc/x86_64-w64-mingw32/8.1.0/include/c++/bits/fstream.tcc:80:63: error: '_M_lock' was not declared in this scope
  2648. basic_filebuf() : __streambuf_type(), _M_lock(), _M_file(&_M_lock),
  2649. ^~~~~~~
  2650. c:/Qt14/Tools/mingw810_64/lib/gcc/x86_64-w64-mingw32/8.1.0/include/c++/bits/fstream.tcc:80:63: note: suggested alternative: '_M_mode'
  2651. basic_filebuf() : __streambuf_type(), _M_lock(), _M_file(&_M_lock),
  2652. ^~~~~~~
  2653. _M_mode
  2654. c:/Qt14/Tools/mingw810_64/lib/gcc/x86_64-w64-mingw32/8.1.0/include/c++/bits/fstream.tcc: In constructor 'std::basic_filebuf<_CharT, _Traits>::basic_filebuf(std::basic_filebuf<_CharT, _Traits>&&)':
  2655. c:/Qt14/Tools/mingw810_64/lib/gcc/x86_64-w64-mingw32/8.1.0/include/c++/bits/fstream.tcc:97:5: error: class 'std::basic_filebuf<_CharT, _Traits>' does not have any field named '_M_lock'
  2656. _M_lock(), _M_file(std::move(__rhs._M_file), &_M_lock),
  2657. ^~~~~~~
  2658. c:/Qt14/Tools/mingw810_64/lib/gcc/x86_64-w64-mingw32/8.1.0/include/c++/bits/fstream.tcc:97:51: error: '_M_lock' was not declared in this scope
  2659. _M_lock(), _M_file(std::move(__rhs._M_file), &_M_lock),
  2660. ^~~~~~~
  2661. c:/Qt14/Tools/mingw810_64/lib/gcc/x86_64-w64-mingw32/8.1.0/include/c++/bits/fstream.tcc:97:51: note: suggested alternative: '_M_mode'
  2662. _M_lock(), _M_file(std::move(__rhs._M_file), &_M_lock),
  2663. ^~~~~~~
  2664. _M_mode
  2665. In file included from Silo_SaS.h:65,
  2666. from Impresora.h:19,
  2667. from Impresora.cpp:13:
  2668. c:/Qt14/Tools/mingw810_64/lib/gcc/x86_64-w64-mingw32/8.1.0/include/c++/fstream: In instantiation of 'class std::basic_filebuf<char>':
  2669. c:/Qt14/Tools/mingw810_64/lib/gcc/x86_64-w64-mingw32/8.1.0/include/c++/bits/fstream.tcc:1051:25: required from here
  2670. c:/Qt14/Tools/mingw810_64/lib/gcc/x86_64-w64-mingw32/8.1.0/include/c++/fstream:86:38: error: no type named 'state_type' in 'struct std::char_traits<char>'
  2671. is_default_constructible<_Tp>>;
  2672. ^
  2673. c:/Qt14/Tools/mingw810_64/lib/gcc/x86_64-w64-mingw32/8.1.0/include/c++/fstream:86:38: error: no type named 'state_type' in 'struct std::char_traits<char>'
  2674. c:/Qt14/Tools/mingw810_64/lib/gcc/x86_64-w64-mingw32/8.1.0/include/c++/fstream:107:57: error: no type named 'state_type' in 'std::basic_filebuf<char>::traits_type' {aka 'struct std::char_traits<char>'}
  2675. typedef typename traits_type::state_type __state_type;
  2676. ^~~~~~~~~~~~
  2677. c:/Qt14/Tools/mingw810_64/lib/gcc/x86_64-w64-mingw32/8.1.0/include/c++/fstream:108:57: error: no type named 'state_type' in 'struct std::char_traits<char>'
  2678. typedef codecvt<char_type, char, __state_type> __codecvt_type;
  2679. ^~~~~~~~~~~~~~
  2680. c:/Qt14/Tools/mingw810_64/lib/gcc/x86_64-w64-mingw32/8.1.0/include/c++/fstream: In instantiation of 'class std::basic_filebuf<wchar_t>':
  2681. c:/Qt14/Tools/mingw810_64/lib/gcc/x86_64-w64-mingw32/8.1.0/include/c++/bits/fstream.tcc:1057:25: required from here
  2682. c:/Qt14/Tools/mingw810_64/lib/gcc/x86_64-w64-mingw32/8.1.0/include/c++/fstream:86:38: error: no type named 'state_type' in 'struct std::char_traits<wchar_t>'
  2683. is_default_constructible<_Tp>>;
  2684. ^
  2685. c:/Qt14/Tools/mingw810_64/lib/gcc/x86_64-w64-mingw32/8.1.0/include/c++/fstream:86:38: error: no type named 'state_type' in 'struct std::char_traits<wchar_t>'
  2686. c:/Qt14/Tools/mingw810_64/lib/gcc/x86_64-w64-mingw32/8.1.0/include/c++/fstream:107:57: error: no type named 'state_type' in 'std::basic_filebuf<wchar_t>::traits_type' {aka 'struct std::char_traits<wchar_t>'}
  2687. typedef typename traits_type::state_type __state_type;
  2688. ^~~~~~~~~~~~
  2689. c:/Qt14/Tools/mingw810_64/lib/gcc/x86_64-w64-mingw32/8.1.0/include/c++/fstream:108:57: error: no type named 'state_type' in 'struct std::char_traits<wchar_t>'
  2690. typedef codecvt<char_type, char, __state_type> __codecvt_type;
  2691. ^~~~~~~~~~~~~~
  2692. make.exe[2]: *** [build/Debug/MingW64__Qt_5.15-Windows/Impresora.o] Error 1
  2693. make.exe[2]: Leaving directory `/c/Users/Patron/Desktop/Code Projects/Sistema_Silo'
  2694. make.exe[1]: *** [.build-conf] Error 2
  2695. make.exe[1]: Leaving directory `/c/Users/Patron/Desktop/Code Projects/Sistema_Silo'
  2696. make.exe": *** [.build-impl] Error 2
  2697.  
  2698. BUILD FAILED (exit value 2, total time: 17s)
  2699.  
Advertisement
Add Comment
Please, Sign In to add comment