SHARE
TWEET

Untitled

a guest Sep 2nd, 2019 123 Never
Not a member of Pastebin yet? Sign Up, it unlocks many cool features!
  1. ==> Making package: openra-d2-git 166.git.0a74333-1 (Пн 02 сен 2019 17:36:25)
  2. ==> Checking runtime dependencies...
  3. ==> Checking buildtime dependencies...
  4. ==> WARNING: Using existing $srcdir/ tree
  5. ==> Starting pkgver()...
  6. ==> Starting build()...
  7. Version changed to 166.git.0a74333.
  8. OpenRA engine version 27cfa9b is required.
  9. Downloading engine...
  10. OpenRA engine version 27cfa9b is required.
  11. Downloading engine...
  12. /home/admin/.cache/yay/openra-d2-git/src/d2/D2Mod.sln.metaproj : error MSB4057: The target "restore" does not exist in the project. [/home/admin/.cache/yay/openra-d2-git/src/d2/D2Mod.sln]
  13. /home/admin/.cache/yay/openra-d2-git/src/d2/OpenRA.Mods.D2/OpenRA.Mods.D2.csproj.metaproj : error MSB4025: The project file could not be loaded. Could not find file "/home/admin/.cache/yay/openra-d2-git/src/d2/OpenRA.Mods.D2/OpenRA.Mods.D2.csproj.metaproj"
  14. /home/admin/.cache/yay/openra-d2-git/src/d2/engine/OpenRA.Game/OpenRA.Game.csproj.metaproj : error MSB4025: The project file could not be loaded. Could not find a part of the path "/home/admin/.cache/yay/openra-d2-git/src/d2/engine/OpenRA.Game/OpenRA.Game.csproj.metaproj".
  15. /home/admin/.cache/yay/openra-d2-git/src/d2/engine/OpenRA.Mods.Common/OpenRA.Mods.Common.csproj.metaproj : error MSB4025: The project file could not be loaded. Could not find a part of the path "/home/admin/.cache/yay/openra-d2-git/src/d2/engine/OpenRA.Mods.Common/OpenRA.Mods.Common.csproj.metaproj".
  16. make: *** [Makefile:118: core] Error 1
  17. make: *** Waiting for unfinished jobs....
  18. mkdir: cannot create directory ‘./engine_temp’: File exists
  19. replace ./engine_temp/OpenRA-27cfa9b1f08668f39e66f7ecf73cca11dbf8db36/.editorconfig? [y]es, [n]o, [A]ll, [N]one, [r]ename:  NULL
  20. (EOF or read error, treating as "[N]one" ...)
  21. replace ./engine_temp/OpenRA-27cfa9b1f08668f39e66f7ecf73cca11dbf8db36/ConvertFrom-Markdown.ps1? [y]es, [n]o, [A]ll, [N]one, [r]ename:  NULL
  22. (EOF or read error, treating as "[N]one" ...)
  23. checkdir error:  cannot create ./engine_temp/OpenRA-27cfa9b1f08668f39e66f7ecf73cca11dbf8db36/OpenRA.Game/FileFormats
  24.                  File exists
  25.                  unable to process OpenRA-27cfa9b1f08668f39e66f7ecf73cca11dbf8db36/OpenRA.Game/FileFormats/.
  26. checkdir error:  cannot create ./engine_temp/OpenRA-27cfa9b1f08668f39e66f7ecf73cca11dbf8db36/OpenRA.Game/FileSystem
  27.                  File exists
  28.                  unable to process OpenRA-27cfa9b1f08668f39e66f7ecf73cca11dbf8db36/OpenRA.Game/FileSystem/.
  29. checkdir error:  cannot create ./engine_temp/OpenRA-27cfa9b1f08668f39e66f7ecf73cca11dbf8db36/OpenRA.Game/GameRules
  30.                  File exists
  31.                  unable to process OpenRA-27cfa9b1f08668f39e66f7ecf73cca11dbf8db36/OpenRA.Game/GameRules/.
  32. checkdir error:  cannot create ./engine_temp/OpenRA-27cfa9b1f08668f39e66f7ecf73cca11dbf8db36/OpenRA.Game/Graphics
  33.                  File exists
  34.                  unable to process OpenRA-27cfa9b1f08668f39e66f7ecf73cca11dbf8db36/OpenRA.Game/Graphics/.
  35. checkdir error:  cannot create ./engine_temp/OpenRA-27cfa9b1f08668f39e66f7ecf73cca11dbf8db36/OpenRA.Game/Input
  36.                  File exists
  37.                  unable to process OpenRA-27cfa9b1f08668f39e66f7ecf73cca11dbf8db36/OpenRA.Game/Input/.
  38. checkdir error:  cannot create ./engine_temp/OpenRA-27cfa9b1f08668f39e66f7ecf73cca11dbf8db36/OpenRA.Game/Network
  39.                  File exists
  40.                  unable to process OpenRA-27cfa9b1f08668f39e66f7ecf73cca11dbf8db36/OpenRA.Game/Network/.
  41. checkdir error:  cannot create ./engine_temp/OpenRA-27cfa9b1f08668f39e66f7ecf73cca11dbf8db36/OpenRA.Game/Orders
  42.                  File exists
  43.                  unable to process OpenRA-27cfa9b1f08668f39e66f7ecf73cca11dbf8db36/OpenRA.Game/Orders/.
  44. checkdir error:  cannot create ./engine_temp/OpenRA-27cfa9b1f08668f39e66f7ecf73cca11dbf8db36/OpenRA.Game/Properties
  45.                  File exists
  46.                  unable to process OpenRA-27cfa9b1f08668f39e66f7ecf73cca11dbf8db36/OpenRA.Game/Properties/.
  47. checkdir error:  cannot create ./engine_temp/OpenRA-27cfa9b1f08668f39e66f7ecf73cca11dbf8db36/OpenRA.Game/Scripting
  48.                  File exists
  49.                  unable to process OpenRA-27cfa9b1f08668f39e66f7ecf73cca11dbf8db36/OpenRA.Game/Scripting/.
  50. checkdir error:  cannot create ./engine_temp/OpenRA-27cfa9b1f08668f39e66f7ecf73cca11dbf8db36/OpenRA.Game/Server
  51.                  File exists
  52.                  unable to process OpenRA-27cfa9b1f08668f39e66f7ecf73cca11dbf8db36/OpenRA.Game/Server/.
  53. checkdir error:  cannot create ./engine_temp/OpenRA-27cfa9b1f08668f39e66f7ecf73cca11dbf8db36/OpenRA.Game/Support
  54.                  File exists
  55.                  unable to process OpenRA-27cfa9b1f08668f39e66f7ecf73cca11dbf8db36/OpenRA.Game/Support/.
  56. checkdir error:  cannot create ./engine_temp/OpenRA-27cfa9b1f08668f39e66f7ecf73cca11dbf8db36/OpenRA.Game/Traits
  57.                  File exists
  58.                  unable to process OpenRA-27cfa9b1f08668f39e66f7ecf73cca11dbf8db36/OpenRA.Game/Traits/.
  59. checkdir error:  cannot create ./engine_temp/OpenRA-27cfa9b1f08668f39e66f7ecf73cca11dbf8db36/OpenRA.Game/Traits/Player
  60.                  File exists
  61.                  unable to process OpenRA-27cfa9b1f08668f39e66f7ecf73cca11dbf8db36/OpenRA.Game/Traits/Player/.
  62. checkdir error:  cannot create ./engine_temp/OpenRA-27cfa9b1f08668f39e66f7ecf73cca11dbf8db36/OpenRA.Game/Traits/World
  63.                  File exists
  64.                  unable to process OpenRA-27cfa9b1f08668f39e66f7ecf73cca11dbf8db36/OpenRA.Game/Traits/World/.
  65. checkdir error:  cannot create ./engine_temp/OpenRA-27cfa9b1f08668f39e66f7ecf73cca11dbf8db36/OpenRA.Game/UtilityCommands
  66.                  File exists
  67.                  unable to process OpenRA-27cfa9b1f08668f39e66f7ecf73cca11dbf8db36/OpenRA.Game/UtilityCommands/.
  68. checkdir error:  cannot create ./engine_temp/OpenRA-27cfa9b1f08668f39e66f7ecf73cca11dbf8db36/OpenRA.Game/Widgets
  69.                  File exists
  70.                  unable to process OpenRA-27cfa9b1f08668f39e66f7ecf73cca11dbf8db36/OpenRA.Game/Widgets/.
  71. checkdir error:  cannot create ./engine_temp/OpenRA-27cfa9b1f08668f39e66f7ecf73cca11dbf8db36/OpenRA.Mods.Cnc
  72.                  File exists
  73.                  unable to process OpenRA-27cfa9b1f08668f39e66f7ecf73cca11dbf8db36/OpenRA.Mods.Cnc/.
  74. checkdir error:  cannot create ./engine_temp/OpenRA-27cfa9b1f08668f39e66f7ecf73cca11dbf8db36/OpenRA.Mods.Cnc/Activities
  75.                  File exists
  76.                  unable to process OpenRA-27cfa9b1f08668f39e66f7ecf73cca11dbf8db36/OpenRA.Mods.Cnc/Activities/.
  77. checkdir error:  cannot create ./engine_temp/OpenRA-27cfa9b1f08668f39e66f7ecf73cca11dbf8db36/OpenRA.Mods.Cnc/FileSystem
  78.                  File exists
  79.                  unable to process OpenRA-27cfa9b1f08668f39e66f7ecf73cca11dbf8db36/OpenRA.Mods.Cnc/FileSystem/.
  80. checkdir error:  cannot create ./engine_temp/OpenRA-27cfa9b1f08668f39e66f7ecf73cca11dbf8db36/OpenRA.Mods.Cnc/Graphics
  81.                  File exists
  82.                  unable to process OpenRA-27cfa9b1f08668f39e66f7ecf73cca11dbf8db36/OpenRA.Mods.Cnc/Graphics/.
  83. checkdir error:  cannot create ./engine_temp/OpenRA-27cfa9b1f08668f39e66f7ecf73cca11dbf8db36/OpenRA.Mods.Cnc/Projectiles
  84.                  File exists
  85.                  unable to process OpenRA-27cfa9b1f08668f39e66f7ecf73cca11dbf8db36/OpenRA.Mods.Cnc/Projectiles/.
  86. checkdir error:  cannot create ./engine_temp/OpenRA-27cfa9b1f08668f39e66f7ecf73cca11dbf8db36/OpenRA.Mods.Cnc/Scripting
  87.                  File exists
  88.                  unable to process OpenRA-27cfa9b1f08668f39e66f7ecf73cca11dbf8db36/OpenRA.Mods.Cnc/Scripting/.
  89. checkdir error:  cannot create ./engine_temp/OpenRA-27cfa9b1f08668f39e66f7ecf73cca11dbf8db36/OpenRA.Mods.Cnc/Scripting/Properties
  90.                  File exists
  91.                  unable to process OpenRA-27cfa9b1f08668f39e66f7ecf73cca11dbf8db36/OpenRA.Mods.Cnc/Scripting/Properties/.
  92. checkdir error:  cannot create ./engine_temp/OpenRA-27cfa9b1f08668f39e66f7ecf73cca11dbf8db36/OpenRA.Mods.Cnc/Traits
  93.                  File exists
  94.                  unable to process OpenRA-27cfa9b1f08668f39e66f7ecf73cca11dbf8db36/OpenRA.Mods.Cnc/Traits/.
  95. checkdir error:  cannot create ./engine_temp/OpenRA-27cfa9b1f08668f39e66f7ecf73cca11dbf8db36/OpenRA.Mods.Cnc/Traits/Attack
  96.                  File exists
  97.                  unable to process OpenRA-27cfa9b1f08668f39e66f7ecf73cca11dbf8db36/OpenRA.Mods.Cnc/Traits/Attack/.
  98. checkdir error:  cannot create ./engine_temp/OpenRA-27cfa9b1f08668f39e66f7ecf73cca11dbf8db36/OpenRA.Mods.Cnc/Traits/Buildings
  99.                  File exists
  100.                  unable to process OpenRA-27cfa9b1f08668f39e66f7ecf73cca11dbf8db36/OpenRA.Mods.Cnc/Traits/Buildings/.
  101. checkdir error:  cannot create ./engine_temp/OpenRA-27cfa9b1f08668f39e66f7ecf73cca11dbf8db36/OpenRA.Mods.Cnc/Traits/Infiltration
  102.                  File exists
  103.                  unable to process OpenRA-27cfa9b1f08668f39e66f7ecf73cca11dbf8db36/OpenRA.Mods.Cnc/Traits/Infiltration/.
  104. checkdir error:  cannot create ./engine_temp/OpenRA-27cfa9b1f08668f39e66f7ecf73cca11dbf8db36/OpenRA.Mods.Cnc/Traits/PaletteEffects
  105.                  File exists
  106.                  unable to process OpenRA-27cfa9b1f08668f39e66f7ecf73cca11dbf8db36/OpenRA.Mods.Cnc/Traits/PaletteEffects/.
  107. checkdir error:  cannot create ./engine_temp/OpenRA-27cfa9b1f08668f39e66f7ecf73cca11dbf8db36/OpenRA.Mods.Cnc/Traits/Render
  108.                  File exists
  109.                  unable to process OpenRA-27cfa9b1f08668f39e66f7ecf73cca11dbf8db36/OpenRA.Mods.Cnc/Traits/Render/.
  110. checkdir error:  cannot create ./engine_temp/OpenRA-27cfa9b1f08668f39e66f7ecf73cca11dbf8db36/OpenRA.Mods.Cnc/Traits/SupportPowers
  111.                  File exists
  112.                  unable to process OpenRA-27cfa9b1f08668f39e66f7ecf73cca11dbf8db36/OpenRA.Mods.Cnc/Traits/SupportPowers/.
  113. checkdir error:  cannot create ./engine_temp/OpenRA-27cfa9b1f08668f39e66f7ecf73cca11dbf8db36/OpenRA.Mods.Cnc/Traits/World
  114.                  File exists
  115.                  unable to process OpenRA-27cfa9b1f08668f39e66f7ecf73cca11dbf8db36/OpenRA.Mods.Cnc/Traits/World/.
  116. checkdir error:  cannot create ./engine_temp/OpenRA-27cfa9b1f08668f39e66f7ecf73cca11dbf8db36/OpenRA.Mods.Cnc/UtilityCommands
  117.                  File exists
  118.                  unable to process OpenRA-27cfa9b1f08668f39e66f7ecf73cca11dbf8db36/OpenRA.Mods.Cnc/UtilityCommands/.
  119. checkdir error:  cannot create ./engine_temp/OpenRA-27cfa9b1f08668f39e66f7ecf73cca11dbf8db36/OpenRA.Mods.Cnc/Widgets/Logic
  120.                  File exists
  121.                  unable to process OpenRA-27cfa9b1f08668f39e66f7ecf73cca11dbf8db36/OpenRA.Mods.Cnc/Widgets/Logic/.
  122. checkdir error:  cannot create ./engine_temp/OpenRA-27cfa9b1f08668f39e66f7ecf73cca11dbf8db36/OpenRA.Mods.Common/Activities
  123.                  File exists
  124.                  unable to process OpenRA-27cfa9b1f08668f39e66f7ecf73cca11dbf8db36/OpenRA.Mods.Common/Activities/.
  125. checkdir error:  cannot create ./engine_temp/OpenRA-27cfa9b1f08668f39e66f7ecf73cca11dbf8db36/OpenRA.Mods.Common/Activities/Air
  126.                  File exists
  127.                  unable to process OpenRA-27cfa9b1f08668f39e66f7ecf73cca11dbf8db36/OpenRA.Mods.Common/Activities/Air/.
  128. checkdir error:  cannot create ./engine_temp/OpenRA-27cfa9b1f08668f39e66f7ecf73cca11dbf8db36/OpenRA.Mods.Common/Activities/Move
  129.                  File exists
  130.                  unable to process OpenRA-27cfa9b1f08668f39e66f7ecf73cca11dbf8db36/OpenRA.Mods.Common/Activities/Move/.
  131. checkdir error:  cannot create ./engine_temp/OpenRA-27cfa9b1f08668f39e66f7ecf73cca11dbf8db36/OpenRA.Mods.Common/AudioLoaders
  132.                  File exists
  133.                  unable to process OpenRA-27cfa9b1f08668f39e66f7ecf73cca11dbf8db36/OpenRA.Mods.Common/AudioLoaders/.
  134. checkdir error:  cannot create ./engine_temp/OpenRA-27cfa9b1f08668f39e66f7ecf73cca11dbf8db36/OpenRA.Mods.Common/Commands
  135.                  File exists
  136.                  unable to process OpenRA-27cfa9b1f08668f39e66f7ecf73cca11dbf8db36/OpenRA.Mods.Common/Commands/.
  137. checkdir error:  cannot create ./engine_temp/OpenRA-27cfa9b1f08668f39e66f7ecf73cca11dbf8db36/OpenRA.Mods.Common/EditorBrushes
  138.                  File exists
  139.                  unable to process OpenRA-27cfa9b1f08668f39e66f7ecf73cca11dbf8db36/OpenRA.Mods.Common/EditorBrushes/.
  140. checkdir error:  cannot create ./engine_temp/OpenRA-27cfa9b1f08668f39e66f7ecf73cca11dbf8db36/OpenRA.Mods.Common/Effects
  141.                  File exists
  142.                  unable to process OpenRA-27cfa9b1f08668f39e66f7ecf73cca11dbf8db36/OpenRA.Mods.Common/Effects/.
  143. checkdir error:  cannot create ./engine_temp/OpenRA-27cfa9b1f08668f39e66f7ecf73cca11dbf8db36/OpenRA.Mods.Common/FileFormats
  144.                  File exists
  145.                  unable to process OpenRA-27cfa9b1f08668f39e66f7ecf73cca11dbf8db36/OpenRA.Mods.Common/FileFormats/.
  146. checkdir error:  cannot create ./engine_temp/OpenRA-27cfa9b1f08668f39e66f7ecf73cca11dbf8db36/OpenRA.Mods.Common/FileSystem
  147.                  File exists
  148.                  unable to process OpenRA-27cfa9b1f08668f39e66f7ecf73cca11dbf8db36/OpenRA.Mods.Common/FileSystem/.
  149. checkdir error:  cannot create ./engine_temp/OpenRA-27cfa9b1f08668f39e66f7ecf73cca11dbf8db36/OpenRA.Mods.Common/Graphics
  150.                  File exists
  151.                  unable to process OpenRA-27cfa9b1f08668f39e66f7ecf73cca11dbf8db36/OpenRA.Mods.Common/Graphics/.
  152. checkdir error:  cannot create ./engine_temp/OpenRA-27cfa9b1f08668f39e66f7ecf73cca11dbf8db36/OpenRA.Mods.Common/HitShapes
  153.                  File exists
  154.                  unable to process OpenRA-27cfa9b1f08668f39e66f7ecf73cca11dbf8db36/OpenRA.Mods.Common/HitShapes/.
  155. checkdir error:  cannot create ./engine_temp/OpenRA-27cfa9b1f08668f39e66f7ecf73cca11dbf8db36/OpenRA.Mods.Common/Lint
  156.                  File exists
  157.                  unable to process OpenRA-27cfa9b1f08668f39e66f7ecf73cca11dbf8db36/OpenRA.Mods.Common/Lint/.
  158. checkdir error:  cannot create ./engine_temp/OpenRA-27cfa9b1f08668f39e66f7ecf73cca11dbf8db36/OpenRA.Mods.Common/LoadScreens
  159.                  File exists
  160.                  unable to process OpenRA-27cfa9b1f08668f39e66f7ecf73cca11dbf8db36/OpenRA.Mods.Common/LoadScreens/.
  161. checkdir error:  cannot create ./engine_temp/OpenRA-27cfa9b1f08668f39e66f7ecf73cca11dbf8db36/OpenRA.Mods.Common/Orders
  162.                  File exists
  163.                  unable to process OpenRA-27cfa9b1f08668f39e66f7ecf73cca11dbf8db36/OpenRA.Mods.Common/Orders/.
  164. checkdir error:  cannot create ./engine_temp/OpenRA-27cfa9b1f08668f39e66f7ecf73cca11dbf8db36/OpenRA.Mods.Common/Pathfinder
  165.                  File exists
  166.                  unable to process OpenRA-27cfa9b1f08668f39e66f7ecf73cca11dbf8db36/OpenRA.Mods.Common/Pathfinder/.
  167. checkdir error:  cannot create ./engine_temp/OpenRA-27cfa9b1f08668f39e66f7ecf73cca11dbf8db36/OpenRA.Mods.Common/Projectiles
  168.                  File exists
  169.                  unable to process OpenRA-27cfa9b1f08668f39e66f7ecf73cca11dbf8db36/OpenRA.Mods.Common/Projectiles/.
  170. checkdir error:  cannot create ./engine_temp/OpenRA-27cfa9b1f08668f39e66f7ecf73cca11dbf8db36/OpenRA.Mods.Common/Scripting
  171.                  File exists
  172.                  unable to process OpenRA-27cfa9b1f08668f39e66f7ecf73cca11dbf8db36/OpenRA.Mods.Common/Scripting/.
  173. checkdir error:  cannot create ./engine_temp/OpenRA-27cfa9b1f08668f39e66f7ecf73cca11dbf8db36/OpenRA.Mods.Common/Scripting/Global
  174.                  File exists
  175.                  unable to process OpenRA-27cfa9b1f08668f39e66f7ecf73cca11dbf8db36/OpenRA.Mods.Common/Scripting/Global/.
  176. checkdir error:  cannot create ./engine_temp/OpenRA-27cfa9b1f08668f39e66f7ecf73cca11dbf8db36/OpenRA.Mods.Common/Scripting/Properties
  177.                  File exists
  178.                  unable to process OpenRA-27cfa9b1f08668f39e66f7ecf73cca11dbf8db36/OpenRA.Mods.Common/Scripting/Properties/.
  179. checkdir error:  cannot create ./engine_temp/OpenRA-27cfa9b1f08668f39e66f7ecf73cca11dbf8db36/OpenRA.Mods.Common/ServerTraits
  180.                  File exists
  181.                  unable to process OpenRA-27cfa9b1f08668f39e66f7ecf73cca11dbf8db36/OpenRA.Mods.Common/ServerTraits/.
  182. checkdir error:  cannot create ./engine_temp/OpenRA-27cfa9b1f08668f39e66f7ecf73cca11dbf8db36/OpenRA.Mods.Common/SpriteLoaders
  183.                  File exists
  184.                  unable to process OpenRA-27cfa9b1f08668f39e66f7ecf73cca11dbf8db36/OpenRA.Mods.Common/SpriteLoaders/.
  185. checkdir error:  cannot create ./engine_temp/OpenRA-27cfa9b1f08668f39e66f7ecf73cca11dbf8db36/OpenRA.Mods.Common/Traits
  186.                  File exists
  187.                  unable to process OpenRA-27cfa9b1f08668f39e66f7ecf73cca11dbf8db36/OpenRA.Mods.Common/Traits/.
  188. checkdir error:  cannot create ./engine_temp/OpenRA-27cfa9b1f08668f39e66f7ecf73cca11dbf8db36/OpenRA.Mods.Common/Traits/Air
  189.                  File exists
  190.                  unable to process OpenRA-27cfa9b1f08668f39e66f7ecf73cca11dbf8db36/OpenRA.Mods.Common/Traits/Air/.
  191. checkdir error:  cannot create ./engine_temp/OpenRA-27cfa9b1f08668f39e66f7ecf73cca11dbf8db36/OpenRA.Mods.Common/Traits/Attack
  192.                  File exists
  193.                  unable to process OpenRA-27cfa9b1f08668f39e66f7ecf73cca11dbf8db36/OpenRA.Mods.Common/Traits/Attack/.
  194. checkdir error:  cannot create ./engine_temp/OpenRA-27cfa9b1f08668f39e66f7ecf73cca11dbf8db36/OpenRA.Mods.Common/Traits/BotModules
  195.                  File exists
  196.                  unable to process OpenRA-27cfa9b1f08668f39e66f7ecf73cca11dbf8db36/OpenRA.Mods.Common/Traits/BotModules/.
  197. checkdir error:  cannot create ./engine_temp/OpenRA-27cfa9b1f08668f39e66f7ecf73cca11dbf8db36/OpenRA.Mods.Common/Traits/BotModules/BotModuleLogic
  198.                  File exists
  199.                  unable to process OpenRA-27cfa9b1f08668f39e66f7ecf73cca11dbf8db36/OpenRA.Mods.Common/Traits/BotModules/BotModuleLogic/.
  200. checkdir error:  cannot create ./engine_temp/OpenRA-27cfa9b1f08668f39e66f7ecf73cca11dbf8db36/OpenRA.Mods.Common/Traits/BotModules/Squads
  201.                  File exists
  202.                  unable to process OpenRA-27cfa9b1f08668f39e66f7ecf73cca11dbf8db36/OpenRA.Mods.Common/Traits/BotModules/Squads/.
  203. checkdir error:  cannot create ./engine_temp/OpenRA-27cfa9b1f08668f39e66f7ecf73cca11dbf8db36/OpenRA.Mods.Common/Traits/BotModules/Squads/States
  204.                  File exists
  205.                  unable to process OpenRA-27cfa9b1f08668f39e66f7ecf73cca11dbf8db36/OpenRA.Mods.Common/Traits/BotModules/Squads/States/.
  206. checkdir error:  cannot create ./engine_temp/OpenRA-27cfa9b1f08668f39e66f7ecf73cca11dbf8db36/OpenRA.Mods.Common/Traits/Buildings
  207.                  File exists
  208.                  unable to process OpenRA-27cfa9b1f08668f39e66f7ecf73cca11dbf8db36/OpenRA.Mods.Common/Traits/Buildings/.
  209. checkdir error:  cannot create ./engine_temp/OpenRA-27cfa9b1f08668f39e66f7ecf73cca11dbf8db36/OpenRA.Mods.Common/Traits/Conditions
  210.                  File exists
  211.                  unable to process OpenRA-27cfa9b1f08668f39e66f7ecf73cca11dbf8db36/OpenRA.Mods.Common/Traits/Conditions/.
  212. checkdir error:  cannot create ./engine_temp/OpenRA-27cfa9b1f08668f39e66f7ecf73cca11dbf8db36/OpenRA.Mods.Common/Traits/Crates
  213.                  File exists
  214.                  unable to process OpenRA-27cfa9b1f08668f39e66f7ecf73cca11dbf8db36/OpenRA.Mods.Common/Traits/Crates/.
  215. checkdir error:  cannot create ./engine_temp/OpenRA-27cfa9b1f08668f39e66f7ecf73cca11dbf8db36/OpenRA.Mods.Common/Traits/Infantry
  216.                  File exists
  217.                  unable to process OpenRA-27cfa9b1f08668f39e66f7ecf73cca11dbf8db36/OpenRA.Mods.Common/Traits/Infantry/.
  218. checkdir error:  cannot create ./engine_temp/OpenRA-27cfa9b1f08668f39e66f7ecf73cca11dbf8db36/OpenRA.Mods.Common/Traits/Multipliers
  219.                  File exists
  220.                  unable to process OpenRA-27cfa9b1f08668f39e66f7ecf73cca11dbf8db36/OpenRA.Mods.Common/Traits/Multipliers/.
  221. checkdir error:  cannot create ./engine_temp/OpenRA-27cfa9b1f08668f39e66f7ecf73cca11dbf8db36/OpenRA.Mods.Common/Traits/Player
  222.                  File exists
  223.                  unable to process OpenRA-27cfa9b1f08668f39e66f7ecf73cca11dbf8db36/OpenRA.Mods.Common/Traits/Player/.
  224. checkdir error:  cannot create ./engine_temp/OpenRA-27cfa9b1f08668f39e66f7ecf73cca11dbf8db36/OpenRA.Mods.Common/Traits/Radar
  225.                  File exists
  226.                  unable to process OpenRA-27cfa9b1f08668f39e66f7ecf73cca11dbf8db36/OpenRA.Mods.Common/Traits/Radar/.
  227. checkdir error:  cannot create ./engine_temp/OpenRA-27cfa9b1f08668f39e66f7ecf73cca11dbf8db36/OpenRA.Mods.Common/Traits/Sound
  228.                  File exists
  229.                  unable to process OpenRA-27cfa9b1f08668f39e66f7ecf73cca11dbf8db36/OpenRA.Mods.Common/Traits/Sound/.
  230. checkdir error:  cannot create ./engine_temp/OpenRA-27cfa9b1f08668f39e66f7ecf73cca11dbf8db36/OpenRA.Mods.Common/Traits/SupportPowers
  231.                  File exists
  232.                  unable to process OpenRA-27cfa9b1f08668f39e66f7ecf73cca11dbf8db36/OpenRA.Mods.Common/Traits/SupportPowers/.
  233. checkdir error:  cannot create ./engine_temp/OpenRA-27cfa9b1f08668f39e66f7ecf73cca11dbf8db36/OpenRA.Mods.Common/UpdateRules
  234.                  File exists
  235.                  unable to process OpenRA-27cfa9b1f08668f39e66f7ecf73cca11dbf8db36/OpenRA.Mods.Common/UpdateRules/.
  236. checkdir error:  cannot create ./engine_temp/OpenRA-27cfa9b1f08668f39e66f7ecf73cca11dbf8db36/OpenRA.Mods.Common/UpdateRules/Rules
  237.                  File exists
  238.                  unable to process OpenRA-27cfa9b1f08668f39e66f7ecf73cca11dbf8db36/OpenRA.Mods.Common/UpdateRules/Rules/.
  239. checkdir error:  cannot create ./engine_temp/OpenRA-27cfa9b1f08668f39e66f7ecf73cca11dbf8db36/OpenRA.Mods.Common/UpdateRules/Rules/20171014
  240.                  File exists
  241.                  unable to process OpenRA-27cfa9b1f08668f39e66f7ecf73cca11dbf8db36/OpenRA.Mods.Common/UpdateRules/Rules/20171014/.
  242. checkdir error:  cannot create ./engine_temp/OpenRA-27cfa9b1f08668f39e66f7ecf73cca11dbf8db36/OpenRA.Mods.Common/UpdateRules/Rules/20180307
  243.                  File exists
  244.                  unable to process OpenRA-27cfa9b1f08668f39e66f7ecf73cca11dbf8db36/OpenRA.Mods.Common/UpdateRules/Rules/20180307/.
  245. checkdir error:  cannot create ./engine_temp/OpenRA-27cfa9b1f08668f39e66f7ecf73cca11dbf8db36/OpenRA.Mods.Common/UpdateRules/Rules/20181215
  246.                  File exists
  247.                  unable to process OpenRA-27cfa9b1f08668f39e66f7ecf73cca11dbf8db36/OpenRA.Mods.Common/UpdateRules/Rules/20181215/.
  248. checkdir error:  cannot create ./engine_temp/OpenRA-27cfa9b1f08668f39e66f7ecf73cca11dbf8db36/OpenRA.Mods.Common/UpdateRules/Rules/20190314
  249.                  File exists
  250.                  unable to process OpenRA-27cfa9b1f08668f39e66f7ecf73cca11dbf8db36/OpenRA.Mods.Common/UpdateRules/Rules/20190314/.
  251. checkdir error:  cannot create ./engine_temp/OpenRA-27cfa9b1f08668f39e66f7ecf73cca11dbf8db36/OpenRA.Mods.Common/UtilityCommands
  252.                  File exists
  253.                  unable to process OpenRA-27cfa9b1f08668f39e66f7ecf73cca11dbf8db36/OpenRA.Mods.Common/UtilityCommands/.
  254. checkdir error:  cannot create ./engine_temp/OpenRA-27cfa9b1f08668f39e66f7ecf73cca11dbf8db36/OpenRA.Mods.Common/Widgets
  255.                  File exists
  256.                  unable to process OpenRA-27cfa9b1f08668f39e66f7ecf73cca11dbf8db36/OpenRA.Mods.Common/Widgets/.
  257. checkdir error:  cannot create ./engine_temp/OpenRA-27cfa9b1f08668f39e66f7ecf73cca11dbf8db36/OpenRA.Mods.Common/Widgets/Logic
  258.                  File exists
  259.                  unable to process OpenRA-27cfa9b1f08668f39e66f7ecf73cca11dbf8db36/OpenRA.Mods.Common/Widgets/Logic/.
  260. checkdir error:  cannot create ./engine_temp/OpenRA-27cfa9b1f08668f39e66f7ecf73cca11dbf8db36/OpenRA.Mods.Common/Widgets/Logic/Editor
  261.                  File exists
  262.                  unable to process OpenRA-27cfa9b1f08668f39e66f7ecf73cca11dbf8db36/OpenRA.Mods.Common/Widgets/Logic/Editor/.
  263. checkdir error:  cannot create ./engine_temp/OpenRA-27cfa9b1f08668f39e66f7ecf73cca11dbf8db36/OpenRA.Mods.Common/Widgets/Logic/Ingame
  264.                  File exists
  265.                  unable to process OpenRA-27cfa9b1f08668f39e66f7ecf73cca11dbf8db36/OpenRA.Mods.Common/Widgets/Logic/Ingame/.
  266. checkdir error:  cannot create ./engine_temp/OpenRA-27cfa9b1f08668f39e66f7ecf73cca11dbf8db36/OpenRA.Mods.Common/Widgets/Logic/Lobby
  267.                  File exists
  268.                  unable to process OpenRA-27cfa9b1f08668f39e66f7ecf73cca11dbf8db36/OpenRA.Mods.Common/Widgets/Logic/Lobby/.
  269. checkdir error:  cannot create ./engine_temp/OpenRA-27cfa9b1f08668f39e66f7ecf73cca11dbf8db36/OpenRA.Mods.D2k
  270.                  File exists
  271.                  unable to process OpenRA-27cfa9b1f08668f39e66f7ecf73cca11dbf8db36/OpenRA.Mods.D2k/.
  272. checkdir error:  cannot create ./engine_temp/OpenRA-27cfa9b1f08668f39e66f7ecf73cca11dbf8db36/OpenRA.Mods.D2k/Activities
  273.                  File exists
  274.                  unable to process OpenRA-27cfa9b1f08668f39e66f7ecf73cca11dbf8db36/OpenRA.Mods.D2k/Activities/.
  275. checkdir error:  cannot create ./engine_temp/OpenRA-27cfa9b1f08668f39e66f7ecf73cca11dbf8db36/OpenRA.Mods.D2k/Lint
  276.                  File exists
  277.                  unable to process OpenRA-27cfa9b1f08668f39e66f7ecf73cca11dbf8db36/OpenRA.Mods.D2k/Lint/.
  278. checkdir error:  cannot create ./engine_temp/OpenRA-27cfa9b1f08668f39e66f7ecf73cca11dbf8db36/OpenRA.Mods.D2k/PackageLoaders
  279.                  File exists
  280.                  unable to process OpenRA-27cfa9b1f08668f39e66f7ecf73cca11dbf8db36/OpenRA.Mods.D2k/PackageLoaders/.
  281. checkdir error:  cannot create ./engine_temp/OpenRA-27cfa9b1f08668f39e66f7ecf73cca11dbf8db36/OpenRA.Mods.D2k/SpriteLoaders
  282.                  File exists
  283.                  unable to process OpenRA-27cfa9b1f08668f39e66f7ecf73cca11dbf8db36/OpenRA.Mods.D2k/SpriteLoaders/.
  284. checkdir error:  cannot create ./engine_temp/OpenRA-27cfa9b1f08668f39e66f7ecf73cca11dbf8db36/OpenRA.Mods.D2k/Traits
  285.                  File exists
  286.                  unable to process OpenRA-27cfa9b1f08668f39e66f7ecf73cca11dbf8db36/OpenRA.Mods.D2k/Traits/.
  287. checkdir error:  cannot create ./engine_temp/OpenRA-27cfa9b1f08668f39e66f7ecf73cca11dbf8db36/OpenRA.Mods.D2k/Traits/Buildings
  288.                  File exists
  289.                  unable to process OpenRA-27cfa9b1f08668f39e66f7ecf73cca11dbf8db36/OpenRA.Mods.D2k/Traits/Buildings/.
  290. checkdir error:  cannot create ./engine_temp/OpenRA-27cfa9b1f08668f39e66f7ecf73cca11dbf8db36/OpenRA.Mods.D2k/Traits/Render
  291.                  File exists
  292.                  unable to process OpenRA-27cfa9b1f08668f39e66f7ecf73cca11dbf8db36/OpenRA.Mods.D2k/Traits/Render/.
  293. checkdir error:  cannot create ./engine_temp/OpenRA-27cfa9b1f08668f39e66f7ecf73cca11dbf8db36/OpenRA.Mods.D2k/Traits/World
  294.                  File exists
  295.                  unable to process OpenRA-27cfa9b1f08668f39e66f7ecf73cca11dbf8db36/OpenRA.Mods.D2k/Traits/World/.
  296. checkdir error:  cannot create ./engine_temp/OpenRA-27cfa9b1f08668f39e66f7ecf73cca11dbf8db36/OpenRA.Mods.D2k/UtilityCommands
  297.                  File exists
  298.                  unable to process OpenRA-27cfa9b1f08668f39e66f7ecf73cca11dbf8db36/OpenRA.Mods.D2k/UtilityCommands/.
  299. checkdir error:  cannot create ./engine_temp/OpenRA-27cfa9b1f08668f39e66f7ecf73cca11dbf8db36/OpenRA.Mods.D2k/Warheads
  300.                  File exists
  301.                  unable to process OpenRA-27cfa9b1f08668f39e66f7ecf73cca11dbf8db36/OpenRA.Mods.D2k/Warheads/.
  302. checkdir error:  cannot create ./engine_temp/OpenRA-27cfa9b1f08668f39e66f7ecf73cca11dbf8db36/OpenRA.Platforms.Default
  303.                  File exists
  304.                  unable to process OpenRA-27cfa9b1f08668f39e66f7ecf73cca11dbf8db36/OpenRA.Platforms.Default/.
  305. checkdir error:  cannot create ./engine_temp/OpenRA-27cfa9b1f08668f39e66f7ecf73cca11dbf8db36/OpenRA.PostProcess
  306.                  File exists
  307.                  unable to process OpenRA-27cfa9b1f08668f39e66f7ecf73cca11dbf8db36/OpenRA.PostProcess/.
  308. checkdir error:  cannot create ./engine_temp/OpenRA-27cfa9b1f08668f39e66f7ecf73cca11dbf8db36/OpenRA.Server
  309.                  File exists
  310.                  unable to process OpenRA-27cfa9b1f08668f39e66f7ecf73cca11dbf8db36/OpenRA.Server/.
  311. checkdir error:  cannot create ./engine_temp/OpenRA-27cfa9b1f08668f39e66f7ecf73cca11dbf8db36/OpenRA.Test
  312.                  File exists
  313.                  unable to process OpenRA-27cfa9b1f08668f39e66f7ecf73cca11dbf8db36/OpenRA.Test/.
  314. checkdir error:  cannot create ./engine_temp/OpenRA-27cfa9b1f08668f39e66f7ecf73cca11dbf8db36/OpenRA.Test/OpenRA.Mods.Common
  315.                  File exists
  316.                  unable to process OpenRA-27cfa9b1f08668f39e66f7ecf73cca11dbf8db36/OpenRA.Test/OpenRA.Mods.Common/.
  317. checkdir error:  cannot create ./engine_temp/OpenRA-27cfa9b1f08668f39e66f7ecf73cca11dbf8db36/OpenRA.Utility
  318.                  File exists
  319.                  unable to process OpenRA-27cfa9b1f08668f39e66f7ecf73cca11dbf8db36/OpenRA.Utility/.
  320. checkdir error:  cannot create ./engine_temp/OpenRA-27cfa9b1f08668f39e66f7ecf73cca11dbf8db36/lua
  321.                  File exists
  322.                  unable to process OpenRA-27cfa9b1f08668f39e66f7ecf73cca11dbf8db36/lua/.
  323. checkdir error:  cannot create ./engine_temp/OpenRA-27cfa9b1f08668f39e66f7ecf73cca11dbf8db36/mods/all
  324.                  File exists
  325.                  unable to process OpenRA-27cfa9b1f08668f39e66f7ecf73cca11dbf8db36/mods/all/.
  326. checkdir error:  cannot create ./engine_temp/OpenRA-27cfa9b1f08668f39e66f7ecf73cca11dbf8db36/mods/cnc
  327.                  File exists
  328.                  unable to process OpenRA-27cfa9b1f08668f39e66f7ecf73cca11dbf8db36/mods/cnc/.
  329. checkdir error:  cannot create ./engine_temp/OpenRA-27cfa9b1f08668f39e66f7ecf73cca11dbf8db36/mods/cnc/audio
  330.                  File exists
  331.                  unable to process OpenRA-27cfa9b1f08668f39e66f7ecf73cca11dbf8db36/mods/cnc/audio/.
  332. checkdir error:  cannot create ./engine_temp/OpenRA-27cfa9b1f08668f39e66f7ecf73cca11dbf8db36/mods/cnc/bits
  333.                  File exists
  334.                  unable to process OpenRA-27cfa9b1f08668f39e66f7ecf73cca11dbf8db36/mods/cnc/bits/.
  335. checkdir error:  cannot create ./engine_temp/OpenRA-27cfa9b1f08668f39e66f7ecf73cca11dbf8db36/mods/cnc/bits/desert
  336.                  File exists
  337.                  unable to process OpenRA-27cfa9b1f08668f39e66f7ecf73cca11dbf8db36/mods/cnc/bits/desert/.
  338. checkdir error:  cannot create ./engine_temp/OpenRA-27cfa9b1f08668f39e66f7ecf73cca11dbf8db36/mods/cnc/bits/jungle
  339.                  File exists
  340.                  unable to process OpenRA-27cfa9b1f08668f39e66f7ecf73cca11dbf8db36/mods/cnc/bits/jungle/.
  341. checkdir error:  cannot create ./engine_temp/OpenRA-27cfa9b1f08668f39e66f7ecf73cca11dbf8db36/mods/cnc/bits/ss
  342.                  File exists
  343.                  unable to process OpenRA-27cfa9b1f08668f39e66f7ecf73cca11dbf8db36/mods/cnc/bits/ss/.
  344. checkdir error:  cannot create ./engine_temp/OpenRA-27cfa9b1f08668f39e66f7ecf73cca11dbf8db36/mods/cnc/chrome
  345.                  File exists
  346.                  unable to process OpenRA-27cfa9b1f08668f39e66f7ecf73cca11dbf8db36/mods/cnc/chrome/.
  347. checkdir error:  cannot create ./engine_temp/OpenRA-27cfa9b1f08668f39e66f7ecf73cca11dbf8db36/mods/cnc/languages
  348.                  File exists
  349.                  unable to process OpenRA-27cfa9b1f08668f39e66f7ecf73cca11dbf8db36/mods/cnc/languages/.
  350. checkdir error:  cannot create ./engine_temp/OpenRA-27cfa9b1f08668f39e66f7ecf73cca11dbf8db36/mods/cnc/maps
  351.                  File exists
  352.                  unable to process OpenRA-27cfa9b1f08668f39e66f7ecf73cca11dbf8db36/mods/cnc/maps/.
  353. checkdir error:  cannot create ./engine_temp/OpenRA-27cfa9b1f08668f39e66f7ecf73cca11dbf8db36/mods/cnc/maps/blank-shellmap
  354.                  File exists
  355.                  unable to process OpenRA-27cfa9b1f08668f39e66f7ecf73cca11dbf8db36/mods/cnc/maps/blank-shellmap/.
  356. checkdir error:  cannot create ./engine_temp/OpenRA-27cfa9b1f08668f39e66f7ecf73cca11dbf8db36/mods/cnc/maps/desert-rats-cnc
  357.                  File exists
  358.                  unable to process OpenRA-27cfa9b1f08668f39e66f7ecf73cca11dbf8db36/mods/cnc/maps/desert-rats-cnc/.
  359. checkdir error:  cannot create ./engine_temp/OpenRA-27cfa9b1f08668f39e66f7ecf73cca11dbf8db36/mods/cnc/maps/gdi01
  360.                  File exists
  361.                  unable to process OpenRA-27cfa9b1f08668f39e66f7ecf73cca11dbf8db36/mods/cnc/maps/gdi01/.
  362. checkdir error:  cannot create ./engine_temp/OpenRA-27cfa9b1f08668f39e66f7ecf73cca11dbf8db36/mods/cnc/maps/gdi02
  363.                  File exists
  364.                  unable to process OpenRA-27cfa9b1f08668f39e66f7ecf73cca11dbf8db36/mods/cnc/maps/gdi02/.
  365. checkdir error:  cannot create ./engine_temp/OpenRA-27cfa9b1f08668f39e66f7ecf73cca11dbf8db36/mods/cnc/maps/gdi03
  366.                  File exists
  367.                  unable to process OpenRA-27cfa9b1f08668f39e66f7ecf73cca11dbf8db36/mods/cnc/maps/gdi03/.
  368. checkdir error:  cannot create ./engine_temp/OpenRA-27cfa9b1f08668f39e66f7ecf73cca11dbf8db36/mods/cnc/maps/gdi04a
  369.                  File exists
  370.                  unable to process OpenRA-27cfa9b1f08668f39e66f7ecf73cca11dbf8db36/mods/cnc/maps/gdi04a/.
  371. checkdir error:  cannot create ./engine_temp/OpenRA-27cfa9b1f08668f39e66f7ecf73cca11dbf8db36/mods/cnc/maps/gdi04b
  372.                  File exists
  373.                  unable to process OpenRA-27cfa9b1f08668f39e66f7ecf73cca11dbf8db36/mods/cnc/maps/gdi04b/.
  374. checkdir error:  cannot create ./engine_temp/OpenRA-27cfa9b1f08668f39e66f7ecf73cca11dbf8db36/mods/cnc/maps/gdi04c
  375.                  File exists
  376.                  unable to process OpenRA-27cfa9b1f08668f39e66f7ecf73cca11dbf8db36/mods/cnc/maps/gdi04c/.
  377. checkdir error:  cannot create ./engine_temp/OpenRA-27cfa9b1f08668f39e66f7ecf73cca11dbf8db36/mods/cnc/maps/gdi05a
  378.                  File exists
  379.                  unable to process OpenRA-27cfa9b1f08668f39e66f7ecf73cca11dbf8db36/mods/cnc/maps/gdi05a/.
  380. checkdir error:  cannot create ./engine_temp/OpenRA-27cfa9b1f08668f39e66f7ecf73cca11dbf8db36/mods/cnc/maps/gdi05b
  381.                  File exists
  382.                  unable to process OpenRA-27cfa9b1f08668f39e66f7ecf73cca11dbf8db36/mods/cnc/maps/gdi05b/.
  383. checkdir error:  cannot create ./engine_temp/OpenRA-27cfa9b1f08668f39e66f7ecf73cca11dbf8db36/mods/cnc/maps/gdi06
  384.                  File exists
  385.                  unable to process OpenRA-27cfa9b1f08668f39e66f7ecf73cca11dbf8db36/mods/cnc/maps/gdi06/.
  386. checkdir error:  cannot create ./engine_temp/OpenRA-27cfa9b1f08668f39e66f7ecf73cca11dbf8db36/mods/cnc/maps/gdi07
  387.                  File exists
  388.                  unable to process OpenRA-27cfa9b1f08668f39e66f7ecf73cca11dbf8db36/mods/cnc/maps/gdi07/.
  389. checkdir error:  cannot create ./engine_temp/OpenRA-27cfa9b1f08668f39e66f7ecf73cca11dbf8db36/mods/cnc/maps/nod01
  390.                  File exists
  391.                  unable to process OpenRA-27cfa9b1f08668f39e66f7ecf73cca11dbf8db36/mods/cnc/maps/nod01/.
  392. checkdir error:  cannot create ./engine_temp/OpenRA-27cfa9b1f08668f39e66f7ecf73cca11dbf8db36/mods/cnc/maps/nod02a
  393.                  File exists
  394.                  unable to process OpenRA-27cfa9b1f08668f39e66f7ecf73cca11dbf8db36/mods/cnc/maps/nod02a/.
  395. checkdir error:  cannot create ./engine_temp/OpenRA-27cfa9b1f08668f39e66f7ecf73cca11dbf8db36/mods/cnc/maps/nod02b
  396.                  File exists
  397.                  unable to process OpenRA-27cfa9b1f08668f39e66f7ecf73cca11dbf8db36/mods/cnc/maps/nod02b/.
  398. checkdir error:  cannot create ./engine_temp/OpenRA-27cfa9b1f08668f39e66f7ecf73cca11dbf8db36/mods/cnc/maps/nod03b
  399.                  File exists
  400.                  unable to process OpenRA-27cfa9b1f08668f39e66f7ecf73cca11dbf8db36/mods/cnc/maps/nod03b/.
  401. checkdir error:  cannot create ./engine_temp/OpenRA-27cfa9b1f08668f39e66f7ecf73cca11dbf8db36/mods/cnc/maps/nod04a
  402.                  File exists
  403.                  unable to process OpenRA-27cfa9b1f08668f39e66f7ecf73cca11dbf8db36/mods/cnc/maps/nod04a/.
  404. checkdir error:  cannot create ./engine_temp/OpenRA-27cfa9b1f08668f39e66f7ecf73cca11dbf8db36/mods/cnc/maps/nod04b
  405.                  File exists
  406.                  unable to process OpenRA-27cfa9b1f08668f39e66f7ecf73cca11dbf8db36/mods/cnc/maps/nod04b/.
  407. checkdir error:  cannot create ./engine_temp/OpenRA-27cfa9b1f08668f39e66f7ecf73cca11dbf8db36/mods/cnc/maps/nod05
  408.                  File exists
  409.                  unable to process OpenRA-27cfa9b1f08668f39e66f7ecf73cca11dbf8db36/mods/cnc/maps/nod05/.
  410. checkdir error:  cannot create ./engine_temp/OpenRA-27cfa9b1f08668f39e66f7ecf73cca11dbf8db36/mods/cnc/maps/nod06a
  411.                  File exists
  412.                  unable to process OpenRA-27cfa9b1f08668f39e66f7ecf73cca11dbf8db36/mods/cnc/maps/nod06a/.
  413. checkdir error:  cannot create ./engine_temp/OpenRA-27cfa9b1f08668f39e66f7ecf73cca11dbf8db36/mods/cnc/maps/nod06b
  414.                  File exists
  415.                  unable to process OpenRA-27cfa9b1f08668f39e66f7ecf73cca11dbf8db36/mods/cnc/maps/nod06b/.
  416. checkdir error:  cannot create ./engine_temp/OpenRA-27cfa9b1f08668f39e66f7ecf73cca11dbf8db36/mods/cnc/maps/nod06c
  417.                  File exists
  418.                  unable to process OpenRA-27cfa9b1f08668f39e66f7ecf73cca11dbf8db36/mods/cnc/maps/nod06c/.
  419. checkdir error:  cannot create ./engine_temp/OpenRA-27cfa9b1f08668f39e66f7ecf73cca11dbf8db36/mods/cnc/maps/nod07a
  420.                  File exists
  421.                  unable to process OpenRA-27cfa9b1f08668f39e66f7ecf73cca11dbf8db36/mods/cnc/maps/nod07a/.
  422. checkdir error:  cannot create ./engine_temp/OpenRA-27cfa9b1f08668f39e66f7ecf73cca11dbf8db36/mods/cnc/maps/nod07b
  423.                  File exists
  424.                  unable to process OpenRA-27cfa9b1f08668f39e66f7ecf73cca11dbf8db36/mods/cnc/maps/nod07b/.
  425. checkdir error:  cannot create ./engine_temp/OpenRA-27cfa9b1f08668f39e66f7ecf73cca11dbf8db36/mods/cnc/maps/nod07c
  426.                  File exists
  427.                  unable to process OpenRA-27cfa9b1f08668f39e66f7ecf73cca11dbf8db36/mods/cnc/maps/nod07c/.
  428. checkdir error:  cannot create ./engine_temp/OpenRA-27cfa9b1f08668f39e66f7ecf73cca11dbf8db36/mods/cnc/maps/nod08a
  429.                  File exists
  430.                  unable to process OpenRA-27cfa9b1f08668f39e66f7ecf73cca11dbf8db36/mods/cnc/maps/nod08a/.
  431. checkdir error:  cannot create ./engine_temp/OpenRA-27cfa9b1f08668f39e66f7ecf73cca11dbf8db36/mods/cnc/maps/nod08b
  432.                  File exists
  433.                  unable to process OpenRA-27cfa9b1f08668f39e66f7ecf73cca11dbf8db36/mods/cnc/maps/nod08b/.
  434. checkdir error:  cannot create ./engine_temp/OpenRA-27cfa9b1f08668f39e66f7ecf73cca11dbf8db36/mods/cnc/maps/nod10a
  435.                  File exists
  436.                  unable to process OpenRA-27cfa9b1f08668f39e66f7ecf73cca11dbf8db36/mods/cnc/maps/nod10a/.
  437. checkdir error:  cannot create ./engine_temp/OpenRA-27cfa9b1f08668f39e66f7ecf73cca11dbf8db36/mods/cnc/maps/nod10b
  438.                  File exists
  439.                  unable to process OpenRA-27cfa9b1f08668f39e66f7ecf73cca11dbf8db36/mods/cnc/maps/nod10b/.
  440. checkdir error:  cannot create ./engine_temp/OpenRA-27cfa9b1f08668f39e66f7ecf73cca11dbf8db36/mods/cnc/rules
  441.                  File exists
  442.                  unable to process OpenRA-27cfa9b1f08668f39e66f7ecf73cca11dbf8db36/mods/cnc/rules/.
  443. checkdir error:  cannot create ./engine_temp/OpenRA-27cfa9b1f08668f39e66f7ecf73cca11dbf8db36/mods/d2k/bits/tex
  444.                  File exists
  445.                  unable to process OpenRA-27cfa9b1f08668f39e66f7ecf73cca11dbf8db36/mods/d2k/bits/tex/.
  446. checkdir error:  cannot create ./engine_temp/OpenRA-27cfa9b1f08668f39e66f7ecf73cca11dbf8db36/mods/d2k/chrome
  447.                  File exists
  448.                  unable to process OpenRA-27cfa9b1f08668f39e66f7ecf73cca11dbf8db36/mods/d2k/chrome/.
  449. checkdir error:  cannot create ./engine_temp/OpenRA-27cfa9b1f08668f39e66f7ecf73cca11dbf8db36/mods/d2k/installer
  450.                  File exists
  451.                  unable to process OpenRA-27cfa9b1f08668f39e66f7ecf73cca11dbf8db36/mods/d2k/installer/.
  452. checkdir error:  cannot create ./engine_temp/OpenRA-27cfa9b1f08668f39e66f7ecf73cca11dbf8db36/mods/d2k/maps
  453.                  File exists
  454.                  unable to process OpenRA-27cfa9b1f08668f39e66f7ecf73cca11dbf8db36/mods/d2k/maps/.
  455. checkdir error:  cannot create ./engine_temp/OpenRA-27cfa9b1f08668f39e66f7ecf73cca11dbf8db36/mods/d2k/maps/atreides-01a
  456.                  File exists
  457.                  unable to process OpenRA-27cfa9b1f08668f39e66f7ecf73cca11dbf8db36/mods/d2k/maps/atreides-01a/.
  458. checkdir error:  cannot create ./engine_temp/OpenRA-27cfa9b1f08668f39e66f7ecf73cca11dbf8db36/mods/d2k/maps/atreides-01b
  459.                  File exists
  460.                  unable to process OpenRA-27cfa9b1f08668f39e66f7ecf73cca11dbf8db36/mods/d2k/maps/atreides-01b/.
  461. checkdir error:  cannot create ./engine_temp/OpenRA-27cfa9b1f08668f39e66f7ecf73cca11dbf8db36/mods/d2k/maps/atreides-02a
  462.                  File exists
  463.                  unable to process OpenRA-27cfa9b1f08668f39e66f7ecf73cca11dbf8db36/mods/d2k/maps/atreides-02a/.
  464. checkdir error:  cannot create ./engine_temp/OpenRA-27cfa9b1f08668f39e66f7ecf73cca11dbf8db36/mods/d2k/maps/harkonnen-01a
  465.                  File exists
  466.                  unable to process OpenRA-27cfa9b1f08668f39e66f7ecf73cca11dbf8db36/mods/d2k/maps/harkonnen-01a/.
  467. checkdir error:  cannot create ./engine_temp/OpenRA-27cfa9b1f08668f39e66f7ecf73cca11dbf8db36/mods/d2k/maps/ordos-01a
  468.                  File exists
  469.                  unable to process OpenRA-27cfa9b1f08668f39e66f7ecf73cca11dbf8db36/mods/d2k/maps/ordos-01a/.
  470. checkdir error:  cannot create ./engine_temp/OpenRA-27cfa9b1f08668f39e66f7ecf73cca11dbf8db36/mods/d2k/maps/ordos-02b
  471.                  File exists
  472.                  unable to process OpenRA-27cfa9b1f08668f39e66f7ecf73cca11dbf8db36/mods/d2k/maps/ordos-02b/.
  473. checkdir error:  cannot create ./engine_temp/OpenRA-27cfa9b1f08668f39e66f7ecf73cca11dbf8db36/mods/d2k/maps/ordos-03a
  474.                  File exists
  475.                  unable to process OpenRA-27cfa9b1f08668f39e66f7ecf73cca11dbf8db36/mods/d2k/maps/ordos-03a/.
  476. checkdir error:  cannot create ./engine_temp/OpenRA-27cfa9b1f08668f39e66f7ecf73cca11dbf8db36/mods/d2k/maps/ordos-03b
  477.                  File exists
  478.                  unable to process OpenRA-27cfa9b1f08668f39e66f7ecf73cca11dbf8db36/mods/d2k/maps/ordos-03b/.
  479. checkdir error:  cannot create ./engine_temp/OpenRA-27cfa9b1f08668f39e66f7ecf73cca11dbf8db36/mods/d2k/sequences
  480.                  File exists
  481.                  unable to process OpenRA-27cfa9b1f08668f39e66f7ecf73cca11dbf8db36/mods/d2k/sequences/.
  482. checkdir error:  cannot create ./engine_temp/OpenRA-27cfa9b1f08668f39e66f7ecf73cca11dbf8db36/mods/d2k/tilesets
  483.                  File exists
  484.                  unable to process OpenRA-27cfa9b1f08668f39e66f7ecf73cca11dbf8db36/mods/d2k/tilesets/.
  485. checkdir error:  cannot create ./engine_temp/OpenRA-27cfa9b1f08668f39e66f7ecf73cca11dbf8db36/mods/ra/bits/desert
  486.                  File exists
  487.                  unable to process OpenRA-27cfa9b1f08668f39e66f7ecf73cca11dbf8db36/mods/ra/bits/desert/.
  488. checkdir error:  cannot create ./engine_temp/OpenRA-27cfa9b1f08668f39e66f7ecf73cca11dbf8db36/mods/ra/chrome
  489.                  File exists
  490.                  unable to process OpenRA-27cfa9b1f08668f39e66f7ecf73cca11dbf8db36/mods/ra/chrome/.
  491. checkdir error:  cannot create ./engine_temp/OpenRA-27cfa9b1f08668f39e66f7ecf73cca11dbf8db36/mods/ra/installer
  492.                  File exists
  493.                  unable to process OpenRA-27cfa9b1f08668f39e66f7ecf73cca11dbf8db36/mods/ra/installer/.
  494. checkdir error:  cannot create ./engine_temp/OpenRA-27cfa9b1f08668f39e66f7ecf73cca11dbf8db36/mods/ra/languages
  495.                  File exists
  496.                  unable to process OpenRA-27cfa9b1f08668f39e66f7ecf73cca11dbf8db36/mods/ra/languages/.
  497. checkdir error:  cannot create ./engine_temp/OpenRA-27cfa9b1f08668f39e66f7ecf73cca11dbf8db36/mods/ra/maps
  498.                  File exists
  499.                  unable to process OpenRA-27cfa9b1f08668f39e66f7ecf73cca11dbf8db36/mods/ra/maps/.
  500. checkdir error:  cannot create ./engine_temp/OpenRA-27cfa9b1f08668f39e66f7ecf73cca11dbf8db36/mods/ra/maps/a-nuclear-winter
  501.                  File exists
  502.                  unable to process OpenRA-27cfa9b1f08668f39e66f7ecf73cca11dbf8db36/mods/ra/maps/a-nuclear-winter/.
  503. checkdir error:  cannot create ./engine_temp/OpenRA-27cfa9b1f08668f39e66f7ecf73cca11dbf8db36/mods/ra/maps/allies-01
  504.                  File exists
  505.                  unable to process OpenRA-27cfa9b1f08668f39e66f7ecf73cca11dbf8db36/mods/ra/maps/allies-01/.
  506. checkdir error:  cannot create ./engine_temp/OpenRA-27cfa9b1f08668f39e66f7ecf73cca11dbf8db36/mods/ra/maps/allies-03b
  507.                  File exists
  508.                  unable to process OpenRA-27cfa9b1f08668f39e66f7ecf73cca11dbf8db36/mods/ra/maps/allies-03b/.
  509. checkdir error:  cannot create ./engine_temp/OpenRA-27cfa9b1f08668f39e66f7ecf73cca11dbf8db36/mods/ra/maps/allies-04
  510.                  File exists
  511.                  unable to process OpenRA-27cfa9b1f08668f39e66f7ecf73cca11dbf8db36/mods/ra/maps/allies-04/.
  512. checkdir error:  cannot create ./engine_temp/OpenRA-27cfa9b1f08668f39e66f7ecf73cca11dbf8db36/mods/ra/maps/allies-05a
  513.                  File exists
  514.                  unable to process OpenRA-27cfa9b1f08668f39e66f7ecf73cca11dbf8db36/mods/ra/maps/allies-05a/.
  515. checkdir error:  cannot create ./engine_temp/OpenRA-27cfa9b1f08668f39e66f7ecf73cca11dbf8db36/mods/ra/maps/allies-06a
  516.                  File exists
  517.                  unable to process OpenRA-27cfa9b1f08668f39e66f7ecf73cca11dbf8db36/mods/ra/maps/allies-06a/.
  518. checkdir error:  cannot create ./engine_temp/OpenRA-27cfa9b1f08668f39e66f7ecf73cca11dbf8db36/mods/ra/maps/allies-06b
  519.                  File exists
  520.                  unable to process OpenRA-27cfa9b1f08668f39e66f7ecf73cca11dbf8db36/mods/ra/maps/allies-06b/.
  521. checkdir error:  cannot create ./engine_temp/OpenRA-27cfa9b1f08668f39e66f7ecf73cca11dbf8db36/mods/ra/maps/allies-07
  522.                  File exists
  523.                  unable to process OpenRA-27cfa9b1f08668f39e66f7ecf73cca11dbf8db36/mods/ra/maps/allies-07/.
  524. checkdir error:  cannot create ./engine_temp/OpenRA-27cfa9b1f08668f39e66f7ecf73cca11dbf8db36/mods/ra/maps/bomber-john
  525.                  File exists
  526.                  unable to process OpenRA-27cfa9b1f08668f39e66f7ecf73cca11dbf8db36/mods/ra/maps/bomber-john/.
  527. checkdir error:  cannot create ./engine_temp/OpenRA-27cfa9b1f08668f39e66f7ecf73cca11dbf8db36/mods/ra/maps/center-of-attention-redux-2
  528.                  File exists
  529.                  unable to process OpenRA-27cfa9b1f08668f39e66f7ecf73cca11dbf8db36/mods/ra/maps/center-of-attention-redux-2/.
  530. checkdir error:  cannot create ./engine_temp/OpenRA-27cfa9b1f08668f39e66f7ecf73cca11dbf8db36/mods/ra/maps/desert-shellmap
  531.                  File exists
  532.                  unable to process OpenRA-27cfa9b1f08668f39e66f7ecf73cca11dbf8db36/mods/ra/maps/desert-shellmap/.
  533. checkdir error:  cannot create ./engine_temp/OpenRA-27cfa9b1f08668f39e66f7ecf73cca11dbf8db36/mods/ra/maps/drop-zone-battle-of-tikiaki
  534.                  File exists
  535.                  unable to process OpenRA-27cfa9b1f08668f39e66f7ecf73cca11dbf8db36/mods/ra/maps/drop-zone-battle-of-tikiaki/.
  536. checkdir error:  cannot create ./engine_temp/OpenRA-27cfa9b1f08668f39e66f7ecf73cca11dbf8db36/mods/ra/maps/drop-zone-w
  537.                  File exists
  538.                  unable to process OpenRA-27cfa9b1f08668f39e66f7ecf73cca11dbf8db36/mods/ra/maps/drop-zone-w/.
  539. checkdir error:  cannot create ./engine_temp/OpenRA-27cfa9b1f08668f39e66f7ecf73cca11dbf8db36/mods/ra/maps/drop-zone
  540.                  File exists
  541.                  unable to process OpenRA-27cfa9b1f08668f39e66f7ecf73cca11dbf8db36/mods/ra/maps/drop-zone/.
  542. checkdir error:  cannot create ./engine_temp/OpenRA-27cfa9b1f08668f39e66f7ecf73cca11dbf8db36/mods/ra/maps/evacuation
  543.                  File exists
  544.                  unable to process OpenRA-27cfa9b1f08668f39e66f7ecf73cca11dbf8db36/mods/ra/maps/evacuation/.
  545. checkdir error:  cannot create ./engine_temp/OpenRA-27cfa9b1f08668f39e66f7ecf73cca11dbf8db36/mods/ra/maps/exodus
  546.                  File exists
  547.                  unable to process OpenRA-27cfa9b1f08668f39e66f7ecf73cca11dbf8db36/mods/ra/maps/exodus/.
  548. checkdir error:  cannot create ./engine_temp/OpenRA-27cfa9b1f08668f39e66f7ecf73cca11dbf8db36/mods/ra/maps/fort-lonestar
  549.                  File exists
  550.                  unable to process OpenRA-27cfa9b1f08668f39e66f7ecf73cca11dbf8db36/mods/ra/maps/fort-lonestar/.
  551. checkdir error:  cannot create ./engine_temp/OpenRA-27cfa9b1f08668f39e66f7ecf73cca11dbf8db36/mods/ra/maps/intervention
  552.                  File exists
  553.                  unable to process OpenRA-27cfa9b1f08668f39e66f7ecf73cca11dbf8db36/mods/ra/maps/intervention/.
  554. checkdir error:  cannot create ./engine_temp/OpenRA-27cfa9b1f08668f39e66f7ecf73cca11dbf8db36/mods/ra/maps/poland-raid
  555.                  File exists
  556.                  unable to process OpenRA-27cfa9b1f08668f39e66f7ecf73cca11dbf8db36/mods/ra/maps/poland-raid/.
  557. checkdir error:  cannot create ./engine_temp/OpenRA-27cfa9b1f08668f39e66f7ecf73cca11dbf8db36/mods/ra/maps/rapa-nui
  558.                  File exists
  559.                  unable to process OpenRA-27cfa9b1f08668f39e66f7ecf73cca11dbf8db36/mods/ra/maps/rapa-nui/.
  560. checkdir error:  cannot create ./engine_temp/OpenRA-27cfa9b1f08668f39e66f7ecf73cca11dbf8db36/mods/ra/maps/sarin-gas-1-crackdown
  561.                  File exists
  562.                  unable to process OpenRA-27cfa9b1f08668f39e66f7ecf73cca11dbf8db36/mods/ra/maps/sarin-gas-1-crackdown/.
  563. checkdir error:  cannot create ./engine_temp/OpenRA-27cfa9b1f08668f39e66f7ecf73cca11dbf8db36/mods/ra/maps/sarin-gas-2-down-under
  564.                  File exists
  565.                  unable to process OpenRA-27cfa9b1f08668f39e66f7ecf73cca11dbf8db36/mods/ra/maps/sarin-gas-2-down-under/.
  566. checkdir error:  cannot create ./engine_temp/OpenRA-27cfa9b1f08668f39e66f7ecf73cca11dbf8db36/mods/ra/maps/shattered-mountain
  567.                  File exists
  568.                  unable to process OpenRA-27cfa9b1f08668f39e66f7ecf73cca11dbf8db36/mods/ra/maps/shattered-mountain/.
  569. checkdir error:  cannot create ./engine_temp/OpenRA-27cfa9b1f08668f39e66f7ecf73cca11dbf8db36/mods/ra/maps/six-below-zero
  570.                  File exists
  571.                  unable to process OpenRA-27cfa9b1f08668f39e66f7ecf73cca11dbf8db36/mods/ra/maps/six-below-zero/.
  572. checkdir error:  cannot create ./engine_temp/OpenRA-27cfa9b1f08668f39e66f7ecf73cca11dbf8db36/mods/ra/maps/snow-off
  573.                  File exists
  574.                  unable to process OpenRA-27cfa9b1f08668f39e66f7ecf73cca11dbf8db36/mods/ra/maps/snow-off/.
  575. checkdir error:  cannot create ./engine_temp/OpenRA-27cfa9b1f08668f39e66f7ecf73cca11dbf8db36/mods/ra/maps/snow-town
  576.                  File exists
  577.                  unable to process OpenRA-27cfa9b1f08668f39e66f7ecf73cca11dbf8db36/mods/ra/maps/snow-town/.
  578. checkdir error:  cannot create ./engine_temp/OpenRA-27cfa9b1f08668f39e66f7ecf73cca11dbf8db36/mods/ra/maps/soviet-01
  579.                  File exists
  580.                  unable to process OpenRA-27cfa9b1f08668f39e66f7ecf73cca11dbf8db36/mods/ra/maps/soviet-01/.
  581. checkdir error:  cannot create ./engine_temp/OpenRA-27cfa9b1f08668f39e66f7ecf73cca11dbf8db36/mods/ra/maps/soviet-02a
  582.                  File exists
  583.                  unable to process OpenRA-27cfa9b1f08668f39e66f7ecf73cca11dbf8db36/mods/ra/maps/soviet-02a/.
  584. checkdir error:  cannot create ./engine_temp/OpenRA-27cfa9b1f08668f39e66f7ecf73cca11dbf8db36/mods/ra/maps/soviet-02b
  585.                  File exists
  586.                  unable to process OpenRA-27cfa9b1f08668f39e66f7ecf73cca11dbf8db36/mods/ra/maps/soviet-02b/.
  587. checkdir error:  cannot create ./engine_temp/OpenRA-27cfa9b1f08668f39e66f7ecf73cca11dbf8db36/mods/ra/maps/soviet-03
  588.                  File exists
  589.                  unable to process OpenRA-27cfa9b1f08668f39e66f7ecf73cca11dbf8db36/mods/ra/maps/soviet-03/.
  590. checkdir error:  cannot create ./engine_temp/OpenRA-27cfa9b1f08668f39e66f7ecf73cca11dbf8db36/mods/ra/maps/soviet-04b
  591.                  File exists
  592.                  unable to process OpenRA-27cfa9b1f08668f39e66f7ecf73cca11dbf8db36/mods/ra/maps/soviet-04b/.
  593. checkdir error:  cannot create ./engine_temp/OpenRA-27cfa9b1f08668f39e66f7ecf73cca11dbf8db36/mods/ra/maps/soviet-soldier-volkov-n-chitzkoi
  594.                  File exists
  595.                  unable to process OpenRA-27cfa9b1f08668f39e66f7ecf73cca11dbf8db36/mods/ra/maps/soviet-soldier-volkov-n-chitzkoi/.
  596. checkdir error:  cannot create ./engine_temp/OpenRA-27cfa9b1f08668f39e66f7ecf73cca11dbf8db36/mods/ra/maps/top-o-the-world
  597.                  File exists
  598.                  unable to process OpenRA-27cfa9b1f08668f39e66f7ecf73cca11dbf8db36/mods/ra/maps/top-o-the-world/.
  599. checkdir error:  cannot create ./engine_temp/OpenRA-27cfa9b1f08668f39e66f7ecf73cca11dbf8db36/mods/ra/rules
  600.                  File exists
  601.                  unable to process OpenRA-27cfa9b1f08668f39e66f7ecf73cca11dbf8db36/mods/ra/rules/.
  602. checkdir error:  cannot create ./engine_temp/OpenRA-27cfa9b1f08668f39e66f7ecf73cca11dbf8db36/mods/ra/tilesets
  603.                  File exists
  604.                  unable to process OpenRA-27cfa9b1f08668f39e66f7ecf73cca11dbf8db36/mods/ra/tilesets/.
  605. checkdir error:  cannot create ./engine_temp/OpenRA-27cfa9b1f08668f39e66f7ecf73cca11dbf8db36/mods/ra/uibits
  606.                  File exists
  607.                  unable to process OpenRA-27cfa9b1f08668f39e66f7ecf73cca11dbf8db36/mods/ra/uibits/.
  608. checkdir error:  cannot create ./engine_temp/OpenRA-27cfa9b1f08668f39e66f7ecf73cca11dbf8db36/mods/ra/weapons
  609.                  File exists
  610.                  unable to process OpenRA-27cfa9b1f08668f39e66f7ecf73cca11dbf8db36/mods/ra/weapons/.
  611. checkdir error:  cannot create ./engine_temp/OpenRA-27cfa9b1f08668f39e66f7ecf73cca11dbf8db36/mods/ts
  612.                  File exists
  613.                  unable to process OpenRA-27cfa9b1f08668f39e66f7ecf73cca11dbf8db36/mods/ts/.
  614. checkdir error:  cannot create ./engine_temp/OpenRA-27cfa9b1f08668f39e66f7ecf73cca11dbf8db36/mods/ts/audio
  615.                  File exists
  616.                  unable to process OpenRA-27cfa9b1f08668f39e66f7ecf73cca11dbf8db36/mods/ts/audio/.
  617. checkdir error:  cannot create ./engine_temp/OpenRA-27cfa9b1f08668f39e66f7ecf73cca11dbf8db36/mods/ts/bits
  618.                  File exists
  619.                  unable to process OpenRA-27cfa9b1f08668f39e66f7ecf73cca11dbf8db36/mods/ts/bits/.
  620. checkdir error:  cannot create ./engine_temp/OpenRA-27cfa9b1f08668f39e66f7ecf73cca11dbf8db36/mods/ts/chrome
  621.                  File exists
  622.                  unable to process OpenRA-27cfa9b1f08668f39e66f7ecf73cca11dbf8db36/mods/ts/chrome/.
  623. checkdir error:  cannot create ./engine_temp/OpenRA-27cfa9b1f08668f39e66f7ecf73cca11dbf8db36/mods/ts/installer
  624.                  File exists
  625.                  unable to process OpenRA-27cfa9b1f08668f39e66f7ecf73cca11dbf8db36/mods/ts/installer/.
  626. checkdir error:  cannot create ./engine_temp/OpenRA-27cfa9b1f08668f39e66f7ecf73cca11dbf8db36/mods/ts/languages
  627.                  File exists
  628.                  unable to process OpenRA-27cfa9b1f08668f39e66f7ecf73cca11dbf8db36/mods/ts/languages/.
  629. checkdir error:  cannot create ./engine_temp/OpenRA-27cfa9b1f08668f39e66f7ecf73cca11dbf8db36/mods/ts/maps
  630.                  File exists
  631.                  unable to process OpenRA-27cfa9b1f08668f39e66f7ecf73cca11dbf8db36/mods/ts/maps/.
  632. checkdir error:  cannot create ./engine_temp/OpenRA-27cfa9b1f08668f39e66f7ecf73cca11dbf8db36/mods/ts/maps/1ice6
  633.                  File exists
  634.                  unable to process OpenRA-27cfa9b1f08668f39e66f7ecf73cca11dbf8db36/mods/ts/maps/1ice6/.
  635. checkdir error:  cannot create ./engine_temp/OpenRA-27cfa9b1f08668f39e66f7ecf73cca11dbf8db36/mods/ts/maps/tiers
  636.                  File exists
  637.                  unable to process OpenRA-27cfa9b1f08668f39e66f7ecf73cca11dbf8db36/mods/ts/maps/tiers/.
  638. checkdir error:  cannot create ./engine_temp/OpenRA-27cfa9b1f08668f39e66f7ecf73cca11dbf8db36/mods/ts/rules
  639.                  File exists
  640.                  unable to process OpenRA-27cfa9b1f08668f39e66f7ecf73cca11dbf8db36/mods/ts/rules/.
  641. checkdir error:  cannot create ./engine_temp/OpenRA-27cfa9b1f08668f39e66f7ecf73cca11dbf8db36/mods/ts/sequences
  642.                  File exists
  643.                  unable to process OpenRA-27cfa9b1f08668f39e66f7ecf73cca11dbf8db36/mods/ts/sequences/.
  644. checkdir error:  cannot create ./engine_temp/OpenRA-27cfa9b1f08668f39e66f7ecf73cca11dbf8db36/mods/ts/tilesets
  645.                  File exists
  646.                  unable to process OpenRA-27cfa9b1f08668f39e66f7ecf73cca11dbf8db36/mods/ts/tilesets/.
  647. checkdir error:  cannot create ./engine_temp/OpenRA-27cfa9b1f08668f39e66f7ecf73cca11dbf8db36/mods/ts/weapons
  648.                  File exists
  649.                  unable to process OpenRA-27cfa9b1f08668f39e66f7ecf73cca11dbf8db36/mods/ts/weapons/.
  650. checkdir error:  cannot create ./engine_temp/OpenRA-27cfa9b1f08668f39e66f7ecf73cca11dbf8db36/packaging
  651.                  File exists
  652.                  unable to process OpenRA-27cfa9b1f08668f39e66f7ecf73cca11dbf8db36/packaging/.
  653. checkdir error:  cannot create ./engine_temp/OpenRA-27cfa9b1f08668f39e66f7ecf73cca11dbf8db36/packaging/freebsd
  654.                  File exists
  655.                  unable to process OpenRA-27cfa9b1f08668f39e66f7ecf73cca11dbf8db36/packaging/freebsd/.
  656. checkdir error:  cannot create ./engine_temp/OpenRA-27cfa9b1f08668f39e66f7ecf73cca11dbf8db36/packaging/linux
  657.                  File exists
  658.                  unable to process OpenRA-27cfa9b1f08668f39e66f7ecf73cca11dbf8db36/packaging/linux/.
  659. checkdir error:  cannot create ./engine_temp/OpenRA-27cfa9b1f08668f39e66f7ecf73cca11dbf8db36/packaging/linux/icons
  660.                  File exists
  661.                  unable to process OpenRA-27cfa9b1f08668f39e66f7ecf73cca11dbf8db36/packaging/linux/icons/.
  662. checkdir error:  cannot create ./engine_temp/OpenRA-27cfa9b1f08668f39e66f7ecf73cca11dbf8db36/packaging/osx
  663.                  File exists
  664.                  unable to process OpenRA-27cfa9b1f08668f39e66f7ecf73cca11dbf8db36/packaging/osx/.
  665. checkdir error:  cannot create ./engine_temp/OpenRA-27cfa9b1f08668f39e66f7ecf73cca11dbf8db36/packaging/source
  666.                  File exists
  667.                  unable to process OpenRA-27cfa9b1f08668f39e66f7ecf73cca11dbf8db36/packaging/source/.
  668. checkdir error:  cannot create ./engine_temp/OpenRA-27cfa9b1f08668f39e66f7ecf73cca11dbf8db36/packaging/windows
  669.                  File exists
  670.                  unable to process OpenRA-27cfa9b1f08668f39e66f7ecf73cca11dbf8db36/packaging/windows/.
  671. checkdir error:  cannot create ./engine_temp/OpenRA-27cfa9b1f08668f39e66f7ecf73cca11dbf8db36/thirdparty
  672.                  File exists
  673.                  unable to process OpenRA-27cfa9b1f08668f39e66f7ecf73cca11dbf8db36/thirdparty/.
  674. mv: cannot stat './engine_temp/OpenRA-27cfa9b1f08668f39e66f7ecf73cca11dbf8db36/': No such file or directory
  675. rmdir: failed to remove './engine_temp': No such file or directory
  676. rm: cannot remove 'engine.zip': No such file or directory
  677. Compiling engine...
  678. make[1]: warning: jobserver unavailable: using -j1.  Add '+' to parent make rule.
  679. make[1]: Entering directory '/home/admin/.cache/yay/openra-d2-git/src/d2/engine'
  680. Compiling engine...
  681. make[1]: warning: jobserver unavailable: using -j1.  Add '+' to parent make rule.
  682. make[1]: Entering directory '/home/admin/.cache/yay/openra-d2-git/src/d2/engine'
  683. awk: fatal: cannot open file `VERSION.tmp' for reading (No such file or directory)
  684. rm: cannot remove 'mods/ra/mod.yaml.tmp': No such file or directory
  685. rm: cannot remove 'mods/cnc/mod.yaml.tmp': No such file or directory
  686. rm: cannot remove 'mods/d2k/mod.yaml.tmp': No such file or directory
  687. rm: cannot remove 'mods/ts/mod.yaml.tmp': No such file or directory
  688. rm: cannot remove 'mods/modcontent/mod.yaml.tmp': No such file or directory
  689. make[1]: Leaving directory '/home/admin/.cache/yay/openra-d2-git/src/d2/engine'
  690. rm: cannot remove 'mods/all/mod.yaml.tmp': No such file or directory
  691. make[1]: *** [Makefile:200: version] Error 1
  692. make[1]: Leaving directory '/home/admin/.cache/yay/openra-d2-git/src/d2/engine'
  693. make[1]: warning: jobserver unavailable: using -j1.  Add '+' to parent make rule.
  694. make[1]: Entering directory '/home/admin/.cache/yay/openra-d2-git/src/d2/engine'
  695. make[1]: warning: jobserver unavailable: using -j1.  Add '+' to parent make rule.
  696. make[1]: Entering directory '/home/admin/.cache/yay/openra-d2-git/src/d2/engine'
  697. Fetching ICSharpCode.SharpZipLib from NuGet
  698. /home/admin/.cache/yay/openra-d2-git/src/d2/engine/OpenRA.Game/OpenRA.Game.csproj.metaproj : error MSB4025: The project file could not be loaded. Could not find file "/home/admin/.cache/yay/openra-d2-git/src/d2/engine/OpenRA.Game/OpenRA.Game.csproj.metaproj"
  699. /home/admin/.cache/yay/openra-d2-git/src/d2/engine/OpenRA.Mods.Cnc/OpenRA.Mods.Cnc.csproj.metaproj : error MSB4025: The project file could not be loaded. Could not find file "/home/admin/.cache/yay/openra-d2-git/src/d2/engine/OpenRA.Mods.Cnc/OpenRA.Mods.Cnc.csproj.metaproj"
  700. /home/admin/.cache/yay/openra-d2-git/src/d2/engine/OpenRA.Utility/OpenRA.Utility.csproj.metaproj : error MSB4025: The project file could not be loaded. Could not find file "/home/admin/.cache/yay/openra-d2-git/src/d2/engine/OpenRA.Utility/OpenRA.Utility.csproj.metaproj"
  701. /home/admin/.cache/yay/openra-d2-git/src/d2/engine/OpenRA.Server/OpenRA.Server.csproj.metaproj : error MSB4025: The project file could not be loaded. Could not find file "/home/admin/.cache/yay/openra-d2-git/src/d2/engine/OpenRA.Server/OpenRA.Server.csproj.metaproj"
  702. /home/admin/.cache/yay/openra-d2-git/src/d2/engine/OpenRA.Mods.D2k/OpenRA.Mods.D2k.csproj.metaproj : error MSB4025: The project file could not be loaded. Could not find file "/home/admin/.cache/yay/openra-d2-git/src/d2/engine/OpenRA.Mods.D2k/OpenRA.Mods.D2k.csproj.metaproj"
  703. /home/admin/.cache/yay/openra-d2-git/src/d2/engine/OpenRA.Platforms.Default/OpenRA.Platforms.Default.csproj.metaproj : error MSB4025: The project file could not be loaded. Could not find file "/home/admin/.cache/yay/openra-d2-git/src/d2/engine/OpenRA.Platforms.Default/OpenRA.Platforms.Default.csproj.metaproj"
  704. /home/admin/.cache/yay/openra-d2-git/src/d2/engine/OpenRA.Mods.Common/OpenRA.Mods.Common.csproj.metaproj : error MSB4025: The project file could not be loaded. Could not find file "/home/admin/.cache/yay/openra-d2-git/src/d2/engine/OpenRA.Mods.Common/OpenRA.Mods.Common.csproj.metaproj"
  705. /home/admin/.cache/yay/openra-d2-git/src/d2/engine/OpenRA.Test/OpenRA.Test.csproj.metaproj : error MSB4025: The project file could not be loaded. Could not find file "/home/admin/.cache/yay/openra-d2-git/src/d2/engine/OpenRA.Test/OpenRA.Test.csproj.metaproj"
  706. /home/admin/.cache/yay/openra-d2-git/src/d2/engine/OpenRA.PostProcess/OpenRA.PostProcess.csproj.metaproj : error MSB4025: The project file could not be loaded. Could not find file "/home/admin/.cache/yay/openra-d2-git/src/d2/engine/OpenRA.PostProcess/OpenRA.PostProcess.csproj.metaproj"
  707. make[1]: *** [Makefile:152: core] Error 1
  708. make[1]: Leaving directory '/home/admin/.cache/yay/openra-d2-git/src/d2/engine'
  709. make: *** [Makefile:110: engine] Error 2
  710. Fetching MaxMind.Db from NuGet
  711. Fetching NUnit from NuGet
  712. Fetching NUnit.Console from NuGet
  713. Fetching Open.Nat from NuGet
  714. Fetching FuzzyLogicLibrary from NuGet.
  715. Fetching SDL2-CS from GitHub.
  716. Fetching OpenAL-CS from GitHub.
  717.  
  718. Fetching Eluant from GitHub.
  719. Fetching rix0rrr.BeaconLib from NuGet.
  720. /home/admin/.cache/yay/openra-d2-git/src/d2/engine/OpenRA.sln.metaproj : error MSB4057: The target "restore" does not exist in the project. [/home/admin/.cache/yay/openra-d2-git/src/d2/engine/OpenRA.sln]
  721. make[1]: *** [Makefile:171: cli-dependencies] Error 1
  722. make[1]: Leaving directory '/home/admin/.cache/yay/openra-d2-git/src/d2/engine'
  723. make: *** [Makefile:106: engine-dependencies] Error 2
  724. ==> ERROR: A failure occurred in build().
  725.    Aborting...
  726. Error making: openra-d2-git
RAW Paste Data
We use cookies for various purposes including analytics. By continuing to use Pastebin, you agree to our use of cookies as described in the Cookies Policy. OK, I Understand
Top