JZTech101

Untitled

Sep 21st, 2013
144
0
Never
Not a member of Pastebin yet? Sign Up, it unlocks many cool features!
text 9.72 KB | None | 0 0
  1. [root@lp SecretRoomsMod-forge-master]# ./gradlew --stacktrace build
  2. :getForge UP-TO-DATE
  3. :doFMLMappingPreProcess UP-TO-DATE
  4. :resolveMinecraftStuff
  5. :getMinecraft UP-TO-DATE
  6. :doJarPreProcess UP-TO-DATE
  7. :extractMisc UP-TO-DATE
  8. :getAssets UP-TO-DATE
  9. :unpackNatives UP-TO-DATE
  10. :decompileMinecraft
  11. Unpacking jar
  12. Decompiling classes
  13. Copying classes
  14. Applying post-decompile cleaning and fixes
  15. :decompileMinecraft FAILED
  16.  
  17. FAILURE: Build failed with an exception.
  18.  
  19. * What went wrong:
  20. Execution failed for task ':decompileMinecraft'.
  21. > minecraft/mappings/patches/start.java (No such file or directory)
  22.  
  23. * Try:
  24. Run with --info or --debug option to get more log output.
  25.  
  26. * Exception is:
  27. org.gradle.api.tasks.TaskExecutionException: Execution failed for task ':decompileMinecraft'.
  28. at org.gradle.api.internal.tasks.execution.ExecuteActionsTaskExecuter.executeActions(ExecuteActionsTaskExecuter.java:69)
  29. at org.gradle.api.internal.tasks.execution.ExecuteActionsTaskExecuter.execute(ExecuteActionsTaskExecuter.java:46)
  30. at org.gradle.api.internal.tasks.execution.PostExecutionAnalysisTaskExecuter.execute(PostExecutionAnalysisTaskExecuter.java:35)
  31. at org.gradle.api.internal.changedetection.state.CacheLockReleasingTaskExecuter$1.run(CacheLockReleasingTaskExecuter.java:35)
  32. at org.gradle.internal.Factories$1.create(Factories.java:22)
  33. at org.gradle.cache.internal.DefaultCacheAccess.longRunningOperation(DefaultCacheAccess.java:179)
  34. at org.gradle.cache.internal.DefaultCacheAccess.longRunningOperation(DefaultCacheAccess.java:232)
  35. at org.gradle.cache.internal.DefaultPersistentDirectoryStore.longRunningOperation(DefaultPersistentDirectoryStore.java:142)
  36. at org.gradle.api.internal.changedetection.state.DefaultTaskArtifactStateCacheAccess.longRunningOperation(DefaultTaskArtifactStateCacheAccess.java:83)
  37. at org.gradle.api.internal.changedetection.state.CacheLockReleasingTaskExecuter.execute(CacheLockReleasingTaskExecuter.java:33)
  38. at org.gradle.api.internal.tasks.execution.SkipUpToDateTaskExecuter.execute(SkipUpToDateTaskExecuter.java:58)
  39. at org.gradle.api.internal.tasks.execution.ContextualisingTaskExecuter.execute(ContextualisingTaskExecuter.java:34)
  40. at org.gradle.api.internal.changedetection.state.CacheLockAcquiringTaskExecuter$1.run(CacheLockAcquiringTaskExecuter.java:39)
  41. at org.gradle.internal.Factories$1.create(Factories.java:22)
  42. at org.gradle.cache.internal.DefaultCacheAccess.useCache(DefaultCacheAccess.java:124)
  43. at org.gradle.cache.internal.DefaultCacheAccess.useCache(DefaultCacheAccess.java:112)
  44. at org.gradle.cache.internal.DefaultPersistentDirectoryStore.useCache(DefaultPersistentDirectoryStore.java:134)
  45. at org.gradle.api.internal.changedetection.state.DefaultTaskArtifactStateCacheAccess.useCache(DefaultTaskArtifactStateCacheAccess.java:79)
  46. at org.gradle.api.internal.changedetection.state.CacheLockAcquiringTaskExecuter.execute(CacheLockAcquiringTaskExecuter.java:37)
  47. at org.gradle.api.internal.tasks.execution.ValidatingTaskExecuter.execute(ValidatingTaskExecuter.java:57)
  48. at org.gradle.api.internal.tasks.execution.SkipEmptySourceFilesTaskExecuter.execute(SkipEmptySourceFilesTaskExecuter.java:41)
  49. at org.gradle.api.internal.tasks.execution.SkipTaskWithNoActionsExecuter.execute(SkipTaskWithNoActionsExecuter.java:51)
  50. at org.gradle.api.internal.tasks.execution.SkipOnlyIfTaskExecuter.execute(SkipOnlyIfTaskExecuter.java:52)
  51. at org.gradle.api.internal.tasks.execution.ExecuteAtMostOnceTaskExecuter.execute(ExecuteAtMostOnceTaskExecuter.java:42)
  52. at org.gradle.api.internal.AbstractTask.executeWithoutThrowingTaskFailure(AbstractTask.java:282)
  53. at org.gradle.execution.taskgraph.DefaultTaskPlanExecutor.executeTask(DefaultTaskPlanExecutor.java:48)
  54. at org.gradle.execution.taskgraph.DefaultTaskPlanExecutor.processTask(DefaultTaskPlanExecutor.java:34)
  55. at org.gradle.execution.taskgraph.DefaultTaskPlanExecutor.process(DefaultTaskPlanExecutor.java:27)
  56. at org.gradle.execution.taskgraph.DefaultTaskGraphExecuter.execute(DefaultTaskGraphExecuter.java:89)
  57. at org.gradle.execution.SelectedTaskExecutionAction.execute(SelectedTaskExecutionAction.java:29)
  58. at org.gradle.execution.DefaultBuildExecuter.execute(DefaultBuildExecuter.java:61)
  59. at org.gradle.execution.DefaultBuildExecuter.access$200(DefaultBuildExecuter.java:23)
  60. at org.gradle.execution.DefaultBuildExecuter$2.proceed(DefaultBuildExecuter.java:67)
  61. at org.gradle.api.internal.changedetection.state.TaskCacheLockHandlingBuildExecuter$1.run(TaskCacheLockHandlingBuildExecuter.java:31)
  62. at org.gradle.internal.Factories$1.create(Factories.java:22)
  63. at org.gradle.cache.internal.DefaultCacheAccess.useCache(DefaultCacheAccess.java:124)
  64. at org.gradle.cache.internal.DefaultCacheAccess.useCache(DefaultCacheAccess.java:112)
  65. at org.gradle.cache.internal.DefaultPersistentDirectoryStore.useCache(DefaultPersistentDirectoryStore.java:134)
  66. at org.gradle.api.internal.changedetection.state.DefaultTaskArtifactStateCacheAccess.useCache(DefaultTaskArtifactStateCacheAccess.java:79)
  67. at org.gradle.api.internal.changedetection.state.TaskCacheLockHandlingBuildExecuter.execute(TaskCacheLockHandlingBuildExecuter.java:29)
  68. at org.gradle.execution.DefaultBuildExecuter.execute(DefaultBuildExecuter.java:61)
  69. at org.gradle.execution.DefaultBuildExecuter.access$200(DefaultBuildExecuter.java:23)
  70. at org.gradle.execution.DefaultBuildExecuter$2.proceed(DefaultBuildExecuter.java:67)
  71. at org.gradle.execution.DryRunBuildExecutionAction.execute(DryRunBuildExecutionAction.java:32)
  72. at org.gradle.execution.DefaultBuildExecuter.execute(DefaultBuildExecuter.java:61)
  73. at org.gradle.execution.DefaultBuildExecuter.execute(DefaultBuildExecuter.java:54)
  74. at org.gradle.initialization.DefaultGradleLauncher.doBuildStages(DefaultGradleLauncher.java:166)
  75. at org.gradle.initialization.DefaultGradleLauncher.doBuild(DefaultGradleLauncher.java:113)
  76. at org.gradle.initialization.DefaultGradleLauncher.run(DefaultGradleLauncher.java:81)
  77. at org.gradle.launcher.exec.InProcessBuildActionExecuter$DefaultBuildController.run(InProcessBuildActionExecuter.java:64)
  78. at org.gradle.launcher.cli.ExecuteBuildAction.run(ExecuteBuildAction.java:33)
  79. at org.gradle.launcher.cli.ExecuteBuildAction.run(ExecuteBuildAction.java:24)
  80. at org.gradle.launcher.exec.InProcessBuildActionExecuter.execute(InProcessBuildActionExecuter.java:35)
  81. at org.gradle.launcher.exec.InProcessBuildActionExecuter.execute(InProcessBuildActionExecuter.java:26)
  82. at org.gradle.launcher.cli.RunBuildAction.run(RunBuildAction.java:50)
  83. at org.gradle.api.internal.Actions$RunnableActionAdapter.execute(Actions.java:171)
  84. at org.gradle.launcher.cli.CommandLineActionFactory$ParseAndBuildAction.execute(CommandLineActionFactory.java:201)
  85. at org.gradle.launcher.cli.CommandLineActionFactory$ParseAndBuildAction.execute(CommandLineActionFactory.java:174)
  86. at org.gradle.launcher.cli.CommandLineActionFactory$WithLogging.execute(CommandLineActionFactory.java:170)
  87. at org.gradle.launcher.cli.CommandLineActionFactory$WithLogging.execute(CommandLineActionFactory.java:139)
  88. at org.gradle.launcher.cli.ExceptionReportingAction.execute(ExceptionReportingAction.java:33)
  89. at org.gradle.launcher.cli.ExceptionReportingAction.execute(ExceptionReportingAction.java:22)
  90. at org.gradle.launcher.Main.doAction(Main.java:48)
  91. at org.gradle.launcher.bootstrap.EntryPoint.run(EntryPoint.java:45)
  92. at org.gradle.launcher.Main.main(Main.java:39)
  93. at org.gradle.launcher.bootstrap.ProcessBootstrap.runNoExit(ProcessBootstrap.java:50)
  94. at org.gradle.launcher.bootstrap.ProcessBootstrap.run(ProcessBootstrap.java:32)
  95. at org.gradle.launcher.GradleMain.main(GradleMain.java:26)
  96. at org.gradle.wrapper.BootstrapMainStarter.start(BootstrapMainStarter.java:33)
  97. at org.gradle.wrapper.WrapperExecutor.execute(WrapperExecutor.java:130)
  98. at org.gradle.wrapper.GradleWrapperMain.main(GradleWrapperMain.java:48)
  99. Caused by: java.io.FileNotFoundException: minecraft/mappings/patches/start.java (No such file or directory)
  100. at com.google.common.io.Files$FileByteSource.openStream(Files.java:124)
  101. at com.google.common.io.Files$FileByteSource.openStream(Files.java:114)
  102. at com.google.common.io.ByteSource.copyTo(ByteSource.java:202)
  103. at com.google.common.io.Files.copy(Files.java:436)
  104. at com.google.common.io.Files$copy.call(Unknown Source)
  105. at com.github.abrarsyed.gmcp.tasks.DecompileMinecraftTask.doMCPPatches(DecompileMinecraftTask.groovy:170)
  106. at com.github.abrarsyed.gmcp.tasks.DecompileMinecraftTask.doTask(DecompileMinecraftTask.groovy:48)
  107. at org.gradle.api.internal.BeanDynamicObject$MetaClassAdapter.invokeMethod(BeanDynamicObject.java:216)
  108. at org.gradle.api.internal.BeanDynamicObject.invokeMethod(BeanDynamicObject.java:122)
  109. at org.gradle.api.internal.CompositeDynamicObject.invokeMethod(CompositeDynamicObject.java:147)
  110. at com.github.abrarsyed.gmcp.tasks.DecompileMinecraftTask_Decorated.invokeMethod(Unknown Source)
  111. at org.gradle.util.ReflectionUtil.invoke(ReflectionUtil.groovy:23)
  112. at org.gradle.api.internal.project.taskfactory.AnnotationProcessingTaskFactory$StandardTaskAction.doExecute(AnnotationProcessingTaskFactory.java:217)
  113. at org.gradle.api.internal.project.taskfactory.AnnotationProcessingTaskFactory$StandardTaskAction.execute(AnnotationProcessingTaskFactory.java:210)
  114. at org.gradle.api.internal.project.taskfactory.AnnotationProcessingTaskFactory$StandardTaskAction.execute(AnnotationProcessingTaskFactory.java:199)
  115. at org.gradle.api.internal.AbstractTask$TaskActionWrapper.execute(AbstractTask.java:526)
  116. at org.gradle.api.internal.AbstractTask$TaskActionWrapper.execute(AbstractTask.java:509)
  117. at org.gradle.api.internal.tasks.execution.ExecuteActionsTaskExecuter.executeAction(ExecuteActionsTaskExecuter.java:80)
  118. at org.gradle.api.internal.tasks.execution.ExecuteActionsTaskExecuter.executeActions(ExecuteActionsTaskExecuter.java:61)
  119. ... 70 more
  120.  
  121.  
  122. BUILD FAILED
  123.  
  124. Total time: 3 mins 36.099 secs
Advertisement
Add Comment
Please, Sign In to add comment