linkxs

Untitled

Aug 2nd, 2013
446
0
Never
Not a member of Pastebin yet? Sign Up, it unlocks many cool features!
text 196.24 KB | None | 0 0
  1. McFu-2:~ linkxs$ brew install gnuradio --with-qt -v
  2. /usr/local/opt/python/bin/python2 -c import scipy
  3. /usr/local/opt/python/bin/python2 -c import matplotlib
  4. /usr/local/opt/python/bin/python2 -c import numpy
  5. /usr/local/opt/python/bin/python2 -c import lxml
  6. /usr/local/opt/python/bin/python2 -c import Cheetah
  7. /usr/local/opt/python/bin/python2 -c import numpy
  8. /usr/local/opt/python/bin/python2 -c import Cheetah
  9. /usr/local/opt/python/bin/python2 -c import scipy
  10. /usr/local/opt/python/bin/python2 -c import lxml
  11. /usr/local/opt/python/bin/python2 -c import matplotlib
  12. ==> Downloading http://gnuradio.org/releases/gnuradio/gnuradio-3.6.5.1.tar.gz
  13. Already downloaded: /Library/Caches/Homebrew/gnuradio-3.6.5.1.tar.gz
  14. tar xf /Library/Caches/Homebrew/gnuradio-3.6.5.1.tar.gz
  15. ==> Patching
  16. /usr/bin/patch -f -p1 -i 000-homebrew.diff
  17. patching file grc/CMakeLists.txt
  18. patching file gr-qtgui/lib/spectrumdisplayform.ui
  19. ==> cmake .. -DCMAKE_PREFIX_PATH=/usr/local/Cellar/gnuradio/3.6.5.1 -DQWT_INCLUDE_DIRS=/usr/local/lib/qwt.framework/Headers -DCMAKE_INSTALL_PREFIX=/usr/local/Cellar/gnuradio/3.6.5.1 -DCMAKE_BUILD_TYPE=None -DCMAKE_FIND_FRAMEWORK=LAST -Wno-dev -DENABLE_DOXYGEN=OFF -DPYTHON_LIBRARY='/usr/local/Cellar/python/2.7.5/Frameworks/Python.framework/Versions/2.7/Python' -DPYTHON_INCLUDE_DIR='/usr/local/Cellar/python/2.7.5/Frameworks/Python.framework/Versions/2.7/Headers' -DPYTHON_PACKAGES_PATH='/usr/local/Cellar/gnuradio/3.6.5.1/lib/python2.7/site-packages'
  20. cmake .. -DCMAKE_PREFIX_PATH=/usr/local/Cellar/gnuradio/3.6.5.1 -DQWT_INCLUDE_DIRS=/usr/local/lib/qwt.framework/Headers -DCMAKE_INSTALL_PREFIX=/usr/local/Cellar/gnuradio/3.6.5.1 -DCMAKE_BUILD_TYPE=None -DCMAKE_FIND_FRAMEWORK=LAST -Wno-dev -DENABLE_DOXYGEN=OFF -DPYTHON_LIBRARY='/usr/local/Cellar/python/2.7.5/Frameworks/Python.framework/Versions/2.7/Python' -DPYTHON_INCLUDE_DIR='/usr/local/Cellar/python/2.7.5/Frameworks/Python.framework/Versions/2.7/Headers' -DPYTHON_PACKAGES_PATH='/usr/local/Cellar/gnuradio/3.6.5.1/lib/python2.7/site-packages'
  21. -- The CXX compiler identification is GNU 4.2.1
  22. -- The C compiler identification is GNU 4.2.1
  23. -- Checking whether CXX compiler has -isysroot
  24. -- Checking whether CXX compiler has -isysroot - yes
  25. -- Checking whether CXX compiler supports OSX deployment target flag
  26. -- Checking whether CXX compiler supports OSX deployment target flag - yes
  27. -- Check for working CXX compiler: /usr/local/bin/g++-4.2
  28. -- Check for working CXX compiler: /usr/local/bin/g++-4.2 -- works
  29. -- Detecting CXX compiler ABI info
  30. -- Detecting CXX compiler ABI info - done
  31. -- Checking whether C compiler has -isysroot
  32. -- Checking whether C compiler has -isysroot - yes
  33. -- Checking whether C compiler supports OSX deployment target flag
  34. -- Checking whether C compiler supports OSX deployment target flag - yes
  35. -- Check for working C compiler: /usr/local/bin/gcc-4.2
  36. -- Check for working C compiler: /usr/local/bin/gcc-4.2 -- works
  37. -- Detecting C compiler ABI info
  38. -- Detecting C compiler ABI info - done
  39. -- Found Git: /usr/local/bin/git
  40. -- Performing Test HAVE_VISIBILITY_HIDDEN
  41. -- Performing Test HAVE_VISIBILITY_HIDDEN - Success
  42. -- Performing Test HAVE_WARN_SIGN_COMPARE
  43. -- Performing Test HAVE_WARN_SIGN_COMPARE - Success
  44. -- Performing Test HAVE_WARN_ALL
  45. -- Performing Test HAVE_WARN_ALL - Success
  46. -- Performing Test HAVE_WARN_NO_UNINITIALIZED
  47. -- Performing Test HAVE_WARN_NO_UNINITIALIZED - Success
  48. -- NO PERF COUNTERS
  49. -- Found PythonLibs: /usr/local/Cellar/python/2.7.5/Frameworks/Python.framework/Versions/2.7/Python (found version "2.7.5")
  50. -- Found SWIG: /usr/local/bin/swig (found version "2.0.10")
  51. -- Minimum SWIG version required is 1.3.31
  52. --
  53. -- The build system will automatically enable all components.
  54. -- Use -DENABLE_DEFAULT=OFF to disable components by default.
  55. --
  56. -- Configuring python-support support...
  57. -- Dependency PYTHONLIBS_FOUND = TRUE
  58. -- Dependency SWIG_FOUND = TRUE
  59. -- Dependency SWIG_VERSION_CHECK = TRUE
  60. -- Enabling python-support support.
  61. -- Override with -DENABLE_PYTHON=ON/OFF
  62. -- Found PkgConfig: /usr/local/bin/pkg-config (found version "0.28")
  63. -- checking for module 'cppunit'
  64. -- found cppunit, version 1.12.1
  65. -- Found CPPUNIT: /usr/local/lib/libcppunit.dylib
  66. --
  67. -- Configuring testing-support support...
  68. -- Dependency CPPUNIT_FOUND = TRUE
  69. -- Enabling testing-support support.
  70. -- Override with -DENABLE_TESTING=ON/OFF
  71. --
  72. -- Configuring volk support...
  73. -- Enabling volk support.
  74. -- Override with -DENABLE_VOLK=ON/OFF
  75. -- Found PythonInterp: /usr/local/bin/python (found version "2.7.5")
  76. --
  77. -- Python checking for python >= 2.5
  78. -- Python checking for python >= 2.5 - found
  79. --
  80. -- Python checking for Cheetah >= 2.0.0
  81. -- Python checking for Cheetah >= 2.0.0 - found
  82. -- Boost version: 1.54.0
  83. -- Found the following Boost libraries:
  84. -- filesystem
  85. -- system
  86. -- unit_test_framework
  87. -- checking for module 'orc-0.4 > 0.4.11'
  88. -- found orc-0.4 > 0.4.11, version 0.4.17
  89. -- Found ORC: /usr/local/lib/liborc-0.4.dylib
  90. -- Looking for cpuid.h
  91. -- Looking for cpuid.h - not found
  92. -- Looking for intrin.h
  93. -- Looking for intrin.h - not found
  94. -- Looking for fenv.h
  95. -- Looking for fenv.h - found
  96. -- Looking for dlfcn.h
  97. -- Looking for dlfcn.h - found
  98. -- Compiler name: GNU
  99. -- Performing Test HAVE_WERROR_UNUSED_CMD_LINE_ARG
  100. -- Performing Test HAVE_WERROR_UNUSED_CMD_LINE_ARG - Failed
  101. -- x86* CPU detected
  102. -- Performing Test have_maltivec
  103. -- Performing Test have_maltivec - Failed
  104. -- Performing Test have_mfpu_neon
  105. -- Performing Test have_mfpu_neon - Failed
  106. -- Performing Test have_mfloat_abi_softfp
  107. -- Performing Test have_mfloat_abi_softfp - Failed
  108. -- Performing Test have_funsafe_math_optimizations
  109. -- Performing Test have_funsafe_math_optimizations - Success
  110. -- Performing Test have_m32
  111. -- Performing Test have_m32 - Failed
  112. -- Performing Test have_m64
  113. -- Performing Test have_m64 - Success
  114. -- Performing Test have_m3dnow
  115. -- Performing Test have_m3dnow - Success
  116. -- Performing Test have_msse4_2
  117. -- Performing Test have_msse4_2 - Success
  118. -- Performing Test have_mpopcnt
  119. -- Performing Test have_mpopcnt - Failed
  120. -- Performing Test have_mmmx
  121. -- Performing Test have_mmmx - Success
  122. -- Performing Test have_msse
  123. -- Performing Test have_msse - Success
  124. -- Performing Test have_msse2
  125. -- Performing Test have_msse2 - Success
  126. -- Performing Test have_msse3
  127. -- Performing Test have_msse3 - Success
  128. -- Performing Test have_mssse3
  129. -- Performing Test have_mssse3 - Success
  130. -- Performing Test have_msse4a
  131. -- Performing Test have_msse4a - Success
  132. -- Performing Test have_msse4_1
  133. -- Performing Test have_msse4_1 - Success
  134. -- Performing Test have_mavx
  135. -- Performing Test have_mavx - Failed
  136. -- GCC missing xgetbv, Overruled arch avx
  137. -- Check size of void*[8]
  138. -- Check size of void*[8] - done
  139. -- CPU width is 64 bits, Overruled arch 32
  140. -- Available architectures: generic;64;3dnow;abm;mmx;sse;sse2;orc;norc;sse3;ssse3;sse4_a;sse4_1;sse4_2
  141. -- Available machines: generic_orc;sse2_64_mmx_orc;sse3_64_orc;ssse3_64_orc;sse4_1_64_orc
  142. -- Using install prefix: /usr/local/Cellar/gnuradio/3.6.5.1
  143. -- ENABLE_GR_LOG set to ON.
  144. -- HAVE_LOG4CPP set to False.
  145. -- LOG4CPP_LIBRARIES set to .
  146. -- Could NOT find Doxygen (missing: DOXYGEN_EXECUTABLE)
  147. -- Could NOT find Sphinx (missing: SPHINX_EXECUTABLE)
  148. --
  149. -- Configuring doxygen support...
  150. -- Dependency DOXYGEN_FOUND = NO
  151. -- Disabling doxygen support.
  152. -- Override with -DENABLE_DOXYGEN=ON/OFF
  153. --
  154. -- Configuring sphinx support...
  155. -- Dependency SPHINX_FOUND = FALSE
  156. -- Disabling sphinx support.
  157. -- Override with -DENABLE_SPHINX=ON/OFF
  158. -- Boost version: 1.54.0
  159. -- Found the following Boost libraries:
  160. -- date_time
  161. -- program_options
  162. -- filesystem
  163. -- system
  164. -- thread
  165. --
  166. -- Configuring gruel support...
  167. -- Dependency Boost_FOUND = 1
  168. -- Dependency PYTHONINTERP_FOUND = TRUE
  169. -- Enabling gruel support.
  170. -- Override with -DENABLE_GRUEL=ON/OFF
  171. -- Looking for C++ include signal.h
  172. -- Looking for C++ include signal.h - found
  173. -- Looking for C++ include sched.h
  174. -- Looking for C++ include sched.h - found
  175. -- Performing Test HAVE_PTHREAD_SIGMASK
  176. -- Performing Test HAVE_PTHREAD_SIGMASK - Success
  177. -- Performing Test HAVE_PTHREAD_SETSCHEDPARAM
  178. -- Performing Test HAVE_PTHREAD_SETSCHEDPARAM - Success
  179. -- Performing Test HAVE_SCHED_SETSCHEDULER
  180. -- Performing Test HAVE_SCHED_SETSCHEDULER - Failed
  181. -- Boost version: 1.54.0
  182. -- Found the following Boost libraries:
  183. -- date_time
  184. -- program_options
  185. -- filesystem
  186. -- system
  187. -- thread
  188. -- checking for module 'fftw3f >= 3.0'
  189. -- found fftw3f , version 3.3.3
  190. -- Found FFTW3F: /usr/local/lib/libfftw3f.dylib
  191. --
  192. -- Configuring gnuradio-core support...
  193. -- Dependency ENABLE_GRUEL = ON
  194. -- Dependency ENABLE_VOLK = ON
  195. -- Dependency Boost_FOUND = 1
  196. -- Dependency FFTW3F_FOUND = TRUE
  197. -- Dependency PYTHONINTERP_FOUND = TRUE
  198. -- Enabling gnuradio-core support.
  199. -- Override with -DENABLE_GR_CORE=ON/OFF
  200. -- Looking for C++ include netdb.h
  201. -- Looking for C++ include netdb.h - found
  202. -- Looking for C++ include sys/time.h
  203. -- Looking for C++ include sys/time.h - found
  204. -- Looking for C++ include sys/types.h
  205. -- Looking for C++ include sys/types.h - found
  206. -- Looking for C++ include sys/select.h
  207. -- Looking for C++ include sys/select.h - found
  208. -- Looking for C++ include sys/socket.h
  209. -- Looking for C++ include sys/socket.h - found
  210. -- Looking for C++ include io.h
  211. -- Looking for C++ include io.h - not found
  212. -- Looking for C++ include sys/mman.h
  213. -- Looking for C++ include sys/mman.h - found
  214. -- Looking for C++ include sys/ipc.h
  215. -- Looking for C++ include sys/ipc.h - found
  216. -- Looking for C++ include sys/shm.h
  217. -- Looking for C++ include sys/shm.h - found
  218. -- Looking for C++ include netinet/in.h
  219. -- Looking for C++ include netinet/in.h - found
  220. -- Looking for C++ include arpa/inet.h
  221. -- Looking for C++ include arpa/inet.h - found
  222. -- Looking for C++ include byteswap.h
  223. -- Looking for C++ include byteswap.h - not found
  224. -- Looking for C++ include linux/ppdev.h
  225. -- Looking for C++ include linux/ppdev.h - not found
  226. -- Looking for C++ include dev/ppbus/ppi.h
  227. -- Looking for C++ include dev/ppbus/ppi.h - not found
  228. -- Looking for C++ include unistd.h
  229. -- Looking for C++ include unistd.h - found
  230. -- Looking for C++ include malloc.h
  231. -- Looking for C++ include malloc.h - not found
  232. -- Performing Test HAVE_SNPRINTF
  233. -- Performing Test HAVE_SNPRINTF - Success
  234. -- Performing Test HAVE_SIGACTION
  235. -- Performing Test HAVE_SIGACTION - Success
  236. -- Performing Test HAVE_SELECT
  237. -- Performing Test HAVE_SELECT - Success
  238. -- Performing Test HAVE_SYSCONF
  239. -- Performing Test HAVE_SYSCONF - Success
  240. -- Performing Test HAVE_GETPAGESIZE
  241. -- Performing Test HAVE_GETPAGESIZE - Success
  242. -- Performing Test HAVE_SSLEEP
  243. -- Performing Test HAVE_SSLEEP - Failed
  244. -- Performing Test HAVE_NANOSLEEP
  245. -- Performing Test HAVE_NANOSLEEP - Success
  246. -- Performing Test HAVE_GETTIMEOFDAY
  247. -- Performing Test HAVE_GETTIMEOFDAY - Success
  248. -- Performing Test HAVE_POSIX_MEMALIGN
  249. -- Performing Test HAVE_POSIX_MEMALIGN - Success
  250. -- Performing Test HAVE_VALLOC
  251. -- Performing Test HAVE_VALLOC - Failed
  252. -- Performing Test HAVE_CREATEFILEMAPPING
  253. -- Performing Test HAVE_CREATEFILEMAPPING - Failed
  254. -- Looking for C++ include windows.h
  255. -- Looking for C++ include windows.h - not found
  256. -- Performing Test HAVE_SHM_OPEN
  257. -- Performing Test HAVE_SHM_OPEN - Failed
  258. -- Performing Test HAVE_SINCOS
  259. -- Performing Test HAVE_SINCOS - Failed
  260. -- Performing Test HAVE_SINCOSF
  261. -- Performing Test HAVE_SINCOSF - Failed
  262. -- Performing Test HAVE_SINF
  263. -- Performing Test HAVE_SINF - Success
  264. -- Performing Test HAVE_COSF
  265. -- Performing Test HAVE_COSF - Success
  266. -- Performing Test HAVE_MMAP
  267. -- Performing Test HAVE_MMAP - Success
  268. -- TRY_SHM_VMCIRCBUF set to ON.
  269. -- Check size of void*
  270. -- Check size of void* - done
  271. -- Loading build date Fri, 02 Aug 2013 23:36:22 into gr_constants...
  272. -- Loading version 3.6.5.1 into gr_constants...
  273. -- Looking for C++ include sys/resource.h
  274. -- Looking for C++ include sys/resource.h - found
  275. --
  276. -- Python checking for python >= 2.5
  277. -- Python checking for python >= 2.5 - found
  278. --
  279. -- Python checking for Cheetah >= 2.0.0
  280. -- Python checking for Cheetah >= 2.0.0 - found
  281. --
  282. -- Python checking for lxml >= 1.3.6
  283. -- Python checking for lxml >= 1.3.6 - found
  284. --
  285. -- Python checking for pygtk >= 2.10.0
  286. -- Python checking for pygtk >= 2.10.0 - found
  287. --
  288. -- Python checking for numpy
  289. -- Python checking for numpy - found
  290. --
  291. -- Configuring gnuradio-companion support...
  292. -- Dependency ENABLE_GR_CORE = ON
  293. -- Dependency ENABLE_PYTHON = ON
  294. -- Dependency PYTHON_MIN_VER_FOUND = TRUE
  295. -- Dependency CHEETAH_FOUND = TRUE
  296. -- Dependency LXML_FOUND = TRUE
  297. -- Dependency PYGTK_FOUND = TRUE
  298. -- Dependency NUMPY_FOUND = TRUE
  299. -- Enabling gnuradio-companion support.
  300. -- Override with -DENABLE_GRC=ON/OFF
  301. -- Boost version: 1.54.0
  302. -- Found the following Boost libraries:
  303. -- date_time
  304. -- program_options
  305. -- filesystem
  306. -- system
  307. -- thread
  308. --
  309. -- Configuring gr-blocks support...
  310. -- Dependency Boost_FOUND = 1
  311. -- Dependency ENABLE_GR_CORE = ON
  312. -- Enabling gr-blocks support.
  313. -- Override with -DENABLE_GR_BLOCKS=ON/OFF
  314. -- Boost version: 1.54.0
  315. -- Found the following Boost libraries:
  316. -- date_time
  317. -- program_options
  318. -- filesystem
  319. -- system
  320. -- thread
  321. --
  322. -- Configuring gr-fft support...
  323. -- Dependency ENABLE_GRUEL = ON
  324. -- Dependency ENABLE_VOLK = ON
  325. -- Dependency Boost_FOUND = 1
  326. -- Dependency ENABLE_GR_CORE = ON
  327. -- Dependency FFTW3F_FOUND = TRUE
  328. -- Enabling gr-fft support.
  329. -- Override with -DENABLE_GR_FFT=ON/OFF
  330. -- Boost version: 1.54.0
  331. -- Found the following Boost libraries:
  332. -- date_time
  333. -- program_options
  334. -- filesystem
  335. -- system
  336. -- thread
  337. --
  338. -- Configuring gr-filter support...
  339. -- Dependency ENABLE_GRUEL = ON
  340. -- Dependency ENABLE_VOLK = ON
  341. -- Dependency Boost_FOUND = 1
  342. -- Dependency ENABLE_GR_CORE = ON
  343. -- Dependency ENABLE_GR_FFT = ON
  344. -- Enabling gr-filter support.
  345. -- Override with -DENABLE_GR_FILTER=ON/OFF
  346. -- Boost version: 1.54.0
  347. -- Found the following Boost libraries:
  348. -- date_time
  349. -- program_options
  350. -- filesystem
  351. -- system
  352. -- thread
  353. --
  354. -- Configuring gr-atsc support...
  355. -- Dependency Boost_FOUND = 1
  356. -- Dependency ENABLE_GR_CORE = ON
  357. -- Enabling gr-atsc support.
  358. -- Override with -DENABLE_GR_ATSC=ON/OFF
  359. -- Boost version: 1.54.0
  360. -- Found the following Boost libraries:
  361. -- date_time
  362. -- program_options
  363. -- filesystem
  364. -- system
  365. -- thread
  366. --
  367. -- Configuring gr-audio support...
  368. -- Dependency Boost_FOUND = 1
  369. -- Dependency ENABLE_GR_CORE = ON
  370. -- Enabling gr-audio support.
  371. -- Override with -DENABLE_GR_AUDIO=ON/OFF
  372. -- checking for module 'alsa'
  373. -- package 'alsa' not found
  374. -- checking for module 'jack'
  375. -- package 'jack' not found
  376. -- Looking for C++ include AudioUnit/AudioUnit.h
  377. -- Looking for C++ include AudioUnit/AudioUnit.h - found
  378. -- Looking for C++ include AudioToolbox/AudioToolbox.h
  379. -- Looking for C++ include AudioToolbox/AudioToolbox.h - found
  380. -- checking for module 'portaudio'
  381. -- package 'portaudio' not found
  382. -- Could NOT find PORTAUDIO (missing: PORTAUDIO_INCLUDE_DIRS PORTAUDIO_LIBRARIES)
  383. -- Boost version: 1.54.0
  384. -- Found the following Boost libraries:
  385. -- date_time
  386. -- program_options
  387. -- filesystem
  388. -- system
  389. -- thread
  390. -- checking for module 'comedilib'
  391. -- package 'comedilib' not found
  392. --
  393. -- Configuring gr-comedi support...
  394. -- Dependency COMEDI_FOUND =
  395. -- Dependency LINUX =
  396. -- Dependency Boost_FOUND = 1
  397. -- Dependency ENABLE_GR_CORE = ON
  398. -- Disabling gr-comedi support.
  399. -- Override with -DENABLE_GR_COMEDI=ON/OFF
  400. -- Boost version: 1.54.0
  401. -- Found the following Boost libraries:
  402. -- date_time
  403. -- program_options
  404. -- filesystem
  405. -- system
  406. -- thread
  407. --
  408. -- Configuring gr-analog support...
  409. -- Dependency Boost_FOUND = 1
  410. -- Dependency ENABLE_VOLK = ON
  411. -- Dependency ENABLE_GR_CORE = ON
  412. -- Dependency ENABLE_GR_FFT = ON
  413. -- Dependency ENABLE_GR_FILTER = ON
  414. -- Enabling gr-analog support.
  415. -- Override with -DENABLE_GR_ANALOG=ON/OFF
  416. -- Boost version: 1.54.0
  417. -- Found the following Boost libraries:
  418. -- date_time
  419. -- program_options
  420. -- filesystem
  421. -- system
  422. -- thread
  423. --
  424. -- Configuring gr-digital support...
  425. -- Dependency Boost_FOUND = 1
  426. -- Dependency ENABLE_GR_CORE = ON
  427. -- Dependency ENABLE_GR_ANALOG = ON
  428. -- Dependency ENABLE_GR_BLOCKS = ON
  429. -- Dependency ENABLE_GR_FILTER = ON
  430. -- Enabling gr-digital support.
  431. -- Override with -DENABLE_GR_DIGITAL=ON/OFF
  432. -- Boost version: 1.54.0
  433. -- Found the following Boost libraries:
  434. -- date_time
  435. -- program_options
  436. -- filesystem
  437. -- system
  438. -- thread
  439. --
  440. -- Configuring gr-noaa support...
  441. -- Dependency Boost_FOUND = 1
  442. -- Dependency ENABLE_GR_CORE = ON
  443. -- Enabling gr-noaa support.
  444. -- Override with -DENABLE_GR_NOAA=ON/OFF
  445. -- Boost version: 1.54.0
  446. -- Found the following Boost libraries:
  447. -- date_time
  448. -- program_options
  449. -- filesystem
  450. -- system
  451. -- thread
  452. --
  453. -- Configuring gr-pager support...
  454. -- Dependency Boost_FOUND = 1
  455. -- Dependency ENABLE_GR_CORE = ON
  456. -- Enabling gr-pager support.
  457. -- Override with -DENABLE_GR_PAGER=ON/OFF
  458. -- Boost version: 1.54.0
  459. -- Found the following Boost libraries:
  460. -- date_time
  461. -- program_options
  462. -- filesystem
  463. -- system
  464. -- thread
  465. -- Looking for Q_WS_X11
  466. -- Looking for Q_WS_X11 - not found
  467. -- Looking for Q_WS_WIN
  468. -- Looking for Q_WS_WIN - not found
  469. -- Looking for Q_WS_QWS
  470. -- Looking for Q_WS_QWS - not found
  471. -- Looking for Q_WS_MAC
  472. -- Looking for Q_WS_MAC - found
  473. -- Looking for QT_MAC_USE_COCOA
  474. -- Looking for QT_MAC_USE_COCOA - found
  475. -- Found Qt4: /usr/local/bin/qmake (found suitable version "4.8.5", minimum required is "4.2.0")
  476. -- Found Qwt: /usr/local/lib/qwt.framework
  477. --
  478. -- Python checking for PyQt4
  479. -- Python checking for PyQt4 - found
  480. --
  481. -- Configuring gr-qtgui support...
  482. -- Dependency Boost_FOUND = 1
  483. -- Dependency QT4_FOUND = TRUE
  484. -- Dependency QWT_FOUND = TRUE
  485. -- Dependency ENABLE_GR_CORE = ON
  486. -- Dependency PYTHONLIBS_FOUND = TRUE
  487. -- Dependency PYQT4_FOUND = TRUE
  488. -- Enabling gr-qtgui support.
  489. -- Override with -DENABLE_GR_QTGUI=ON/OFF
  490. -- Boost version: 1.54.0
  491. -- Found the following Boost libraries:
  492. -- date_time
  493. -- program_options
  494. -- filesystem
  495. -- system
  496. -- thread
  497. --
  498. -- Configuring gr-trellis support...
  499. -- Dependency Boost_FOUND = 1
  500. -- Dependency ENABLE_GR_CORE = ON
  501. -- Dependency ENABLE_GR_DIGITAL = ON
  502. -- Enabling gr-trellis support.
  503. -- Override with -DENABLE_GR_TRELLIS=ON/OFF
  504. -- Boost version: 1.54.0
  505. -- Found the following Boost libraries:
  506. -- date_time
  507. -- program_options
  508. -- filesystem
  509. -- system
  510. -- thread
  511. -- checking for module 'uhd'
  512. -- package 'uhd' not found
  513. -- Could NOT find UHD (missing: UHD_LIBRARIES UHD_INCLUDE_DIRS)
  514. --
  515. -- Configuring gr-uhd support...
  516. -- Dependency Boost_FOUND = 1
  517. -- Dependency UHD_FOUND = FALSE
  518. -- Dependency ENABLE_GR_CORE = ON
  519. -- Disabling gr-uhd support.
  520. -- Override with -DENABLE_GR_UHD=ON/OFF
  521. -- Boost version: 1.54.0
  522. -- Found the following Boost libraries:
  523. -- date_time
  524. -- program_options
  525. -- filesystem
  526. -- system
  527. -- thread
  528. -- checking for module 'shd'
  529. -- package 'shd' not found
  530. -- Could NOT find SHD (missing: SHD_LIBRARIES SHD_INCLUDE_DIRS)
  531. --
  532. -- Configuring gr-shd support...
  533. -- Dependency Boost_FOUND = 1
  534. -- Dependency SHD_FOUND = FALSE
  535. -- Dependency ENABLE_GR_CORE = ON
  536. -- Disabling gr-shd support.
  537. -- Override with -DENABLE_GR_SHD=ON/OFF
  538. --
  539. -- Configuring gr-utils support...
  540. -- Dependency ENABLE_GR_CORE = ON
  541. -- Dependency ENABLE_PYTHON = ON
  542. -- Enabling gr-utils support.
  543. -- Override with -DENABLE_GR_UTILS=ON/OFF
  544. -- Boost version: 1.54.0
  545. -- Found the following Boost libraries:
  546. -- date_time
  547. -- program_options
  548. -- filesystem
  549. -- system
  550. -- thread
  551. -- Found SDL: /usr/local/lib/libSDLmain.a;/usr/local/lib/libSDL.dylib;-framework Cocoa (found version "1.2.15")
  552. --
  553. -- Configuring gr-video-sdl support...
  554. -- Dependency SDL_FOUND = TRUE
  555. -- Dependency Boost_FOUND = 1
  556. -- Dependency ENABLE_GR_CORE = ON
  557. -- Enabling gr-video-sdl support.
  558. -- Override with -DENABLE_GR_VIDEO_SDL=ON/OFF
  559. -- Boost version: 1.54.0
  560. -- Found the following Boost libraries:
  561. -- date_time
  562. -- program_options
  563. -- filesystem
  564. -- system
  565. -- thread
  566. --
  567. -- Configuring gr-vocoder support...
  568. -- Dependency Boost_FOUND = 1
  569. -- Dependency ENABLE_GR_CORE = ON
  570. -- Enabling gr-vocoder support.
  571. -- Override with -DENABLE_GR_VOCODER=ON/OFF
  572. -- Boost version: 1.54.0
  573. -- Found the following Boost libraries:
  574. -- date_time
  575. -- program_options
  576. -- filesystem
  577. -- system
  578. -- thread
  579. --
  580. -- Configuring gr-fcd support...
  581. -- Dependency Boost_FOUND = 1
  582. -- Dependency ENABLE_GR_CORE = ON
  583. -- Dependency ENABLE_GR_AUDIO = ON
  584. -- Enabling gr-fcd support.
  585. -- Override with -DENABLE_GR_FCD=ON/OFF
  586. -- Boost version: 1.54.0
  587. -- Found the following Boost libraries:
  588. -- date_time
  589. -- program_options
  590. -- filesystem
  591. -- system
  592. -- thread
  593. -- checking for module 'gsl >= 1.10'
  594. -- found gsl , version 1.15
  595. --
  596. -- Configuring gr-wavelet support...
  597. -- Dependency Boost_FOUND = 1
  598. -- Dependency ENABLE_GR_CORE = ON
  599. -- Dependency GSL_FOUND = 1
  600. -- Enabling gr-wavelet support.
  601. -- Override with -DENABLE_GR_WAVELET=ON/OFF
  602. --
  603. -- Python checking for wx >= 2.8
  604. -- Python checking for wx >= 2.8 - found
  605. --
  606. -- Python checking for numpy
  607. -- Python checking for numpy - found
  608. --
  609. -- Configuring gr-wxgui support...
  610. -- Dependency ENABLE_GR_CORE = ON
  611. -- Dependency ENABLE_PYTHON = ON
  612. -- Dependency NUMPY_FOUND = TRUE
  613. -- Dependency WX_FOUND = TRUE
  614. -- Enabling gr-wxgui support.
  615. -- Override with -DENABLE_GR_WXGUI=ON/OFF
  616. --
  617. -- ######################################################
  618. -- # Gnuradio enabled components
  619. -- ######################################################
  620. -- * python-support
  621. -- * testing-support
  622. -- * volk
  623. -- * gruel
  624. -- * gnuradio-core
  625. -- * gnuradio-companion
  626. -- * gr-blocks
  627. -- * gr-fft
  628. -- * gr-filter
  629. -- * gr-atsc
  630. -- * gr-audio
  631. -- * gr-analog
  632. -- * gr-digital
  633. -- * gr-noaa
  634. -- * gr-pager
  635. -- * gr-qtgui
  636. -- * gr-trellis
  637. -- * gr-utils
  638. -- * gr-video-sdl
  639. -- * gr-vocoder
  640. -- * gr-fcd
  641. -- * gr-wavelet
  642. -- * gr-wxgui
  643. --
  644. -- ######################################################
  645. -- # Gnuradio disabled components
  646. -- ######################################################
  647. -- * doxygen
  648. -- * sphinx
  649. -- * gr-comedi
  650. -- * gr-uhd
  651. -- * gr-shd
  652. --
  653. -- Using install prefix: /usr/local/Cellar/gnuradio/3.6.5.1
  654. -- Building for version: 3.6.5.1 / 3.6.5.1
  655. -- Configuring done
  656. -- Generating done
  657. CMake Warning:
  658. Manually-specified variables were not used by the project:
  659.  
  660. PYTHON_PACKAGES_PATH
  661.  
  662.  
  663. -- Build files have been written to: /tmp/gnuradio-qTEC/gnuradio-3.6.5.1/build
  664. ==> make
  665. make
  666. [ 0%] Scanning dependencies of target pmt_swig_swig_doc
  667. Scanning dependencies of target pmt_generated
  668. Generating ../include/gruel/pmt_serial_tags.h
  669. [ 0%] [ 0%] [ 0%] Built target pmt_swig_swig_doc
  670. [ 0%] Generating volk_machine_sse4_1_64_orc.c
  671. Generating ../include/gruel/pmt_serial_tags.h
  672. Generating pmt/pmt_unv_int.h, pmt/qa_pmt_unv.h, pmt/pmt_unv.cc, pmt/qa_pmt_unv.cc
  673. Scanning dependencies of target pygen_gruel_src_python_f120a
  674. [ 1%] [ 1%] Generating pmt/pmt_unv_int.h, pmt/qa_pmt_unv.h, pmt/pmt_unv.cc, pmt/qa_pmt_unv.cc
  675. Generating __init__.pyc
  676. Scanning dependencies of target gruel
  677. [ 1%] Built target pmt_generated
  678. [ 1%] [ 1%] Generating volk_16i_s32f_deinterleave_32f_x2_a_orc_impl.c
  679. Generating __init__.pyo
  680. Scanning dependencies of target pygen_gruel_src_python_f5132
  681. [ 2%] Generating pmt/__init__.pyc, pmt/pmt_to_python.pyc
  682. [ 2%] Built target pygen_gruel_src_python_f120a
  683. [ 2%] Generating volk_16ic_deinterleave_16i_x2_a_orc_impl.c
  684. [ 2%] Generating volk_16ic_deinterleave_real_8i_a_orc_impl.c
  685. [ 2%] Generating pmt/__init__.pyo, pmt/pmt_to_python.pyo
  686. [ 2%] Generating volk_16ic_magnitude_16i_a_orc_impl.c
  687. Scanning dependencies of target gr_core_rstest
  688. [ 2%] Built target pygen_gruel_src_python_f5132
  689. [ 2%] [ 2%] Generating volk_16sc_magnitude_32f_aligned16_orc_impl.c
  690. Building C object gnuradio-core/src/lib/CMakeFiles/gr_core_rstest.dir/reed-solomon/encode_rs.c.o
  691. [ 2%] Generating volk_16u_byteswap_a_orc_impl.c
  692. Scanning dependencies of target gnuradio_core_gengen_swig_doc
  693. [ 2%] Built target gnuradio_core_gengen_swig_doc
  694. [ 2%] Generating volk_32f_s32f_multiply_32f_a_orc_impl.c
  695. Scanning dependencies of target gnuradio_core_general_swig_doc
  696. [ 2%] Built target gnuradio_core_general_swig_doc
  697. Scanning dependencies of target general_generated
  698. [ 2%] Generating general/sine_table.h
  699. [ 2%] Built target general_generated
  700. [ 2%] Generating volk_32f_s32f_normalize_a_orc_impl.c
  701. Scanning dependencies of target filter_generated
  702. [ 2%] [ 2%] Building C object gnuradio-core/src/lib/CMakeFiles/gr_core_rstest.dir/reed-solomon/decode_rs.c.o
  703. generating filter files
  704. /tmp/gnuradio-qTEC/gnuradio-3.6.5.1/gnuradio-core/src/lib/reed-solomon/decode_rs.c:12:1: warning: "NULL" redefined
  705. In file included from /tmp/gnuradio-qTEC/gnuradio-3.6.5.1/gnuradio-core/src/lib/reed-solomon/decode_rs.c:10:
  706. /usr/include/string.h:72:1: warning: this is the location of the previous definition
  707. [ 2%] Generating volk_32f_sqrt_32f_a_orc_impl.c
  708. [ 2%] Generating volk_32f_x2_add_32f_a_orc_impl.c
  709. [ 2%] Building C object gnuradio-core/src/lib/CMakeFiles/gr_core_rstest.dir/reed-solomon/init_rs.c.o
  710. [ 2%] [ 2%] Built target filter_generated
  711. Generating volk_32f_x2_divide_32f_a_orc_impl.c
  712. [ 2%] Scanning dependencies of target gengen_generated
  713. Generating volk_32f_x2_dot_prod_32f_a_orc_impl.c
  714. /tmp/gnuradio-qTEC/gnuradio-3.6.5.1/gnuradio-core/src/lib/reed-solomon/init_rs.c:16:1: warning: "NULL" redefined
  715. In file included from /tmp/gnuradio-qTEC/gnuradio-3.6.5.1/gnuradio-core/src/lib/reed-solomon/init_rs.c:6:
  716. /usr/include/stdlib.h:115:1: warning: this is the location of the previous definition
  717. [ 2%] [ 2%] Generating gengen/gr_vector_source_b.h, gengen/gr_vector_source_s.h, gengen/gr_vector_source_i.h, gengen/gr_vector_source_f.h, gengen/gr_vector_source_c.h
  718. Generating volk_32f_x2_max_32f_a_orc_impl.c
  719. [ 2%] [ 2%] Generating volk_32f_x2_min_32f_a_orc_impl.c
  720. Building C object gnuradio-core/src/lib/CMakeFiles/gr_core_rstest.dir/reed-solomon/rstest.c.o
  721. [ 2%] [ 2%] Generating volk_32f_x2_multiply_32f_a_orc_impl.c
  722. Generating gengen/gr_vector_insert_b.h
  723. [ 2%] Generating volk_32f_x2_subtract_32f_a_orc_impl.c
  724. [ 2%] Generating volk_32fc_32f_multiply_32fc_a_orc_impl.c
  725. [ 2%] [ 2%] Building C object gnuradio-core/src/lib/CMakeFiles/gr_core_rstest.dir/reed-solomon/exercise.c.o
  726. Generating gengen/gr_vector_sink_b.h, gengen/gr_vector_sink_s.h, gengen/gr_vector_sink_i.h, gengen/gr_vector_sink_f.h, gengen/gr_vector_sink_c.h
  727. [ 3%] Generating volk_32fc_magnitude_32f_a_orc_impl.c
  728. [ 3%] Generating volk_32fc_s32f_magnitude_16i_a_orc_impl.c
  729. [ 3%] [ 3%] Generating gengen/gr_noise_source_s.h, gengen/gr_noise_source_i.h, gengen/gr_noise_source_f.h, gengen/gr_noise_source_c.h
  730. Generating volk_32fc_s32fc_multiply_32fc_a_orc_impl.c
  731. Linking C executable gr_core_rstest
  732. [ 3%] Generating volk_32fc_x2_multiply_32fc_a_orc_impl.c
  733. [ 3%] [ 3%] [ 3%] Built target gr_core_rstest
  734. Generating gengen/gr_fastnoise_source_s.h, gengen/gr_fastnoise_source_i.h, gengen/gr_fastnoise_source_f.h, gengen/gr_fastnoise_source_c.h
  735. Generating volk_32i_x2_and_32i_a_orc_impl.c
  736. Scanning dependencies of target gnuradio_core_runtime_swig_doc
  737. [ 3%] [ 3%] Generating volk_32i_x2_or_32i_a_orc_impl.c
  738. Built target gnuradio_core_runtime_swig_doc
  739. [ 3%] Scanning dependencies of target gnuradio_core_filter_swig_doc
  740. Generating volk_8i_convert_16i_a_orc_impl.c
  741. [ 3%] [ 3%] Built target gnuradio_core_filter_swig_doc
  742. Generating gengen/gr_sig_source_s.h, gengen/gr_sig_source_i.h, gengen/gr_sig_source_f.h, gengen/gr_sig_source_c.h
  743. [ 3%] Scanning dependencies of target gnuradio_core_hier_swig_doc
  744. Generating volk_8i_s32f_convert_32f_a_orc_impl.c
  745. [ 3%] Built target gnuradio_core_hier_swig_doc
  746. [ 3%] [ 3%] Generating ../include/volk/volk.h
  747. Generating volk.c
  748. [ 4%] Generating gengen/gr_probe_signal_b.h, gengen/gr_probe_signal_s.h, gengen/gr_probe_signal_i.h, gengen/gr_probe_signal_f.h, gengen/gr_probe_signal_c.h
  749. [ 4%] Generating gengen/gr_probe_signal_vb.h, gengen/gr_probe_signal_vs.h, gengen/gr_probe_signal_vi.h, gengen/gr_probe_signal_vf.h, gengen/gr_probe_signal_vc.h
  750. [ 4%] [ 4%] Generating gengen/gr_add_const_bb.h, gengen/gr_add_const_ss.h, gengen/gr_add_const_ii.h, gengen/gr_add_const_ff.h, gengen/gr_add_const_cc.h, gengen/gr_add_const_sf.h
  751. Building CXX object gruel/src/lib/CMakeFiles/gruel.dir/msg/msg_accepter.cc.o
  752. [ 4%] Generating gengen/gr_multiply_const_ss.h, gengen/gr_multiply_const_ii.h
  753. [ 4%] Generating gengen/gr_add_ss.h, gengen/gr_add_ii.h, gengen/gr_add_cc.h
  754. [ 4%] Generating gengen/gr_sub_ss.h, gengen/gr_sub_ii.h, gengen/gr_sub_ff.h, gengen/gr_sub_cc.h
  755. [ 4%] Generating gengen/gr_multiply_ss.h, gengen/gr_multiply_ii.h
  756. [ 4%] Generating gengen/gr_divide_ss.h, gengen/gr_divide_ii.h, gengen/gr_divide_ff.h, gengen/gr_divide_cc.h
  757. [ 4%] Generating gengen/gr_mute_ss.h, gengen/gr_mute_ii.h, gengen/gr_mute_ff.h, gengen/gr_mute_cc.h
  758. [ 4%] Generating gengen/gr_add_const_vss.h, gengen/gr_add_const_vii.h, gengen/gr_add_const_vff.h, gengen/gr_add_const_vcc.h
  759. [ 4%] Generating gengen/gr_multiply_const_vss.h, gengen/gr_multiply_const_vii.h, gengen/gr_multiply_const_vff.h, gengen/gr_multiply_const_vcc.h
  760. [ 4%] Generating gengen/gr_integrate_ss.h, gengen/gr_integrate_ii.h, gengen/gr_integrate_ff.h, gengen/gr_integrate_cc.h
  761. [ 4%] Generating gengen/gr_moving_average_ss.h, gengen/gr_moving_average_ii.h, gengen/gr_moving_average_ff.h, gengen/gr_moving_average_cc.h
  762. [ 4%] [ 4%] Generating ../include/volk/volk_typedefs.h
  763. Building CXX object gruel/src/lib/CMakeFiles/gruel.dir/msg/msg_accepter_msgq.cc.o
  764. [ 4%] [ 4%] Generating gengen/gr_chunks_to_symbols_bf.h, gengen/gr_chunks_to_symbols_bc.h, gengen/gr_chunks_to_symbols_sf.h, gengen/gr_chunks_to_symbols_sc.h, gengen/gr_chunks_to_symbols_if.h, gengen/gr_chunks_to_symbols_ic.h
  765. Generating ../include/volk/volk_cpu.h
  766. [ 4%] Generating gengen/gr_unpacked_to_packed_bb.h, gengen/gr_unpacked_to_packed_ss.h, gengen/gr_unpacked_to_packed_ii.h
  767. [ 4%] Generating gengen/gr_packed_to_unpacked_bb.h, gengen/gr_packed_to_unpacked_ss.h, gengen/gr_packed_to_unpacked_ii.h
  768. [ 4%] Generating gengen/gr_xor_bb.h, gengen/gr_xor_ss.h, gengen/gr_xor_ii.h
  769. [ 4%] Generating gengen/gr_and_bb.h, gengen/gr_and_ss.h, gengen/gr_and_ii.h
  770. [ 4%] Generating gengen/gr_and_const_bb.h, gengen/gr_and_const_ss.h, gengen/gr_and_const_ii.h
  771. [ 4%] Generating gengen/gr_or_bb.h, gengen/gr_or_ss.h, gengen/gr_or_ii.h
  772. [ 5%] Generating gengen/gr_not_bb.h, gengen/gr_not_ss.h, gengen/gr_not_ii.h
  773. [ 5%] Generating gengen/gr_sample_and_hold_bb.h, gengen/gr_sample_and_hold_ss.h, gengen/gr_sample_and_hold_ii.h, gengen/gr_sample_and_hold_ff.h
  774. [ 5%] Generating gengen/gr_argmax_fs.h, gengen/gr_argmax_is.h, gengen/gr_argmax_ss.h
  775. [ 5%] Scanning dependencies of target gnuradio_core_io_swig_doc
  776. [ 5%] Generating gengen/gr_max_ff.h, gengen/gr_max_ii.h, gengen/gr_max_ss.h
  777. Generating volk_cpu.c
  778. [ 5%] Built target gnuradio_core_io_swig_doc
  779. [ 5%] Building CXX object gruel/src/lib/CMakeFiles/gruel.dir/msg/msg_queue.cc.o
  780. [ 5%] Generating gengen/gr_peak_detector_fb.h, gengen/gr_peak_detector_ib.h, gengen/gr_peak_detector_sb.h
  781. [ 5%] Generating gengen/gr_vector_source_b.i, gengen/gr_vector_source_s.i, gengen/gr_vector_source_i.i, gengen/gr_vector_source_f.i, gengen/gr_vector_source_c.i
  782. [ 5%] Generating gengen/gr_vector_insert_b.i
  783. [ 5%] Generating gengen/gr_vector_sink_b.i, gengen/gr_vector_sink_s.i, gengen/gr_vector_sink_i.i, gengen/gr_vector_sink_f.i, gengen/gr_vector_sink_c.i
  784. [ 5%] Generating gengen/gr_noise_source_s.i, gengen/gr_noise_source_i.i, gengen/gr_noise_source_f.i, gengen/gr_noise_source_c.i
  785. [ 5%] Generating gengen/gr_fastnoise_source_s.i, gengen/gr_fastnoise_source_i.i, gengen/gr_fastnoise_source_f.i, gengen/gr_fastnoise_source_c.i
  786. [ 5%] Generating gengen/gr_sig_source_s.i, gengen/gr_sig_source_i.i, gengen/gr_sig_source_f.i, gengen/gr_sig_source_c.i
  787. [ 5%] Generating gengen/gr_probe_signal_b.i, gengen/gr_probe_signal_s.i, gengen/gr_probe_signal_i.i, gengen/gr_probe_signal_f.i, gengen/gr_probe_signal_c.i
  788. [ 5%] Generating gengen/gr_probe_signal_vb.i, gengen/gr_probe_signal_vs.i, gengen/gr_probe_signal_vi.i, gengen/gr_probe_signal_vf.i, gengen/gr_probe_signal_vc.i
  789. [ 5%] Generating gengen/gr_add_const_bb.i, gengen/gr_add_const_ss.i, gengen/gr_add_const_ii.i, gengen/gr_add_const_ff.i, gengen/gr_add_const_cc.i, gengen/gr_add_const_sf.i
  790. [ 5%] Generating gengen/gr_multiply_const_ss.i, gengen/gr_multiply_const_ii.i
  791. [ 5%] Generating ../include/volk/volk_config_fixed.h
  792. [ 5%] Generating gengen/gr_add_ss.i, gengen/gr_add_ii.i, gengen/gr_add_cc.i
  793. [ 5%] Generating gengen/gr_sub_ss.i, gengen/gr_sub_ii.i, gengen/gr_sub_ff.i, gengen/gr_sub_cc.i
  794. [ 5%] Generating gengen/gr_multiply_ss.i, gengen/gr_multiply_ii.i
  795. [ 5%] Generating gengen/gr_divide_ss.i, gengen/gr_divide_ii.i, gengen/gr_divide_ff.i, gengen/gr_divide_cc.i
  796. [ 6%] [ 6%] Generating gengen/gr_mute_ss.i, gengen/gr_mute_ii.i, gengen/gr_mute_ff.i, gengen/gr_mute_cc.i
  797. Building CXX object gruel/src/lib/CMakeFiles/gruel.dir/pmt/pmt_unv.cc.o
  798. [ 6%] Generating gengen/gr_add_const_vss.i, gengen/gr_add_const_vii.i, gengen/gr_add_const_vff.i, gengen/gr_add_const_vcc.i
  799. [ 6%] Generating gengen/gr_multiply_const_vss.i, gengen/gr_multiply_const_vii.i, gengen/gr_multiply_const_vff.i, gengen/gr_multiply_const_vcc.i
  800. [ 6%] Generating gengen/gr_integrate_ss.i, gengen/gr_integrate_ii.i, gengen/gr_integrate_ff.i, gengen/gr_integrate_cc.i
  801. [ 6%] Generating gengen/gr_moving_average_ss.i, gengen/gr_moving_average_ii.i, gengen/gr_moving_average_ff.i, gengen/gr_moving_average_cc.i
  802. [ 6%] Generating gengen/gr_chunks_to_symbols_bf.i, gengen/gr_chunks_to_symbols_bc.i, gengen/gr_chunks_to_symbols_sf.i, gengen/gr_chunks_to_symbols_sc.i, gengen/gr_chunks_to_symbols_if.i, gengen/gr_chunks_to_symbols_ic.i
  803. [ 6%] Generating gengen/gr_unpacked_to_packed_bb.i, gengen/gr_unpacked_to_packed_ss.i, gengen/gr_unpacked_to_packed_ii.i
  804. [ 6%] Generating volk_machines.h
  805. [ 6%] Generating gengen/gr_packed_to_unpacked_bb.i, gengen/gr_packed_to_unpacked_ss.i, gengen/gr_packed_to_unpacked_ii.i
  806. [ 6%] Generating gengen/gr_xor_bb.i, gengen/gr_xor_ss.i, gengen/gr_xor_ii.i
  807. [ 6%] Generating gengen/gr_and_bb.i, gengen/gr_and_ss.i, gengen/gr_and_ii.i
  808. [ 6%] Generating gengen/gr_and_const_bb.i, gengen/gr_and_const_ss.i, gengen/gr_and_const_ii.i
  809. [ 6%] Generating gengen/gr_or_bb.i, gengen/gr_or_ss.i, gengen/gr_or_ii.i
  810. [ 6%] Generating gengen/gr_not_bb.i, gengen/gr_not_ss.i, gengen/gr_not_ii.i
  811. [ 6%] Generating gengen/gr_sample_and_hold_bb.i, gengen/gr_sample_and_hold_ss.i, gengen/gr_sample_and_hold_ii.i, gengen/gr_sample_and_hold_ff.i
  812. [ 6%] Generating gengen/gr_argmax_fs.i, gengen/gr_argmax_is.i, gengen/gr_argmax_ss.i
  813. [ 6%] Generating gengen/gr_max_ff.i, gengen/gr_max_ii.i, gengen/gr_max_ss.i
  814. [ 6%] Building CXX object gruel/src/lib/CMakeFiles/gruel.dir/pmt/pmt.cc.o
  815. [ 6%] Generating gengen/gr_peak_detector_fb.i, gengen/gr_peak_detector_ib.i, gengen/gr_peak_detector_sb.i
  816. [ 6%] Built target gengen_generated
  817. [ 6%] Scanning dependencies of target pygen_gnuradio_core_src_lib_swig_902ee
  818. Generating volk_machines.c
  819. [ 6%] Generating gnuradio_core.pyc
  820. [ 6%] Generating gnuradio_core.pyo
  821. [ 6%] Built target pygen_gnuradio_core_src_lib_swig_902ee
  822. Scanning dependencies of target pygen_gnuradio_core_src_python_gnuradio_49350
  823. [ 6%] Generating __init__.pyc, eng_notation.pyc, eng_option.pyc, gr_unittest.pyc, gr_xmlrunner.pyc, optfir.pyc, window.pyc
  824. [ 6%] Generating __init__.pyo, eng_notation.pyo, eng_option.pyo, gr_unittest.pyo, gr_xmlrunner.pyo, optfir.pyo, window.pyo
  825. [ 6%] Built target pygen_gnuradio_core_src_python_gnuradio_49350
  826. [ 6%] Building CXX object gruel/src/lib/CMakeFiles/gruel.dir/pmt/pmt_io.cc.o
  827. [ 6%] Generating volk_machine_generic_orc.c
  828. [ 6%] Building CXX object gruel/src/lib/CMakeFiles/gruel.dir/pmt/pmt_pool.cc.o
  829. Scanning dependencies of target pygen_gnuradio_core_src_python_gnuradio_gr_ac6a0
  830. [ 6%] Generating __init__.pyc, exceptions.pyc, gateway.pyc, gr_threading.pyc, gr_threading_23.pyc, gr_threading_24.pyc, hier_block2.pyc, prefs.pyc, tag_utils.pyc, top_block.pyc, pubsub.pyc
  831. [ 6%] Generating __init__.pyo, exceptions.pyo, gateway.pyo, gr_threading.pyo, gr_threading_23.pyo, gr_threading_24.pyo, hier_block2.pyo, prefs.pyo, tag_utils.pyo, top_block.pyo, pubsub.pyo
  832. [ 6%] Built target pygen_gnuradio_core_src_python_gnuradio_gr_ac6a0
  833. [ 6%] Building CXX object gruel/src/lib/CMakeFiles/gruel.dir/pmt/pmt_serialize.cc.o
  834. [ 6%] Generating volk_machine_sse2_64_mmx_orc.c
  835. [ 6%] Generating volk_machine_sse3_64_orc.c
  836. [ 7%] Generating volk_machine_ssse3_64_orc.c
  837. [ 7%] Building CXX object gruel/src/lib/CMakeFiles/gruel.dir/realtime.cc.o
  838. Scanning dependencies of target volk
  839. Scanning dependencies of target pygen_gnuradio_core_src_python_gnuradio_gru_9129b
  840. [ 7%] Generating __init__.pyc
  841. [ 7%] Building C object volk/lib/CMakeFiles/volk.dir/volk_16i_s32f_deinterleave_32f_x2_a_orc_impl.c.o
  842. [ 7%] Generating __init__.pyo
  843. [ 7%] Building C object volk/lib/CMakeFiles/volk.dir/volk_16ic_deinterleave_16i_x2_a_orc_impl.c.o
  844. [ 7%] Built target pygen_gnuradio_core_src_python_gnuradio_gru_9129b
  845. Scanning dependencies of target pygen_gnuradio_core_src_python_gnuradio_gruimpl_4231d
  846. [ 7%] Generating __init__.pyc, freqz.pyc, gnuplot_freqz.pyc, hexint.pyc, listmisc.pyc, mathmisc.pyc, lmx2306.pyc, msgq_runner.pyc, os_read_exactly.pyc, sdr_1000.pyc, seq_with_cursor.pyc, socket_stuff.pyc, daemon.pyc
  847. [ 7%] Building C object volk/lib/CMakeFiles/volk.dir/volk_16ic_deinterleave_real_8i_a_orc_impl.c.o
  848. [ 7%] Generating __init__.pyo, freqz.pyo, gnuplot_freqz.pyo, hexint.pyo, listmisc.pyo, mathmisc.pyo, lmx2306.pyo, msgq_runner.pyo, os_read_exactly.pyo, sdr_1000.pyo, seq_with_cursor.pyo, socket_stuff.pyo, daemon.pyo
  849. [ 7%] Building C object volk/lib/CMakeFiles/volk.dir/volk_16ic_magnitude_16i_a_orc_impl.c.o
  850. [ 7%] Built target pygen_gnuradio_core_src_python_gnuradio_gruimpl_4231d
  851. /tmp/gnuradio-qTEC/gnuradio-3.6.5.1/build/volk/lib/volk_16ic_magnitude_16i_a_orc_impl.c: In function ‘_backup_volk_16ic_magnitude_16i_a_orc_impl’:
  852. /tmp/gnuradio-qTEC/gnuradio-3.6.5.1/build/volk/lib/volk_16ic_magnitude_16i_a_orc_impl.c:374: warning: comparison between signed and unsigned
  853. Scanning dependencies of target pygen_gnuradio_core_src_python_gnuradio_blks2_68ba7
  854. [ 7%] [ 7%] Generating __init__.pyc
  855. Building C object volk/lib/CMakeFiles/volk.dir/volk_16sc_magnitude_32f_aligned16_orc_impl.c.o
  856. [ 7%] Generating __init__.pyo
  857. [ 7%] Building C object volk/lib/CMakeFiles/volk.dir/volk_16u_byteswap_a_orc_impl.c.o
  858. [ 7%] Built target pygen_gnuradio_core_src_python_gnuradio_blks2_68ba7
  859. Scanning dependencies of target pygen_gnuradio_core_src_python_gnuradio_blks2impl_a0c3c
  860. [ 7%] [ 7%] [ 8%] Building C object volk/lib/CMakeFiles/volk.dir/volk_32f_s32f_multiply_32f_a_orc_impl.c.o
  861. Building CXX object gruel/src/lib/CMakeFiles/gruel.dir/sys_pri.cc.o
  862. Generating __init__.pyc, am_demod.pyc, channel_model.pyc, filterbank.pyc, fm_demod.pyc, fm_emph.pyc, logpwrfft.pyc, nbfm_rx.pyc, nbfm_tx.pyc, pfb_arb_resampler.pyc, pfb_channelizer.pyc, pfb_decimator.pyc, pfb_interpolator.pyc, rational_resampler.pyc, standard_squelch.pyc, stream_to_vector_decimator.pyc, wfm_rcv.pyc, wfm_rcv_fmdet.pyc, wfm_rcv_pll.pyc, wfm_tx.pyc
  863. [ 8%] [ 8%] Building C object volk/lib/CMakeFiles/volk.dir/volk_32f_s32f_normalize_a_orc_impl.c.o
  864. Generating __init__.pyo, am_demod.pyo, channel_model.pyo, filterbank.pyo, fm_demod.pyo, fm_emph.pyo, logpwrfft.pyo, nbfm_rx.pyo, nbfm_tx.pyo, pfb_arb_resampler.pyo, pfb_channelizer.pyo, pfb_decimator.pyo, pfb_interpolator.pyo, rational_resampler.pyo, standard_squelch.pyo, stream_to_vector_decimator.pyo, wfm_rcv.pyo, wfm_rcv_fmdet.pyo, wfm_rcv_pll.pyo, wfm_tx.pyo
  865. [ 8%] Building C object volk/lib/CMakeFiles/volk.dir/volk_32f_sqrt_32f_a_orc_impl.c.o
  866. [ 8%] Built target pygen_gnuradio_core_src_python_gnuradio_blks2impl_a0c3c
  867. [ 8%] Building C object volk/lib/CMakeFiles/volk.dir/volk_32f_x2_add_32f_a_orc_impl.c.o
  868. Scanning dependencies of target pygen_gnuradio_core_src_examples_mp_sched_09932
  869. [ 8%] [ 8%] Shebangin affinity_set.py
  870. Building C object volk/lib/CMakeFiles/volk.dir/volk_32f_x2_divide_32f_a_orc_impl.c.o
  871. [ 8%] Building CXX object gruel/src/lib/CMakeFiles/gruel.dir/thread.cc.o
  872. [ 8%] Shebangin plot_flops.py
  873. [ 8%] Building C object volk/lib/CMakeFiles/volk.dir/volk_32f_x2_dot_prod_32f_a_orc_impl.c.o
  874. [ 8%] Shebangin run_synthetic.py
  875. [ 8%] Building C object volk/lib/CMakeFiles/volk.dir/volk_32f_x2_max_32f_a_orc_impl.c.o
  876. [ 8%] Shebangin synthetic.py
  877. [ 8%] Building CXX object gruel/src/lib/CMakeFiles/gruel.dir/thread_body_wrapper.cc.o
  878. [ 8%] Shebangin wfm_rcv_pll_to_wav.py
  879. [ 8%] Building C object volk/lib/CMakeFiles/volk.dir/volk_32f_x2_min_32f_a_orc_impl.c.o
  880. [ 8%] Built target pygen_gnuradio_core_src_examples_mp_sched_09932
  881. Scanning dependencies of target pygen_gnuradio_core_src_examples_network_a0592
  882. [ 8%] [ 8%] Building C object volk/lib/CMakeFiles/volk.dir/volk_32f_x2_multiply_32f_a_orc_impl.c.o
  883. Shebangin audio_sink.py
  884. [ 8%] Shebangin audio_source.py
  885. [ 8%] Building C object volk/lib/CMakeFiles/volk.dir/volk_32f_x2_subtract_32f_a_orc_impl.c.o
  886. [ 8%] Shebangin dial_tone_sink.py
  887. [ 8%] Building C object volk/lib/CMakeFiles/volk.dir/volk_32fc_32f_multiply_32fc_a_orc_impl.c.o
  888. [ 8%] Shebangin dial_tone_source.py
  889. [ 9%] [ 9%] Building C object volk/lib/CMakeFiles/volk.dir/volk_32fc_magnitude_32f_a_orc_impl.c.o
  890. Shebangin vector_sink.py
  891. [ 9%] Shebangin vector_source.py
  892. [ 9%] Building C object volk/lib/CMakeFiles/volk.dir/volk_32fc_s32f_magnitude_16i_a_orc_impl.c.o
  893. [ 9%] Built target pygen_gnuradio_core_src_examples_network_a0592
  894. /tmp/gnuradio-qTEC/gnuradio-3.6.5.1/build/volk/lib/volk_32fc_s32f_magnitude_16i_a_orc_impl.c: In function ‘_backup_volk_32fc_s32f_magnitude_16i_a_orc_impl’:
  895. /tmp/gnuradio-qTEC/gnuradio-3.6.5.1/build/volk/lib/volk_32fc_s32f_magnitude_16i_a_orc_impl.c:316: warning: comparison between signed and unsigned
  896. Scanning dependencies of target pygen_gnuradio_core_src_examples_pfb_e16f9
  897. [ 9%] [ 9%] Shebangin channelize.py
  898. Building C object volk/lib/CMakeFiles/volk.dir/volk_32fc_s32fc_multiply_32fc_a_orc_impl.c.o
  899. [ 9%] Shebangin chirp_channelize.py
  900. [ 9%] Building C object volk/lib/CMakeFiles/volk.dir/volk_32fc_x2_multiply_32fc_a_orc_impl.c.o
  901. [ 9%] Shebangin decimate.py
  902. [ 9%] Shebangin fmtest.py
  903. [ 9%] Building C object volk/lib/CMakeFiles/volk.dir/volk_32i_x2_and_32i_a_orc_impl.c.o
  904. [ 9%] Shebangin interpolate.py
  905. [ 9%] [ 9%] Building C object volk/lib/CMakeFiles/volk.dir/volk_32i_x2_or_32i_a_orc_impl.c.o
  906. Shebangin resampler.py
  907. [ 9%] Shebangin synth_filter.py
  908. [ 9%] Building C object volk/lib/CMakeFiles/volk.dir/volk_8i_convert_16i_a_orc_impl.c.o
  909. [ 10%] Shebangin synth_to_chan.py
  910. [ 10%] [ 10%] Building C object volk/lib/CMakeFiles/volk.dir/volk_8i_s32f_convert_32f_a_orc_impl.c.o
  911. Shebangin reconstruction.py
  912. [ 10%] Built target pygen_gnuradio_core_src_examples_pfb_e16f9
  913. [ 10%] Scanning dependencies of target pygen_gnuradio_core_src_examples_tags_b5e85
  914. Building C object volk/lib/CMakeFiles/volk.dir/volk_prefs.c.o
  915. [ 10%] Shebangin test_file_tags.py
  916. [ 10%] [ 10%] Building C object volk/lib/CMakeFiles/volk.dir/volk_rank_archs.c.o
  917. Shebangin uhd_burst_detector.py
  918. [ 10%] [ 10%] Built target pygen_gnuradio_core_src_examples_tags_b5e85
  919. Building C object volk/lib/CMakeFiles/volk.dir/volk.c.o
  920. Scanning dependencies of target pygen_gnuradio_core_src_examples_volk_benchmark_e8e8b
  921. [ 10%] Shebangin volk_math.py
  922. [ 10%] Shebangin volk_plot.py
  923. [ 10%] Shebangin volk_test_funcs.py
  924. [ 10%] Shebangin volk_types.py
  925. [ 10%] Built target pygen_gnuradio_core_src_examples_volk_benchmark_e8e8b
  926. Scanning dependencies of target pygen_grc_0d093
  927. [ 10%] Generating __init__.pyc
  928. [ 10%] Generating __init__.pyo
  929. [ 10%] Built target pygen_grc_0d093
  930. [ 10%] Building C object volk/lib/CMakeFiles/volk.dir/volk_cpu.c.o
  931. /tmp/gnuradio-qTEC/gnuradio-3.6.5.1/gruel/src/lib/thread.cc: In function ‘_opaque_pthread_t* gruel::get_current_thread_id()’:
  932. /tmp/gnuradio-qTEC/gnuradio-3.6.5.1/gruel/src/lib/thread.cc:106: warning: control reaches end of non-void function
  933. [ 10%] Building C object volk/lib/CMakeFiles/volk.dir/volk_machines.c.o
  934. [ 10%] Building C object volk/lib/CMakeFiles/volk.dir/volk_machine_generic_orc.c.o
  935. [ 10%] Building CXX object gruel/src/lib/CMakeFiles/gruel.dir/thread_group.cc.o
  936. [ 10%] Building C object volk/lib/CMakeFiles/volk.dir/volk_machine_sse2_64_mmx_orc.c.o
  937. [ 10%] Building C object volk/lib/CMakeFiles/volk.dir/volk_machine_sse3_64_orc.c.o
  938. Scanning dependencies of target pygen_grc_base_445fb
  939. [ 10%] Generating odict.pyc, ParseXML.pyc, Block.pyc, Connection.pyc, Constants.pyc, Element.pyc, FlowGraph.pyc, Param.pyc, Platform.pyc, Port.pyc, __init__.pyc
  940. [ 10%] Generating odict.pyo, ParseXML.pyo, Block.pyo, Connection.pyo, Constants.pyo, Element.pyo, FlowGraph.pyo, Param.pyo, Platform.pyo, Port.pyo, __init__.pyo
  941. [ 10%] Built target pygen_grc_base_445fb
  942. [ 10%] Building C object volk/lib/CMakeFiles/volk.dir/volk_machine_ssse3_64_orc.c.o
  943. [ 10%] Building C object volk/lib/CMakeFiles/volk.dir/volk_machine_sse4_1_64_orc.c.o
  944. Scanning dependencies of target pygen_grc_grc_gnuradio_5451c
  945. [ 10%] Generating __init__.pyc
  946. [ 10%] Generating __init__.pyo
  947. [ 10%] Built target pygen_grc_grc_gnuradio_5451c
  948. Scanning dependencies of target pygen_grc_grc_gnuradio_de44a
  949. [ 10%] Generating blks2/__init__.pyc, blks2/error_rate.pyc, blks2/packet.pyc, blks2/selector.pyc, blks2/tcp.pyc
  950. [ 10%] Generating blks2/__init__.pyo, blks2/error_rate.pyo, blks2/packet.pyo, blks2/selector.pyo, blks2/tcp.pyo
  951. [ 10%] Built target pygen_grc_grc_gnuradio_de44a
  952. Scanning dependencies of target pygen_grc_gui_dcd8a
  953. [ 10%] Generating Block.pyc, Colors.pyc, Constants.pyc, Connection.pyc, Element.pyc, FlowGraph.pyc, Param.pyc, Platform.pyc, Port.pyc, Utils.pyc, ActionHandler.pyc, Actions.pyc, Bars.pyc, BlockTreeWindow.pyc, Dialogs.pyc, DrawingArea.pyc, FileDialogs.pyc, MainWindow.pyc, Messages.pyc, NotebookPage.pyc, PropsDialog.pyc, Preferences.pyc, StateCache.pyc, __init__.pyc
  954. Scanning dependencies of target pygen_grc_python_fddd8
  955. [ 10%] Generating convert_hier.pyc, expr_utils.pyc, extract_docs.pyc, Block.pyc, Connection.pyc, Constants.pyc, FlowGraph.pyc, Generator.pyc, Param.pyc, Platform.pyc, Port.pyc, __init__.pyc
  956. [ 10%] Generating Block.pyo, Colors.pyo, Constants.pyo, Connection.pyo, Element.pyo, FlowGraph.pyo, Param.pyo, Platform.pyo, Port.pyo, Utils.pyo, ActionHandler.pyo, Actions.pyo, Bars.pyo, BlockTreeWindow.pyo, Dialogs.pyo, DrawingArea.pyo, FileDialogs.pyo, MainWindow.pyo, Messages.pyo, NotebookPage.pyo, PropsDialog.pyo, Preferences.pyo, StateCache.pyo, __init__.pyo
  957. [ 10%] Generating convert_hier.pyo, expr_utils.pyo, extract_docs.pyo, Block.pyo, Connection.pyo, Constants.pyo, FlowGraph.pyo, Generator.pyo, Param.pyo, Platform.pyo, Port.pyo, __init__.pyo
  958. [ 10%] Built target pygen_grc_gui_dcd8a
  959. [ 10%] Built target pygen_grc_python_fddd8
  960. Scanning dependencies of target pygen_grc_scripts_13f9a
  961. Scanning dependencies of target blocks_generated_includes
  962. [ 10%] Shebangin gnuradio-companion
  963. [ 10%] Generating add_ss.h, add_ii.h, add_cc.h
  964. [ 10%] Built target pygen_grc_scripts_13f9a
  965. [ 10%] Scanning dependencies of target pygen_gr_blocks_python_4db30
  966. Generating add_const_ss.h, add_const_ii.h, add_const_ff.h, add_const_cc.h
  967. [ 10%] Generating __init__.pyc, parse_file_metadata.pyc
  968. [ 10%] Generating add_const_vss.h, add_const_vii.h, add_const_vff.h, add_const_vcc.h
  969. [ 10%] Generating __init__.pyo, parse_file_metadata.pyo
  970. [ 10%] Linking C shared library libvolk.dylib
  971. [ 10%] Built target pygen_gr_blocks_python_4db30
  972. Generating and_bb.h, and_ss.h, and_ii.h
  973. [ 10%] Generating and_const_bb.h, and_const_ss.h, and_const_ii.h
  974. [ 10%] [ 10%] Built target volk
  975. Generating argmax_fs.h, argmax_is.h, argmax_ss.h
  976. Scanning dependencies of target blocks_swig0_swig_doc
  977. Scanning dependencies of target blocks_swig1_swig_doc
  978. [ 10%] [ 10%] Built target blocks_swig1_swig_doc
  979. Built target blocks_swig0_swig_doc
  980. Scanning dependencies of target pygen_gr_blocks_swig_144d6
  981. Scanning dependencies of target blocks_swig2_swig_doc
  982. [ 10%] [ 11%] [ 11%] Built target blocks_swig2_swig_doc
  983. Generating blocks_swig.pyc
  984. Generating divide_ss.h, divide_ii.h, divide_ff.h, divide_cc.h
  985. Scanning dependencies of target fft_swig_swig_doc
  986. [ 11%] Built target fft_swig_swig_doc
  987. Scanning dependencies of target pygen_gr_fft_python_8ed1a
  988. [ 11%] [ 12%] [ 12%] Generating blocks_swig.pyo
  989. Generating __init__.pyc
  990. Generating integrate_ss.h, integrate_ii.h, integrate_ff.h, integrate_cc.h
  991. [ 12%] [ 12%] Built target pygen_gr_blocks_swig_144d6
  992. [ 12%] Generating __init__.pyo
  993. Generating max_ff.h, max_ii.h, max_ss.h
  994. Scanning dependencies of target filter_generated_includes
  995. [ 12%] Generating fir_filter_ccc.h, fir_filter_ccf.h, fir_filter_fcc.h, fir_filter_fff.h, fir_filter_fsf.h, fir_filter_scc.h
  996. [ 12%] Built target pygen_gr_fft_python_8ed1a
  997. [ 12%] Scanning dependencies of target filter_swig_swig_doc
  998. Generating moving_average_ss.h, moving_average_ii.h, moving_average_ff.h, moving_average_cc.h
  999. [ 12%] Built target filter_swig_swig_doc
  1000. [ 12%] Generating freq_xlating_fir_filter_ccc.h, freq_xlating_fir_filter_ccf.h, freq_xlating_fir_filter_fcc.h, freq_xlating_fir_filter_fcf.h, freq_xlating_fir_filter_scf.h, freq_xlating_fir_filter_scc.h
  1001. Scanning dependencies of target pygen_gr_filter_python_b4798
  1002. [ 12%] Generating __init__.pyc, optfir.pyc, pfb.pyc, rational_resampler.pyc
  1003. [ 12%] Generating multiply_ss.h, multiply_ii.h
  1004. [ 12%] Generating interp_fir_filter_ccc.h, interp_fir_filter_ccf.h, interp_fir_filter_fcc.h, interp_fir_filter_fff.h, interp_fir_filter_fsf.h, interp_fir_filter_scc.h
  1005. [ 13%] [ 13%] Generating __init__.pyo, optfir.pyo, pfb.pyo, rational_resampler.pyo
  1006. [ 13%] Generating multiply_const_ss.h, multiply_const_ii.h
  1007. Generating rational_resampler_base_ccc.h, rational_resampler_base_ccf.h, rational_resampler_base_fcc.h, rational_resampler_base_fff.h, rational_resampler_base_fsf.h, rational_resampler_base_scc.h
  1008. [ 13%] Built target pygen_gr_filter_python_b4798
  1009. [ 13%] [ 13%] Built target filter_generated_includes
  1010. Scanning dependencies of target pygen_gr_filter_examples_94485
  1011. Generating multiply_const_vss.h, multiply_const_vii.h, multiply_const_vff.h, multiply_const_vcc.h
  1012. [ 13%] Linking CXX shared library libgruel.dylib
  1013. [ 13%] Generating mute_ss.h, mute_ii.h, mute_ff.h, mute_cc.h
  1014. Shebangin channelize.py
  1015. [ 13%] Generating not_bb.h, not_ss.h, not_ii.h
  1016. [ 13%] [ 13%] Shebangin chirp_channelize.py
  1017. Generating or_bb.h, or_ss.h, or_ii.h
  1018. [ 13%] Built target gruel
  1019. [ 13%] Scanning dependencies of target atsci_viterbi_gen
  1020. [ 13%] Generating peak_detector_fb.h, peak_detector_ib.h, peak_detector_sb.h
  1021. [ 13%] [ 13%] Shebangin decimate.py
  1022. Generating probe_signal_b.h, probe_signal_s.h, probe_signal_i.h, probe_signal_f.h, probe_signal_c.h
  1023. Building CXX object gr-atsc/src/lib/CMakeFiles/atsci_viterbi_gen.dir/atsci_viterbi_gen.cc.o
  1024. [ 13%] Scanning dependencies of target atsc_swig_doc
  1025. [ 13%] Shebangin fft_filter_ccc.py
  1026. [ 13%] Generating probe_signal_vb.h, probe_signal_vs.h, probe_signal_vi.h, probe_signal_vf.h, probe_signal_vc.h
  1027. Built target atsc_swig_doc
  1028. Scanning dependencies of target pygen_gr_atsc_src_python_2da2e
  1029. [ 13%] [ 13%] Shebangin btl-fsd.py
  1030. Shebangin fir_filter_ccc.py
  1031. [ 13%] Generating sample_and_hold_bb.h, sample_and_hold_ss.h, sample_and_hold_ii.h, sample_and_hold_ff.h
  1032. [ 13%] [ 14%] Shebangin fir_filter_fff.py
  1033. Shebangin fpll.py
  1034. [ 14%] Generating sub_ss.h, sub_ii.h, sub_ff.h, sub_cc.h
  1035. [ 14%] [ 14%] Shebangin fmtest.py
  1036. Shebangin interp.py
  1037. [ 14%] [ 14%] [ 14%] Generating xor_bb.h, xor_ss.h, xor_ii.h
  1038. Shebangin xlate.py
  1039. Shebangin interpolate.py
  1040. [ 14%] [ 14%] [ 14%] Shebangin viterbi-out.py
  1041. Shebangin reconstruction.py
  1042. Generating packed_to_unpacked_bb.h, packed_to_unpacked_ss.h, packed_to_unpacked_ii.h
  1043. [ 14%] Built target pygen_gr_atsc_src_python_2da2e
  1044. [ 14%] [ 14%] Generating unpacked_to_packed_bb.h, unpacked_to_packed_ss.h, unpacked_to_packed_ii.h
  1045. Shebangin resampler.py
  1046. Scanning dependencies of target audio_swig_swig_doc
  1047. [ 14%] Built target audio_swig_swig_doc
  1048. Scanning dependencies of target pygen_gr_audio_swig_9d054
  1049. [ 14%] [ 14%] Shebangin synth_filter.py
  1050. [ 14%] Generating __init__.pyc
  1051. Generating vector_insert_b.h, vector_insert_s.h, vector_insert_i.h, vector_insert_f.h, vector_insert_c.h
  1052. Linking CXX executable atsci_viterbi_gen
  1053. [ 14%] [ 14%] Shebangin synth_to_chan.py
  1054. [ 15%] Generating __init__.pyo
  1055. Generating vector_sink_b.h, vector_sink_s.h, vector_sink_i.h, vector_sink_f.h, vector_sink_c.h
  1056. [ 15%] Built target atsci_viterbi_gen
  1057. [ 15%] Built target pygen_gr_filter_examples_94485
  1058. [ 15%] Scanning dependencies of target pygen_gr_audio_examples_python_0f2c7
  1059. Scanning dependencies of target analog_generated_includes
  1060. Built target pygen_gr_audio_swig_9d054
  1061. [ 15%] [ 15%] [ 15%] Generating vector_source_b.h, vector_source_s.h, vector_source_i.h, vector_source_f.h, vector_source_c.h
  1062. Scanning dependencies of target analog_swig_swig_doc
  1063. Shebangin audio_copy.py
  1064. Generating noise_source_s.h, noise_source_i.h, noise_source_f.h, noise_source_c.h
  1065. [ 15%] Built target analog_swig_swig_doc
  1066. Scanning dependencies of target pygen_gr_analog_python_d7f41
  1067. [ 15%] [ 15%] Generating __init__.pyc
  1068. [ 15%] Shebangin audio_fft.py
  1069. [ 15%] Built target blocks_generated_includes
  1070. Generating sig_source_s.h, sig_source_i.h, sig_source_f.h, sig_source_c.h
  1071. Scanning dependencies of target pygen_gr_analog_examples_be2dd
  1072. [ 15%] Built target pygen_gr_analog_examples_be2dd
  1073. [ 15%] [ 15%] Generating __init__.pyo
  1074. Scanning dependencies of target digital_generated_swigs
  1075. Shebangin audio_play.py
  1076. [ 15%] Built target analog_generated_includes
  1077. [ 15%] Generating digital_chunks_to_symbols_bf.i, digital_chunks_to_symbols_bc.i, digital_chunks_to_symbols_sf.i, digital_chunks_to_symbols_sc.i, digital_chunks_to_symbols_if.i, digital_chunks_to_symbols_ic.i
  1078. Scanning dependencies of target digital_generated_includes
  1079. [ 15%] [ 15%] Generating digital_chunks_to_symbols_bf.h, digital_chunks_to_symbols_bc.h, digital_chunks_to_symbols_sf.h, digital_chunks_to_symbols_sc.h, digital_chunks_to_symbols_if.h, digital_chunks_to_symbols_ic.h
  1080. [ 15%] Shebangin audio_to_file.py
  1081. Built target pygen_gr_analog_python_d7f41
  1082. Scanning dependencies of target digital_swig_swig_doc
  1083. [ 15%] Built target digital_generated_swigs
  1084. [ 15%] Built target digital_swig_swig_doc
  1085. Scanning dependencies of target pygen_gr_digital_python_8f0fb
  1086. [ 15%] Scanning dependencies of target pygen_gr_digital_python_b6bbf
  1087. Shebangin dial_tone.py
  1088. [ 15%] [ 15%] Built target digital_generated_includes
  1089. [ 15%] Generating utils/__init__.pyc, utils/gray_code.pyc, utils/mod_codes.pyc, utils/alignment.pyc, utils/tagged_streams.pyc
  1090. Generating __init__.pyc, bpsk.pyc, cpm.pyc, crc.pyc, generic_mod_demod.pyc, gmsk.pyc, gfsk.pyc, modulation_utils.pyc, ofdm.pyc, ofdm_packet_utils.pyc, ofdm_receiver.pyc, ofdm_sync_fixed.pyc, ofdm_sync_ml.pyc, ofdm_sync_pnac.pyc, ofdm_sync_pn.pyc, ofdm_txrx.pyc, packet_utils.pyc, pkt.pyc, psk.pyc, qam.pyc, qamlike.pyc, qpsk.pyc
  1091. Scanning dependencies of target pygen_gr_digital_examples_136a4
  1092. [ 16%] Shebangin example_costas.py
  1093. [ 16%] Shebangin dial_tone_daemon.py
  1094. [ 16%] Generating utils/__init__.pyo, utils/gray_code.pyo, utils/mod_codes.pyo, utils/alignment.pyo, utils/tagged_streams.pyo
  1095. [ 16%] Shebangin example_fll.py
  1096. [ 16%] Shebangin dial_tone_wav.py
  1097. [ 16%] [ 16%] Shebangin example_timing.py
  1098. Built target pygen_gr_digital_python_8f0fb
  1099. [ 16%] Scanning dependencies of target pygen_gr_digital_examples_b1437
  1100. Shebangin mono_tone.py
  1101. [ 16%] [ 16%] Generating __init__.pyo, bpsk.pyo, cpm.pyo, crc.pyo, generic_mod_demod.pyo, gmsk.pyo, gfsk.pyo, modulation_utils.pyo, ofdm.pyo, ofdm_packet_utils.pyo, ofdm_receiver.pyo, ofdm_sync_fixed.pyo, ofdm_sync_ml.pyo, ofdm_sync_pnac.pyo, ofdm_sync_pn.pyo, ofdm_txrx.pyo, packet_utils.pyo, pkt.pyo, psk.pyo, qam.pyo, qamlike.pyo, qpsk.pyo
  1102. Shebangin benchmark_add_channel.py
  1103. [ 16%] Shebangin run_length.py
  1104. [ 16%] Shebangin multi_tone.py
  1105. [ 16%] [ 16%] Shebangin benchmark_rx.py
  1106. Shebangin gen_whitener.py
  1107. [ 16%] Shebangin noise.py
  1108. [ 16%] [ 16%] Shebangin snr_estimators.py
  1109. Shebangin benchmark_tx.py
  1110. [ 16%] Shebangin spectrum_inversion.py
  1111. [ 16%] Built target pygen_gr_digital_python_b6bbf
  1112. [ 16%] [ 16%] Built target pygen_gr_digital_examples_136a4
  1113. Scanning dependencies of target pygen_gr_digital_examples_b6317
  1114. Shebangin gr_plot_ofdm.py
  1115. [ 16%] Shebangin test_resampler.py
  1116. [ 16%] Shebangin transmit_path.py
  1117. Scanning dependencies of target noaa_swig_swig_doc
  1118. [ 16%] [ 16%] [ 16%] Built target pygen_gr_audio_examples_python_0f2c7
  1119. Built target noaa_swig_swig_doc
  1120. Shebangin ofdm_mod_demod_test.py
  1121. [ 16%] Scanning dependencies of target pygen_gr_pager_python_3b5c8
  1122. Scanning dependencies of target pygen_gr_noaa_swig_c7866
  1123. Shebangin receive_path.py
  1124. [ 16%] [ 16%] Generating __init__.pyc, pager_utils.pyc, flex_demod.pyc
  1125. Generating __init__.pyc
  1126. [ 16%] Shebangin receive_path.py
  1127. [ 16%] Shebangin uhd_interface.py
  1128. [ 16%] [ 16%] Generating __init__.pyo, pager_utils.pyo, flex_demod.pyo
  1129. Generating __init__.pyo
  1130. [ 16%] Shebangin transmit_path.py
  1131. [ 16%] Shebangin benchmark_tx.py
  1132. [ 16%] [ 16%] Built target pygen_gr_pager_python_3b5c8
  1133. Built target pygen_gr_noaa_swig_c7866
  1134. [ 16%] Scanning dependencies of target pager_swig_swig_doc
  1135. Scanning dependencies of target pygen_gr_pager_apps_736b7
  1136. Shebangin tunnel.py
  1137. [ 16%] [ 16%] Built target pager_swig_swig_doc
  1138. [ 16%] Shebangin usrp_flex
  1139. Scanning dependencies of target qtgui_swig_swig_doc
  1140. Shebangin benchmark_rx.py
  1141. [ 16%] Built target qtgui_swig_swig_doc
  1142. [ 16%] Scanning dependencies of target pygen_gr_qtgui_python_469e8
  1143. Shebangin uhd_interface.py
  1144. [ 16%] [ 16%] Shebangin usrp_flex_all
  1145. [ 17%] Generating __init__.pyc
  1146. Shebangin tx_voice.py
  1147. [ 17%] Built target pygen_gr_digital_examples_b1437
  1148. [ 17%] Shebangin usrp_flex_band
  1149. [ 17%] Scanning dependencies of target pygen_gr_qtgui_examples_f7c55
  1150. [ 17%] Shebangin rx_voice.py
  1151. Generating __init__.pyo
  1152. [ 17%] Shebangin pyqt_example_c.py
  1153. [ 17%] Built target pygen_gr_pager_apps_736b7
  1154. [ 17%] Scanning dependencies of target trellis_swig_doc
  1155. [ 17%] [ 17%] Built target pygen_gr_qtgui_python_469e8
  1156. Shebangin digital_bert_rx.py
  1157. Shebangin pyqt_example_f.py
  1158. [ 17%] [ 17%] Built target trellis_swig_doc
  1159. Shebangin digital_bert_tx.py
  1160. Scanning dependencies of target gr_trellis_xml
  1161. [ 17%] [ 17%] [ 17%] Shebangin tunnel.py
  1162. Generating test_tcm.py.xml
  1163. Shebangin pyqt_time_c.py
  1164. Scanning dependencies of target pygen_gr_trellis_src_examples_python_88424
  1165. [ 17%] Shebangin fsm_utils.py
  1166. [ 17%] Built target pygen_gr_digital_examples_b6317
  1167. [ 17%] Scanning dependencies of target pygen_gr_utils_src_python_44da4
  1168. Shebangin pyqt_time_f.py
  1169. [ 17%] [ 17%] Generating test_viterbi_equalization1.py.xml
  1170. [ 17%] Shebangin test_tcm.py
  1171. Generating plot_data.pyc, plot_fft_base.pyc, plot_psd_base.pyc, pyqt_plot.pyc, pyqt_filter.pyc
  1172. [ 17%] Built target pygen_gr_qtgui_examples_f7c55
  1173. Scanning dependencies of target pygen_gr_utils_src_python_a7130
  1174. [ 17%] [ 17%] Shebangin test_tcm_parallel.py
  1175. [ 17%] Built target gr_trellis_xml
  1176. Shebangin gr_modtool
  1177. [ 17%] Shebangin gr_plot_char
  1178. [ 17%] Generating plot_data.pyo, plot_fft_base.pyo, plot_psd_base.pyo, pyqt_plot.pyo, pyqt_filter.pyo
  1179. [ 17%] Scanning dependencies of target pygen_gr_utils_src_python_modtool_c4ed8
  1180. [ 17%] Shebangin test_tcm_combined.py
  1181. [ 17%] Shebangin gr_plot_const
  1182. Generating __init__.pyc, cmakefile_editor.pyc, code_generator.pyc, grc_xml_generator.pyc, modtool_add.pyc, modtool_base.pyc, modtool_disable.pyc, modtool_help.pyc, modtool_info.pyc, modtool_makexml.pyc, modtool_newmod.pyc, modtool_rm.pyc, parser_cc_block.pyc, templates.pyc, util_functions.pyc
  1183. [ 17%] Built target pygen_gr_utils_src_python_44da4
  1184. Scanning dependencies of target video_sdl_swig_doc
  1185. [ 17%] Shebangin test_sccc_hard.py
  1186. [ 17%] [ 17%] Built target video_sdl_swig_doc
  1187. Shebangin gr_plot_fft
  1188. Scanning dependencies of target generate_codebook
  1189. [ 17%] [ 17%] Building C object gr-vocoder/lib/CMakeFiles/generate_codebook.dir/codec2/generate_codebook.c.o
  1190. [ 17%] Generating __init__.pyo, cmakefile_editor.pyo, code_generator.pyo, grc_xml_generator.pyo, modtool_add.pyo, modtool_base.pyo, modtool_disable.pyo, modtool_help.pyo, modtool_info.pyo, modtool_makexml.pyo, modtool_newmod.pyo, modtool_rm.pyo, parser_cc_block.pyo, templates.pyo, util_functions.pyo
  1191. Shebangin test_sccc_soft.py
  1192. [ 17%] Shebangin gr_plot_fft_c
  1193. [ 17%] Shebangin test_sccc_turbo.py
  1194. [ 17%] Shebangin gr_plot_fft_f
  1195. Linking C executable generate_codebook
  1196. [ 17%] Built target pygen_gr_utils_src_python_modtool_c4ed8
  1197. Scanning dependencies of target vocoder_swig_swig_doc
  1198. [ 17%] Shebangin test_viterbi_equalization1.py
  1199. [ 17%] Built target vocoder_swig_swig_doc
  1200. [ 17%] [ 17%] Shebangin gr_plot_psd
  1201. Built target generate_codebook
  1202. [ 17%] Scanning dependencies of target pygen_gr_vocoder_python_8eabd
  1203. [ 17%] Shebangin gr_plot_psd_c
  1204. [ 18%] Generating __init__.pyc, cvsd.pyc
  1205. Shebangin test_viterbi_equalization.py
  1206. [ 19%] Shebangin gr_plot_psd_f
  1207. [ 19%] Shebangin gr_plot_float
  1208. [ 19%] [ 19%] Shebangin test_turbo_equalization.py
  1209. Generating __init__.pyo, cvsd.pyo
  1210. [ 19%] Shebangin gr_plot_int
  1211. [ 19%] Shebangin gr_plot_iq
  1212. [ 19%] [ 19%] [ 19%] Shebangin test_turbo_equalization1.py
  1213. Built target pygen_gr_vocoder_python_8eabd
  1214. Shebangin gr_plot_short
  1215. Scanning dependencies of target pygen_gr_vocoder_examples_186b7
  1216. [ 19%] [ 19%] Shebangin gr_plot_qt
  1217. Shebangin alaw_audio_loopback.py
  1218. [ 19%] Shebangin test_turbo_equalization2.py
  1219. [ 19%] Shebangin gr_filter_design
  1220. [ 19%] Shebangin gr_read_file_metadata
  1221. [ 19%] [ 19%] Built target pygen_gr_trellis_src_examples_python_88424
  1222. Shebangin codec2_audio_loopback.py
  1223. [ 19%] [ 19%] Shebangin cvsd_audio_loopback.py
  1224. Shebangin grcc
  1225. Scanning dependencies of target fcd_swig_swig_doc
  1226. [ 19%] [ 19%] Built target fcd_swig_swig_doc
  1227. Shebangin g721_audio_loopback.py
  1228. [ 19%] Built target pygen_gr_utils_src_python_a7130
  1229. Scanning dependencies of target pygen_gr_fcd_python_19b9a
  1230. Scanning dependencies of target wavelet_swig_swig_doc
  1231. Scanning dependencies of target pygen_gr_wavelet_python_0b8b3
  1232. [ 19%] [ 19%] Built target wavelet_swig_swig_doc
  1233. Generating __init__.pyc
  1234. [ 19%] Scanning dependencies of target pygen_gr_wxgui_grc_2e6a3
  1235. Generating __init__.pyc
  1236. [ 20%] [ 20%] Shebangin g723_24_audio_loopback.py
  1237. Generating __init__.pyc, panel.pyc, top_block_gui.pyc
  1238. [ 20%] Generating __init__.pyo
  1239. [ 20%] [ 20%] Generating __init__.pyo
  1240. Shebangin g723_40_audio_loopback.py
  1241. [ 20%] Generating __init__.pyo, panel.pyo, top_block_gui.pyo
  1242. [ 20%] Built target pygen_gr_fcd_python_19b9a
  1243. [ 20%] [ 20%] Shebangin gsm_audio_loopback.py
  1244. Built target pygen_gr_wavelet_python_0b8b3
  1245. [ 20%] Scanning dependencies of target pygen_gr_wxgui_src_python_b53eb
  1246. Built target pygen_gr_wxgui_grc_2e6a3
  1247. Scanning dependencies of target pygen_gr_wxgui_src_python_d7ba1
  1248. [ 20%] Scanning dependencies of target pygen_gr_wxgui_src_python_e8edb
  1249. [ 20%] Generating __init__.pyc, common.pyc, constants.pyc, constsink_gl.pyc, const_window.pyc, form.pyc, fftsink2.pyc, fftsink_nongl.pyc, fftsink_gl.pyc, fft_window.pyc, gui.pyc, histosink_gl.pyc, histo_window.pyc, numbersink2.pyc, number_window.pyc, plot.pyc, powermate.pyc, pubsub.pyc, scopesink2.pyc, scopesink_nongl.pyc, scopesink_gl.pyc, scope_window.pyc, termsink.pyc, waterfallsink2.pyc, waterfallsink_nongl.pyc, waterfallsink_gl.pyc, waterfall_window.pyc, slider.pyc, stdgui2.pyc
  1250. Generating forms/__init__.pyc, forms/forms.pyc, forms/converters.pyc
  1251. [ 20%] [ 20%] Generating plotter/__init__.pyc, plotter/bar_plotter.pyc, plotter/channel_plotter.pyc, plotter/common.pyc, plotter/gltext.pyc, plotter/grid_plotter_base.pyc, plotter/plotter_base.pyc, plotter/waterfall_plotter.pyc
  1252. Shebangin ulaw_audio_loopback.py
  1253. [ 20%] Generating forms/__init__.pyo, forms/forms.pyo, forms/converters.pyo
  1254. [ 20%] [ 20%] Built target pygen_gr_vocoder_examples_186b7
  1255. Generating plotter/__init__.pyo, plotter/bar_plotter.pyo, plotter/channel_plotter.pyo, plotter/common.pyo, plotter/gltext.pyo, plotter/grid_plotter_base.pyo, plotter/plotter_base.pyo, plotter/waterfall_plotter.pyo
  1256. Scanning dependencies of target test_all
  1257. [ 21%] [ 21%] Built target pygen_gr_wxgui_src_python_d7ba1
  1258. Generating __init__.pyo, common.pyo, constants.pyo, constsink_gl.pyo, const_window.pyo, form.pyo, fftsink2.pyo, fftsink_nongl.pyo, fftsink_gl.pyo, fft_window.pyo, gui.pyo, histosink_gl.pyo, histo_window.pyo, numbersink2.pyo, number_window.pyo, plot.pyo, powermate.pyo, pubsub.pyo, scopesink2.pyo, scopesink_nongl.pyo, scopesink_gl.pyo, scope_window.pyo, termsink.pyo, waterfallsink2.pyo, waterfallsink_nongl.pyo, waterfallsink_gl.pyo, waterfall_window.pyo, slider.pyo, stdgui2.pyo
  1259. Scanning dependencies of target volk_profile
  1260. [ 21%] Built target pygen_gr_wxgui_src_python_e8edb
  1261. Scanning dependencies of target test_gruel
  1262. [ 21%] Built target pygen_gr_wxgui_src_python_b53eb
  1263. [ 21%] Scanning dependencies of target _pmt_swig_swig_tag
  1264. Building CXX object gruel/src/lib/CMakeFiles/test_gruel.dir/pmt/qa_pmt_unv.cc.o
  1265. [ 21%] Building CXX object gruel/src/swig/CMakeFiles/_pmt_swig_swig_tag.dir/_pmt_swig_swig_tag.cpp.o
  1266. Linking CXX executable _pmt_swig_swig_tag
  1267. [ 21%] [ 21%] Building CXX object volk/lib/CMakeFiles/test_all.dir/testqa.cc.o
  1268. Building CXX object volk/apps/CMakeFiles/volk_profile.dir/volk_profile.cc.o
  1269. [ 21%] Built target _pmt_swig_swig_tag
  1270. [ 21%] Generating gengen/gr_peak_detector_fb.cc, gengen/gr_peak_detector_ib.cc, gengen/gr_peak_detector_sb.cc
  1271. [ 21%] Generating gengen/gr_vector_source_b.cc, gengen/gr_vector_source_s.cc, gengen/gr_vector_source_i.cc, gengen/gr_vector_source_f.cc, gengen/gr_vector_source_c.cc
  1272. [ 22%] Generating gengen/gr_vector_insert_b.cc
  1273. [ 22%] Generating gengen/gr_vector_sink_b.cc, gengen/gr_vector_sink_s.cc, gengen/gr_vector_sink_i.cc, gengen/gr_vector_sink_f.cc, gengen/gr_vector_sink_c.cc
  1274. [ 22%] Generating gengen/gr_noise_source_s.cc, gengen/gr_noise_source_i.cc, gengen/gr_noise_source_f.cc, gengen/gr_noise_source_c.cc
  1275. [ 22%] Generating gengen/gr_fastnoise_source_s.cc, gengen/gr_fastnoise_source_i.cc, gengen/gr_fastnoise_source_f.cc, gengen/gr_fastnoise_source_c.cc
  1276. [ 22%] Generating gengen/gr_sig_source_s.cc, gengen/gr_sig_source_i.cc, gengen/gr_sig_source_f.cc, gengen/gr_sig_source_c.cc
  1277. [ 22%] Generating gengen/gr_probe_signal_b.cc, gengen/gr_probe_signal_s.cc, gengen/gr_probe_signal_i.cc, gengen/gr_probe_signal_f.cc, gengen/gr_probe_signal_c.cc
  1278. [ 22%] Generating gengen/gr_probe_signal_vb.cc, gengen/gr_probe_signal_vs.cc, gengen/gr_probe_signal_vi.cc, gengen/gr_probe_signal_vf.cc, gengen/gr_probe_signal_vc.cc
  1279. [ 22%] Generating gengen/gr_add_const_bb.cc, gengen/gr_add_const_ss.cc, gengen/gr_add_const_ii.cc, gengen/gr_add_const_ff.cc, gengen/gr_add_const_cc.cc, gengen/gr_add_const_sf.cc
  1280. [ 22%] Generating gengen/gr_multiply_const_ss.cc, gengen/gr_multiply_const_ii.cc
  1281. [ 22%] Generating gengen/gr_add_ss.cc, gengen/gr_add_ii.cc, gengen/gr_add_cc.cc
  1282. [ 22%] Generating gengen/gr_sub_ss.cc, gengen/gr_sub_ii.cc, gengen/gr_sub_ff.cc, gengen/gr_sub_cc.cc
  1283. [ 22%] Generating gengen/gr_multiply_ss.cc, gengen/gr_multiply_ii.cc
  1284. [ 22%] Generating gengen/gr_divide_ss.cc, gengen/gr_divide_ii.cc, gengen/gr_divide_ff.cc, gengen/gr_divide_cc.cc
  1285. [ 22%] Generating gengen/gr_mute_ss.cc, gengen/gr_mute_ii.cc, gengen/gr_mute_ff.cc, gengen/gr_mute_cc.cc
  1286. [ 22%] Generating gengen/gr_add_const_vss.cc, gengen/gr_add_const_vii.cc, gengen/gr_add_const_vff.cc, gengen/gr_add_const_vcc.cc
  1287. [ 22%] Generating gengen/gr_multiply_const_vss.cc, gengen/gr_multiply_const_vii.cc, gengen/gr_multiply_const_vff.cc, gengen/gr_multiply_const_vcc.cc
  1288. [ 22%] Generating gengen/gr_integrate_ss.cc, gengen/gr_integrate_ii.cc, gengen/gr_integrate_ff.cc, gengen/gr_integrate_cc.cc
  1289. [ 22%] Generating gengen/gr_moving_average_ss.cc, gengen/gr_moving_average_ii.cc, gengen/gr_moving_average_ff.cc, gengen/gr_moving_average_cc.cc
  1290. [ 22%] Generating gengen/gr_chunks_to_symbols_bf.cc, gengen/gr_chunks_to_symbols_bc.cc, gengen/gr_chunks_to_symbols_sf.cc, gengen/gr_chunks_to_symbols_sc.cc, gengen/gr_chunks_to_symbols_if.cc, gengen/gr_chunks_to_symbols_ic.cc
  1291. [ 23%] Generating gengen/gr_unpacked_to_packed_bb.cc, gengen/gr_unpacked_to_packed_ss.cc, gengen/gr_unpacked_to_packed_ii.cc
  1292. [ 23%] Generating gengen/gr_packed_to_unpacked_bb.cc, gengen/gr_packed_to_unpacked_ss.cc, gengen/gr_packed_to_unpacked_ii.cc
  1293. [ 24%] Building CXX object volk/apps/CMakeFiles/volk_profile.dir/__/lib/qa_utils.cc.o
  1294. [ 24%] Generating gengen/gr_xor_bb.cc, gengen/gr_xor_ss.cc, gengen/gr_xor_ii.cc
  1295. [ 24%] [ 24%] Building CXX object gruel/src/lib/CMakeFiles/test_gruel.dir/pmt/qa_pmt_prims.cc.o
  1296. Generating gengen/gr_and_bb.cc, gengen/gr_and_ss.cc, gengen/gr_and_ii.cc
  1297. [ 24%] Generating gengen/gr_and_const_bb.cc, gengen/gr_and_const_ss.cc, gengen/gr_and_const_ii.cc
  1298. [ 24%] Generating gengen/gr_or_bb.cc, gengen/gr_or_ss.cc, gengen/gr_or_ii.cc
  1299. [ 24%] Generating gengen/gr_not_bb.cc, gengen/gr_not_ss.cc, gengen/gr_not_ii.cc
  1300. [ 24%] Generating gengen/gr_sample_and_hold_bb.cc, gengen/gr_sample_and_hold_ss.cc, gengen/gr_sample_and_hold_ii.cc, gengen/gr_sample_and_hold_ff.cc
  1301. [ 24%] Generating gengen/gr_argmax_fs.cc, gengen/gr_argmax_is.cc, gengen/gr_argmax_ss.cc
  1302. [ 24%] Generating gengen/gr_max_ff.cc, gengen/gr_max_ii.cc, gengen/gr_max_ss.cc
  1303. Scanning dependencies of target gnuradio-core
  1304. [ 24%] Building CXX object volk/lib/CMakeFiles/test_all.dir/qa_utils.cc.o
  1305. /tmp/gnuradio-qTEC/gnuradio-3.6.5.1/volk/lib/qa_utils.cc: In function ‘bool icompare(t*, t*, unsigned int, unsigned int) [with t = int64_t]’:
  1306. /tmp/gnuradio-qTEC/gnuradio-3.6.5.1/volk/lib/qa_utils.cc:405: instantiated from here
  1307. /tmp/gnuradio-qTEC/gnuradio-3.6.5.1/volk/lib/qa_utils.cc:237: warning: comparison between signed and unsigned integer expressions
  1308. /tmp/gnuradio-qTEC/gnuradio-3.6.5.1/volk/lib/qa_utils.cc: In function ‘bool icompare(t*, t*, unsigned int, unsigned int) [with t = uint64_t]’:
  1309. /tmp/gnuradio-qTEC/gnuradio-3.6.5.1/volk/lib/qa_utils.cc:407: instantiated from here
  1310. /tmp/gnuradio-qTEC/gnuradio-3.6.5.1/volk/lib/qa_utils.cc:237: warning: comparison between signed and unsigned integer expressions
  1311. /tmp/gnuradio-qTEC/gnuradio-3.6.5.1/volk/lib/qa_utils.cc: In function ‘bool icompare(t*, t*, unsigned int, unsigned int) [with t = int32_t]’:
  1312. /tmp/gnuradio-qTEC/gnuradio-3.6.5.1/volk/lib/qa_utils.cc:412: instantiated from here
  1313. /tmp/gnuradio-qTEC/gnuradio-3.6.5.1/volk/lib/qa_utils.cc:237: warning: comparison between signed and unsigned integer expressions
  1314. /tmp/gnuradio-qTEC/gnuradio-3.6.5.1/volk/lib/qa_utils.cc: In function ‘bool icompare(t*, t*, unsigned int, unsigned int) [with t = uint32_t]’:
  1315. /tmp/gnuradio-qTEC/gnuradio-3.6.5.1/volk/lib/qa_utils.cc:414: instantiated from here
  1316. /tmp/gnuradio-qTEC/gnuradio-3.6.5.1/volk/lib/qa_utils.cc:237: warning: comparison between signed and unsigned integer expressions
  1317. /tmp/gnuradio-qTEC/gnuradio-3.6.5.1/volk/lib/qa_utils.cc: In function ‘bool icompare(t*, t*, unsigned int, unsigned int) [with t = int16_t]’:
  1318. /tmp/gnuradio-qTEC/gnuradio-3.6.5.1/volk/lib/qa_utils.cc:419: instantiated from here
  1319. /tmp/gnuradio-qTEC/gnuradio-3.6.5.1/volk/lib/qa_utils.cc:237: warning: comparison between signed and unsigned integer expressions
  1320. /tmp/gnuradio-qTEC/gnuradio-3.6.5.1/volk/lib/qa_utils.cc: In function ‘bool icompare(t*, t*, unsigned int, unsigned int) [with t = uint16_t]’:
  1321. /tmp/gnuradio-qTEC/gnuradio-3.6.5.1/volk/lib/qa_utils.cc:421: instantiated from here
  1322. /tmp/gnuradio-qTEC/gnuradio-3.6.5.1/volk/lib/qa_utils.cc:237: warning: comparison between signed and unsigned integer expressions
  1323. /tmp/gnuradio-qTEC/gnuradio-3.6.5.1/volk/lib/qa_utils.cc: In function ‘bool icompare(t*, t*, unsigned int, unsigned int) [with t = int8_t]’:
  1324. /tmp/gnuradio-qTEC/gnuradio-3.6.5.1/volk/lib/qa_utils.cc:426: instantiated from here
  1325. /tmp/gnuradio-qTEC/gnuradio-3.6.5.1/volk/lib/qa_utils.cc:237: warning: comparison between signed and unsigned integer expressions
  1326. /tmp/gnuradio-qTEC/gnuradio-3.6.5.1/volk/lib/qa_utils.cc: In function ‘bool icompare(t*, t*, unsigned int, unsigned int) [with t = uint8_t]’:
  1327. /tmp/gnuradio-qTEC/gnuradio-3.6.5.1/volk/lib/qa_utils.cc:428: instantiated from here
  1328. /tmp/gnuradio-qTEC/gnuradio-3.6.5.1/volk/lib/qa_utils.cc:237: warning: comparison between signed and unsigned integer expressions
  1329. /tmp/gnuradio-qTEC/gnuradio-3.6.5.1/volk/lib/qa_utils.cc: In function ‘bool icompare(t*, t*, unsigned int, unsigned int) [with t = int64_t]’:
  1330. /tmp/gnuradio-qTEC/gnuradio-3.6.5.1/volk/lib/qa_utils.cc:405: instantiated from here
  1331. /tmp/gnuradio-qTEC/gnuradio-3.6.5.1/volk/lib/qa_utils.cc:237: warning: comparison between signed and unsigned integer expressions
  1332. /tmp/gnuradio-qTEC/gnuradio-3.6.5.1/volk/lib/qa_utils.cc: In function ‘bool icompare(t*, t*, unsigned int, unsigned int) [with t = uint64_t]’:
  1333. /tmp/gnuradio-qTEC/gnuradio-3.6.5.1/volk/lib/qa_utils.cc:407: instantiated from here
  1334. /tmp/gnuradio-qTEC/gnuradio-3.6.5.1/volk/lib/qa_utils.cc:237: warning: comparison between signed and unsigned integer expressions
  1335. /tmp/gnuradio-qTEC/gnuradio-3.6.5.1/volk/lib/qa_utils.cc: In function ‘bool icompare(t*, t*, unsigned int, unsigned int) [with t = int32_t]’:
  1336. /tmp/gnuradio-qTEC/gnuradio-3.6.5.1/volk/lib/qa_utils.cc:412: instantiated from here
  1337. /tmp/gnuradio-qTEC/gnuradio-3.6.5.1/volk/lib/qa_utils.cc:237: warning: comparison between signed and unsigned integer expressions
  1338. /tmp/gnuradio-qTEC/gnuradio-3.6.5.1/volk/lib/qa_utils.cc: In function ‘bool icompare(t*, t*, unsigned int, unsigned int) [with t = uint32_t]’:
  1339. /tmp/gnuradio-qTEC/gnuradio-3.6.5.1/volk/lib/qa_utils.cc:414: instantiated from here
  1340. /tmp/gnuradio-qTEC/gnuradio-3.6.5.1/volk/lib/qa_utils.cc:237: warning: comparison between signed and unsigned integer expressions
  1341. /tmp/gnuradio-qTEC/gnuradio-3.6.5.1/volk/lib/qa_utils.cc: In function ‘bool icompare(t*, t*, unsigned int, unsigned int) [with t = int16_t]’:
  1342. /tmp/gnuradio-qTEC/gnuradio-3.6.5.1/volk/lib/qa_utils.cc:419: instantiated from here
  1343. /tmp/gnuradio-qTEC/gnuradio-3.6.5.1/volk/lib/qa_utils.cc:237: warning: comparison between signed and unsigned integer expressions
  1344. /tmp/gnuradio-qTEC/gnuradio-3.6.5.1/volk/lib/qa_utils.cc: In function ‘bool icompare(t*, t*, unsigned int, unsigned int) [with t = uint16_t]’:
  1345. /tmp/gnuradio-qTEC/gnuradio-3.6.5.1/volk/lib/qa_utils.cc:421: instantiated from here
  1346. /tmp/gnuradio-qTEC/gnuradio-3.6.5.1/volk/lib/qa_utils.cc:237: warning: comparison between signed and unsigned integer expressions
  1347. /tmp/gnuradio-qTEC/gnuradio-3.6.5.1/volk/lib/qa_utils.cc: In function ‘bool icompare(t*, t*, unsigned int, unsigned int) [with t = int8_t]’:
  1348. /tmp/gnuradio-qTEC/gnuradio-3.6.5.1/volk/lib/qa_utils.cc:426: instantiated from here
  1349. /tmp/gnuradio-qTEC/gnuradio-3.6.5.1/volk/lib/qa_utils.cc:237: warning: comparison between signed and unsigned integer expressions
  1350. /tmp/gnuradio-qTEC/gnuradio-3.6.5.1/volk/lib/qa_utils.cc: In function ‘bool icompare(t*, t*, unsigned int, unsigned int) [with t = uint8_t]’:
  1351. /tmp/gnuradio-qTEC/gnuradio-3.6.5.1/volk/lib/qa_utils.cc:428: instantiated from here
  1352. /tmp/gnuradio-qTEC/gnuradio-3.6.5.1/volk/lib/qa_utils.cc:237: warning: comparison between signed and unsigned integer expressions
  1353. Linking CXX executable volk_profile
  1354. [ 24%] Built target volk_profile
  1355. Scanning dependencies of target _blocks_swig0_swig_tag
  1356. [ 24%] Building CXX object gr-blocks/swig/CMakeFiles/_blocks_swig0_swig_tag.dir/_blocks_swig0_swig_tag.cpp.o
  1357. Linking CXX executable _blocks_swig0_swig_tag
  1358. [ 24%] Building CXX object gruel/src/lib/CMakeFiles/test_gruel.dir/pmt/qa_pmt.cc.o
  1359. [ 24%] Built target _blocks_swig0_swig_tag
  1360. Scanning dependencies of target _blocks_swig1_swig_tag
  1361. [ 25%] Building CXX object gr-blocks/swig/CMakeFiles/_blocks_swig1_swig_tag.dir/_blocks_swig1_swig_tag.cpp.o
  1362. Linking CXX executable _blocks_swig1_swig_tag
  1363. [ 25%] Built target _blocks_swig1_swig_tag
  1364. Scanning dependencies of target _blocks_swig2_swig_tag
  1365. [ 25%] Building CXX object gr-blocks/swig/CMakeFiles/_blocks_swig2_swig_tag.dir/_blocks_swig2_swig_tag.cpp.o
  1366. Linking CXX executable _blocks_swig2_swig_tag
  1367. [ 25%] Built target _blocks_swig2_swig_tag
  1368. Scanning dependencies of target pygen_gr_blocks_swig_359af
  1369. [ 25%] Generating blocks_swig0.tag
  1370. [ 25%] Linking CXX executable test_all
  1371. Swig source
  1372. [ 25%] Built target test_all
  1373. Scanning dependencies of target pygen_gr_blocks_swig_6b6de
  1374. [ 25%] Generating blocks_swig2.tag
  1375. [ 25%] Swig source
  1376. [ 25%] Building CXX object gruel/src/lib/CMakeFiles/test_gruel.dir/test_gruel.cc.o
  1377. Linking CXX executable test_gruel
  1378. [ 25%] Built target test_gruel
  1379. Scanning dependencies of target pygen_gr_blocks_swig_8e66a
  1380. [ 25%] Generating blocks_swig1.tag
  1381. [ 25%] Swig source
  1382. [ 25%] Building CXX object gnuradio-core/src/lib/CMakeFiles/gnuradio-core.dir/missing/bug_work_around_8.cc.o
  1383. [ 25%] Building CXX object gnuradio-core/src/lib/CMakeFiles/gnuradio-core.dir/runtime/gr_basic_block.cc.o
  1384. [ 25%] Building CXX object gnuradio-core/src/lib/CMakeFiles/gnuradio-core.dir/runtime/gr_flowgraph.cc.o
  1385. [ 25%] Building CXX object gnuradio-core/src/lib/CMakeFiles/gnuradio-core.dir/runtime/gr_flat_flowgraph.cc.o
  1386. [ 25%] Generating blocks_swig0.pyc
  1387. [ 25%] Generating blocks_swig0.pyo
  1388. [ 25%] Built target pygen_gr_blocks_swig_359af
  1389. Scanning dependencies of target _fft_swig_swig_tag
  1390. [ 25%] Building CXX object gr-fft/swig/CMakeFiles/_fft_swig_swig_tag.dir/_fft_swig_swig_tag.cpp.o
  1391. Linking CXX executable _fft_swig_swig_tag
  1392. [ 25%] Built target _fft_swig_swig_tag
  1393. [ 25%] Building CXX object gnuradio-core/src/lib/CMakeFiles/gnuradio-core.dir/runtime/gr_block.cc.o
  1394. Scanning dependencies of target _filter_swig_swig_tag
  1395. [ 25%] Building CXX object gr-filter/swig/CMakeFiles/_filter_swig_swig_tag.dir/_filter_swig_swig_tag.cpp.o
  1396. Linking CXX executable _filter_swig_swig_tag
  1397. [ 25%] Built target _filter_swig_swig_tag
  1398. Scanning dependencies of target _atsc_swig_tag
  1399. [ 25%] Building CXX object gr-atsc/src/lib/CMakeFiles/_atsc_swig_tag.dir/_atsc_swig_tag.cpp.o
  1400. Linking CXX executable _atsc_swig_tag
  1401. [ 25%] Built target _atsc_swig_tag
  1402. Scanning dependencies of target _audio_swig_swig_tag
  1403. [ 25%] Building CXX object gr-audio/swig/CMakeFiles/_audio_swig_swig_tag.dir/_audio_swig_swig_tag.cpp.o
  1404. Linking CXX executable _audio_swig_swig_tag
  1405. [ 25%] Built target _audio_swig_swig_tag
  1406. Scanning dependencies of target _analog_swig_swig_tag
  1407. [ 25%] Building CXX object gr-analog/swig/CMakeFiles/_analog_swig_swig_tag.dir/_analog_swig_swig_tag.cpp.o
  1408. Linking CXX executable _analog_swig_swig_tag
  1409. [ 25%] Built target _analog_swig_swig_tag
  1410. Scanning dependencies of target _digital_swig_swig_tag
  1411. [ 25%] Building CXX object gr-digital/swig/CMakeFiles/_digital_swig_swig_tag.dir/_digital_swig_swig_tag.cpp.o
  1412. Linking CXX executable _digital_swig_swig_tag
  1413. [ 25%] Built target _digital_swig_swig_tag
  1414. Scanning dependencies of target _noaa_swig_swig_tag
  1415. [ 25%] Building CXX object gr-noaa/swig/CMakeFiles/_noaa_swig_swig_tag.dir/_noaa_swig_swig_tag.cpp.o
  1416. Linking CXX executable _noaa_swig_swig_tag
  1417. [ 25%] Generating blocks_swig2.pyc
  1418. [ 25%] Built target _noaa_swig_swig_tag
  1419. Scanning dependencies of target _pager_swig_swig_tag
  1420. [ 25%] Building CXX object gr-pager/swig/CMakeFiles/_pager_swig_swig_tag.dir/_pager_swig_swig_tag.cpp.o
  1421. Linking CXX executable _pager_swig_swig_tag
  1422. [ 25%] Built target _pager_swig_swig_tag
  1423. [ 25%] Generating blocks_swig2.pyo
  1424. Scanning dependencies of target _qtgui_swig_swig_tag
  1425. [ 25%] Building CXX object gr-qtgui/swig/CMakeFiles/_qtgui_swig_swig_tag.dir/_qtgui_swig_swig_tag.cpp.o
  1426. Linking CXX executable _qtgui_swig_swig_tag
  1427. [ 25%] Built target _qtgui_swig_swig_tag
  1428. Scanning dependencies of target _trellis_swig_tag
  1429. [ 25%] Building CXX object gr-trellis/src/lib/CMakeFiles/_trellis_swig_tag.dir/_trellis_swig_tag.cpp.o
  1430. [ 25%] Built target pygen_gr_blocks_swig_6b6de
  1431. Linking CXX executable _trellis_swig_tag
  1432. Scanning dependencies of target _video_sdl_swig_tag
  1433. [ 25%] [ 25%] Building CXX object gnuradio-core/src/lib/CMakeFiles/gnuradio-core.dir/runtime/gr_block_detail.cc.o
  1434. Building CXX object gr-video-sdl/src/CMakeFiles/_video_sdl_swig_tag.dir/_video_sdl_swig_tag.cpp.o
  1435. [ 25%] Built target _trellis_swig_tag
  1436. Scanning dependencies of target _vocoder_swig_swig_tag
  1437. [ 25%] Linking CXX executable _video_sdl_swig_tag
  1438. Building CXX object gr-vocoder/swig/CMakeFiles/_vocoder_swig_swig_tag.dir/_vocoder_swig_swig_tag.cpp.o
  1439. [ 25%] Built target _video_sdl_swig_tag
  1440. Linking CXX executable _vocoder_swig_swig_tag
  1441. Scanning dependencies of target _fcd_swig_swig_tag
  1442. [ 25%] Building CXX object gr-fcd/swig/CMakeFiles/_fcd_swig_swig_tag.dir/_fcd_swig_swig_tag.cpp.o
  1443. [ 25%] Built target _vocoder_swig_swig_tag
  1444. Scanning dependencies of target _wavelet_swig_swig_tag
  1445. Linking CXX executable _fcd_swig_swig_tag
  1446. [ 25%] Building CXX object gr-wavelet/swig/CMakeFiles/_wavelet_swig_swig_tag.dir/_wavelet_swig_swig_tag.cpp.o
  1447. [ 25%] Built target _fcd_swig_swig_tag
  1448. Linking CXX executable _wavelet_swig_swig_tag
  1449. [ 25%] Generating pmt_swig.tag
  1450. [ 25%] Swig source
  1451. [ 25%] Built target _wavelet_swig_swig_tag
  1452. Scanning dependencies of target pygen_gruel_src_swig_daf6d
  1453. [ 25%] Swig source
  1454. [ 25%] Scanning dependencies of target _pmt_swig
  1455. Generating pmt_swig.pyc
  1456. [ 25%] Generating pmt_swig.pyo
  1457. [ 25%] Building CXX object gruel/src/swig/CMakeFiles/_pmt_swig.dir/pmt_swigPYTHON_wrap.cxx.o
  1458. [ 25%] Built target pygen_gruel_src_swig_daf6d
  1459. Scanning dependencies of target pygen_gr_fft_swig_fa7e3
  1460. [ 25%] Generating fft_swig.tag
  1461. [ 25%] Swig source
  1462. [ 25%] Building CXX object gnuradio-core/src/lib/CMakeFiles/gnuradio-core.dir/runtime/gr_block_executor.cc.o
  1463. [ 25%] Generating fft_swig.pyc
  1464. [ 25%] Generating fft_swig.pyo
  1465. [ 25%] Built target pygen_gr_fft_swig_fa7e3
  1466. [ 25%] Building CXX object gnuradio-core/src/lib/CMakeFiles/gnuradio-core.dir/runtime/gr_block_registry.cc.o
  1467. Linking CXX shared module _pmt_swig.so
  1468. [ 25%] Built target _pmt_swig
  1469. Scanning dependencies of target pygen_gr_filter_swig_22737
  1470. [ 25%] Generating filter_swig.tag
  1471. [ 25%] Swig source
  1472. [ 25%] Generating blocks_swig1.pyc
  1473. [ 25%] Generating blocks_swig1.pyo
  1474. [ 25%] Built target pygen_gr_blocks_swig_8e66a
  1475. [ 25%] Building CXX object gnuradio-core/src/lib/CMakeFiles/gnuradio-core.dir/runtime/gr_hier_block2.cc.o
  1476. [ 25%] Building CXX object gnuradio-core/src/lib/CMakeFiles/gnuradio-core.dir/runtime/gr_hier_block2_detail.cc.o
  1477. [ 25%] Building CXX object gnuradio-core/src/lib/CMakeFiles/gnuradio-core.dir/runtime/gr_buffer.cc.o
  1478. [ 25%] Building CXX object gnuradio-core/src/lib/CMakeFiles/gnuradio-core.dir/runtime/gr_dispatcher.cc.o
  1479. [ 25%] Building CXX object gnuradio-core/src/lib/CMakeFiles/gnuradio-core.dir/runtime/gr_error_handler.cc.o
  1480. Scanning dependencies of target pygen_gr_atsc_src_lib_a9c91
  1481. [ 25%] Generating atsc.tag
  1482. [ 25%] Swig source
  1483. Scanning dependencies of target pygen_gr_audio_swig_343be
  1484. [ 26%] Generating audio_swig.tag
  1485. [ 26%] Swig source
  1486. [ 26%] Building CXX object gnuradio-core/src/lib/CMakeFiles/gnuradio-core.dir/runtime/gr_io_signature.cc.o
  1487. [ 26%] Building CXX object gnuradio-core/src/lib/CMakeFiles/gnuradio-core.dir/runtime/gr_local_sighandler.cc.o
  1488. [ 26%] Building CXX object gnuradio-core/src/lib/CMakeFiles/gnuradio-core.dir/runtime/gr_logger.cc.o
  1489. [ 26%] Building CXX object gnuradio-core/src/lib/CMakeFiles/gnuradio-core.dir/runtime/gr_message.cc.o
  1490. [ 26%] Generating audio_swig.pyc
  1491. [ 26%] Generating audio_swig.pyo
  1492. [ 26%] Built target pygen_gr_audio_swig_343be
  1493. Scanning dependencies of target pygen_gr_analog_swig_df554
  1494. [ 26%] Generating analog_swig.tag
  1495. [ 26%] Swig source
  1496. [ 27%] Building CXX object gnuradio-core/src/lib/CMakeFiles/gnuradio-core.dir/runtime/gr_msg_accepter.cc.o
  1497. [ 27%] Generating atsc.pyc
  1498. [ 27%] Generating atsc.pyo
  1499. [ 27%] Built target pygen_gr_atsc_src_lib_a9c91
  1500. Scanning dependencies of target pygen_gr_digital_swig_beedb
  1501. [ 27%] Generating digital_swig.tag
  1502. [ 27%] Swig source
  1503. [ 27%] Building CXX object gnuradio-core/src/lib/CMakeFiles/gnuradio-core.dir/runtime/gr_msg_handler.cc.o
  1504. [ 27%] Building CXX object gnuradio-core/src/lib/CMakeFiles/gnuradio-core.dir/runtime/gr_msg_queue.cc.o
  1505. [ 27%] Building CXX object gnuradio-core/src/lib/CMakeFiles/gnuradio-core.dir/runtime/gr_pagesize.cc.o
  1506. [ 27%] Building CXX object gnuradio-core/src/lib/CMakeFiles/gnuradio-core.dir/runtime/gr_preferences.cc.o
  1507. [ 27%] Building CXX object gnuradio-core/src/lib/CMakeFiles/gnuradio-core.dir/runtime/gr_realtime.cc.o
  1508. [ 27%] Building CXX object gnuradio-core/src/lib/CMakeFiles/gnuradio-core.dir/runtime/gr_scheduler.cc.o
  1509. [ 27%] Building CXX object gnuradio-core/src/lib/CMakeFiles/gnuradio-core.dir/runtime/gr_scheduler_sts.cc.o
  1510. [ 27%] Building CXX object gnuradio-core/src/lib/CMakeFiles/gnuradio-core.dir/runtime/gr_scheduler_tpb.cc.o
  1511. [ 27%] Generating analog_swig.pyc
  1512. [ 27%] Generating analog_swig.pyo
  1513. [ 27%] Built target pygen_gr_analog_swig_df554
  1514. [ 27%] Building CXX object gnuradio-core/src/lib/CMakeFiles/gnuradio-core.dir/runtime/gr_single_threaded_scheduler.cc.o
  1515. [ 27%] Generating filter_swig.pyc
  1516. [ 27%] Generating filter_swig.pyo
  1517. [ 27%] Built target pygen_gr_filter_swig_22737
  1518. Scanning dependencies of target pygen_gr_noaa_swig_effcd
  1519. [ 27%] Generating noaa_swig.tag
  1520. [ 27%] Swig source
  1521. [ 27%] Building CXX object gnuradio-core/src/lib/CMakeFiles/gnuradio-core.dir/runtime/gr_sptr_magic.cc.o
  1522. Scanning dependencies of target pygen_gr_pager_swig_e374b
  1523. [ 28%] Generating pager_swig.tag
  1524. [ 28%] Swig source
  1525. [ 28%] Generating noaa_swig.pyc
  1526. [ 28%] Generating noaa_swig.pyo
  1527. [ 28%] Built target pygen_gr_noaa_swig_effcd
  1528. Scanning dependencies of target pygen_gr_qtgui_swig_cee4b
  1529. [ 28%] Generating qtgui_swig.tag
  1530. [ 28%] Swig source
  1531. [ 28%] Building CXX object gnuradio-core/src/lib/CMakeFiles/gnuradio-core.dir/runtime/gr_sync_block.cc.o
  1532. [ 28%] Building CXX object gnuradio-core/src/lib/CMakeFiles/gnuradio-core.dir/runtime/gr_sync_decimator.cc.o
  1533. [ 28%] Generating pager_swig.pyc
  1534. [ 28%] Generating pager_swig.pyo
  1535. [ 28%] Built target pygen_gr_pager_swig_e374b
  1536. Scanning dependencies of target pygen_gr_trellis_src_lib_c9b14
  1537. [ 28%] Generating trellis_encoder_bb.h, trellis_encoder_bs.h, trellis_encoder_bi.h, trellis_encoder_ss.h, trellis_encoder_si.h, trellis_encoder_ii.h
  1538. [ 28%] Generating trellis_sccc_encoder_bb.h, trellis_sccc_encoder_bs.h, trellis_sccc_encoder_bi.h, trellis_sccc_encoder_ss.h, trellis_sccc_encoder_si.h, trellis_sccc_encoder_ii.h
  1539. [ 28%] Generating trellis_pccc_encoder_bb.h, trellis_pccc_encoder_bs.h, trellis_pccc_encoder_bi.h, trellis_pccc_encoder_ss.h, trellis_pccc_encoder_si.h, trellis_pccc_encoder_ii.h
  1540. [ 28%] Generating trellis_metrics_s.h, trellis_metrics_i.h, trellis_metrics_f.h, trellis_metrics_c.h
  1541. [ 28%] Generating trellis_viterbi_b.h, trellis_viterbi_s.h, trellis_viterbi_i.h
  1542. [ 28%] Generating qtgui_swig.pyc
  1543. [ 28%] Generating trellis_viterbi_combined_sb.h, trellis_viterbi_combined_ss.h, trellis_viterbi_combined_si.h, trellis_viterbi_combined_ib.h, trellis_viterbi_combined_is.h, trellis_viterbi_combined_ii.h, trellis_viterbi_combined_fb.h, trellis_viterbi_combined_fs.h, trellis_viterbi_combined_fi.h, trellis_viterbi_combined_cb.h, trellis_viterbi_combined_cs.h, trellis_viterbi_combined_ci.h
  1544. [ 28%] Generating qtgui_swig.pyo
  1545. [ 28%] Generating trellis_sccc_decoder_b.h, trellis_sccc_decoder_s.h, trellis_sccc_decoder_i.h
  1546. [ 28%] Built target pygen_gr_qtgui_swig_cee4b
  1547. Scanning dependencies of target pygen_gr_video_sdl_src_f67d2
  1548. [ 28%] Generating trellis_sccc_decoder_combined_fb.h, trellis_sccc_decoder_combined_fs.h, trellis_sccc_decoder_combined_fi.h, trellis_sccc_decoder_combined_cb.h, trellis_sccc_decoder_combined_cs.h, trellis_sccc_decoder_combined_ci.h
  1549. [ 28%] Generating video_sdl.tag
  1550. [ 28%] Swig source
  1551. [ 28%] Generating trellis_pccc_decoder_b.h, trellis_pccc_decoder_s.h, trellis_pccc_decoder_i.h
  1552. [ 28%] Generating trellis_pccc_decoder_combined_fb.h, trellis_pccc_decoder_combined_fs.h, trellis_pccc_decoder_combined_fi.h, trellis_pccc_decoder_combined_cb.h, trellis_pccc_decoder_combined_cs.h, trellis_pccc_decoder_combined_ci.h
  1553. [ 28%] Generating trellis_encoder_bb.i, trellis_encoder_bs.i, trellis_encoder_bi.i, trellis_encoder_ss.i, trellis_encoder_si.i, trellis_encoder_ii.i
  1554. [ 29%] Generating trellis_sccc_encoder_bb.i, trellis_sccc_encoder_bs.i, trellis_sccc_encoder_bi.i, trellis_sccc_encoder_ss.i, trellis_sccc_encoder_si.i, trellis_sccc_encoder_ii.i
  1555. [ 29%] Generating trellis_pccc_encoder_bb.i, trellis_pccc_encoder_bs.i, trellis_pccc_encoder_bi.i, trellis_pccc_encoder_ss.i, trellis_pccc_encoder_si.i, trellis_pccc_encoder_ii.i
  1556. [ 29%] Generating trellis_metrics_s.i, trellis_metrics_i.i, trellis_metrics_f.i, trellis_metrics_c.i
  1557. [ 29%] Generating trellis_viterbi_b.i, trellis_viterbi_s.i, trellis_viterbi_i.i
  1558. [ 29%] Generating trellis_viterbi_combined_sb.i, trellis_viterbi_combined_ss.i, trellis_viterbi_combined_si.i, trellis_viterbi_combined_ib.i, trellis_viterbi_combined_is.i, trellis_viterbi_combined_ii.i, trellis_viterbi_combined_fb.i, trellis_viterbi_combined_fs.i, trellis_viterbi_combined_fi.i, trellis_viterbi_combined_cb.i, trellis_viterbi_combined_cs.i, trellis_viterbi_combined_ci.i
  1559. [ 29%] Generating trellis_sccc_decoder_b.i, trellis_sccc_decoder_s.i, trellis_sccc_decoder_i.i
  1560. [ 29%] Generating trellis_sccc_decoder_combined_fb.i, trellis_sccc_decoder_combined_fs.i, trellis_sccc_decoder_combined_fi.i, trellis_sccc_decoder_combined_cb.i, trellis_sccc_decoder_combined_cs.i, trellis_sccc_decoder_combined_ci.i
  1561. [ 29%] Generating trellis_pccc_decoder_b.i, trellis_pccc_decoder_s.i, trellis_pccc_decoder_i.i
  1562. [ 29%] Generating trellis_pccc_decoder_combined_fb.i, trellis_pccc_decoder_combined_fs.i, trellis_pccc_decoder_combined_fi.i, trellis_pccc_decoder_combined_cb.i, trellis_pccc_decoder_combined_cs.i, trellis_pccc_decoder_combined_ci.i
  1563. [ 29%] Generating trellis.tag
  1564. [ 29%] Swig source
  1565. [ 29%] Building CXX object gnuradio-core/src/lib/CMakeFiles/gnuradio-core.dir/runtime/gr_sync_interpolator.cc.o
  1566. [ 29%] Generating video_sdl.pyc
  1567. [ 29%] Generating video_sdl.pyo
  1568. [ 29%] Built target pygen_gr_video_sdl_src_f67d2
  1569. Scanning dependencies of target pygen_gr_vocoder_swig_9c161
  1570. [ 29%] Generating vocoder_swig.tag
  1571. [ 29%] Swig source
  1572. [ 29%] Building CXX object gnuradio-core/src/lib/CMakeFiles/gnuradio-core.dir/runtime/gr_sys_paths.cc.o
  1573. [ 29%] Building CXX object gnuradio-core/src/lib/CMakeFiles/gnuradio-core.dir/runtime/gr_tagged_stream_block.cc.o
  1574. [ 29%] Building CXX object gnuradio-core/src/lib/CMakeFiles/gnuradio-core.dir/runtime/gr_top_block.cc.o
  1575. [ 29%] Generating digital_swig.pyc
  1576. [ 29%] Generating digital_swig.pyo
  1577. [ 29%] Built target pygen_gr_digital_swig_beedb
  1578. Scanning dependencies of target pygen_gr_fcd_swig_7b122
  1579. [ 29%] Generating fcd_swig.tag
  1580. [ 29%] Swig source
  1581. [ 29%] Building CXX object gnuradio-core/src/lib/CMakeFiles/gnuradio-core.dir/runtime/gr_top_block_impl.cc.o
  1582. [ 29%] Generating vocoder_swig.pyc
  1583. [ 29%] Generating vocoder_swig.pyo
  1584. [ 29%] Built target pygen_gr_vocoder_swig_9c161
  1585. Scanning dependencies of target pygen_gr_wavelet_swig_681e8
  1586. [ 29%] Generating wavelet_swig.tag
  1587. [ 29%] Swig source
  1588. [ 29%] Generating fcd_swig.pyc
  1589. [ 29%] Generating fcd_swig.pyo
  1590. [ 29%] Built target pygen_gr_fcd_swig_7b122
  1591. Scanning dependencies of target pmt_swig
  1592. [ 29%] Built target pmt_swig
  1593. [ 29%] Building CXX object gnuradio-core/src/lib/CMakeFiles/gnuradio-core.dir/runtime/gr_tpb_detail.cc.o
  1594. Scanning dependencies of target _gnuradio_core_filter_swig_tag
  1595. [ 29%] Building CXX object gnuradio-core/src/lib/swig/CMakeFiles/_gnuradio_core_filter_swig_tag.dir/_gnuradio_core_filter_swig_tag.cpp.o
  1596. Linking CXX executable _gnuradio_core_filter_swig_tag
  1597. [ 29%] Built target _gnuradio_core_filter_swig_tag
  1598. Scanning dependencies of target _gnuradio_core_general_swig_tag
  1599. [ 29%] Building CXX object gnuradio-core/src/lib/swig/CMakeFiles/_gnuradio_core_general_swig_tag.dir/_gnuradio_core_general_swig_tag.cpp.o
  1600. Linking CXX executable _gnuradio_core_general_swig_tag
  1601. [ 29%] Built target _gnuradio_core_general_swig_tag
  1602. [ 30%] Building CXX object gnuradio-core/src/lib/CMakeFiles/gnuradio-core.dir/runtime/gr_tpb_thread_body.cc.o
  1603. [ 30%] Generating wavelet_swig.pyc
  1604. [ 30%] Generating wavelet_swig.pyo
  1605. [ 30%] Built target pygen_gr_wavelet_swig_681e8
  1606. [ 30%] Building CXX object gnuradio-core/src/lib/CMakeFiles/gnuradio-core.dir/runtime/gr_vmcircbuf.cc.o
  1607. [ 30%] Building CXX object gnuradio-core/src/lib/CMakeFiles/gnuradio-core.dir/runtime/gr_vmcircbuf_mmap_shm_open.cc.o
  1608. Scanning dependencies of target _gnuradio_core_gengen_swig_tag
  1609. [ 30%] Building CXX object gnuradio-core/src/lib/swig/CMakeFiles/_gnuradio_core_gengen_swig_tag.dir/_gnuradio_core_gengen_swig_tag.cpp.o
  1610. Linking CXX executable _gnuradio_core_gengen_swig_tag
  1611. [ 30%] Built target _gnuradio_core_gengen_swig_tag
  1612. Scanning dependencies of target _gnuradio_core_hier_swig_tag
  1613. [ 30%] Building CXX object gnuradio-core/src/lib/swig/CMakeFiles/_gnuradio_core_hier_swig_tag.dir/_gnuradio_core_hier_swig_tag.cpp.o
  1614. Linking CXX executable _gnuradio_core_hier_swig_tag
  1615. [ 30%] Built target _gnuradio_core_hier_swig_tag
  1616. [ 30%] Building CXX object gnuradio-core/src/lib/CMakeFiles/gnuradio-core.dir/runtime/gr_vmcircbuf_mmap_tmpfile.cc.o
  1617. [ 30%] Building CXX object gnuradio-core/src/lib/CMakeFiles/gnuradio-core.dir/runtime/gr_vmcircbuf_createfilemapping.cc.o
  1618. [ 30%] Building CXX object gnuradio-core/src/lib/CMakeFiles/gnuradio-core.dir/runtime/gr_vmcircbuf_sysv_shm.cc.o
  1619. Scanning dependencies of target _gnuradio_core_io_swig_tag
  1620. [ 30%] Building CXX object gnuradio-core/src/lib/swig/CMakeFiles/_gnuradio_core_io_swig_tag.dir/_gnuradio_core_io_swig_tag.cpp.o
  1621. Linking CXX executable _gnuradio_core_io_swig_tag
  1622. [ 30%] Built target _gnuradio_core_io_swig_tag
  1623. Scanning dependencies of target _gnuradio_core_runtime_swig_tag
  1624. Scanning dependencies of target pygen_gnuradio_core_src_lib_swig_1e901
  1625. [ 30%] Building CXX object gnuradio-core/src/lib/swig/CMakeFiles/_gnuradio_core_runtime_swig_tag.dir/_gnuradio_core_runtime_swig_tag.cpp.o
  1626. [ 30%] Generating gnuradio_core_gengen.tag
  1627. [ 30%] Linking CXX executable _gnuradio_core_runtime_swig_tag
  1628. Swig source
  1629. [ 30%] Building CXX object gnuradio-core/src/lib/CMakeFiles/gnuradio-core.dir/runtime/gr_select_handler.cc.o
  1630. [ 30%] Built target _gnuradio_core_runtime_swig_tag
  1631. Scanning dependencies of target pygen_gnuradio_core_src_lib_swig_d592a
  1632. [ 30%] Generating gnuradio_core_io.tag
  1633. [ 30%] Swig source
  1634. [ 30%] Building CXX object gnuradio-core/src/lib/CMakeFiles/gnuradio-core.dir/filter/sysconfig_x86.cc.o
  1635. [ 30%] Building CXX object gnuradio-core/src/lib/CMakeFiles/gnuradio-core.dir/filter/gr_fir_sysconfig_x86.cc.o
  1636. [ 30%] Building CXX object gnuradio-core/src/lib/CMakeFiles/gnuradio-core.dir/filter/gr_cpu_x86.cc.o
  1637. [ 30%] Building CXX object gnuradio-core/src/lib/CMakeFiles/gnuradio-core.dir/filter/gr_fir_ccc_simd.cc.o
  1638. [ 30%] Building CXX object gnuradio-core/src/lib/CMakeFiles/gnuradio-core.dir/filter/gr_fir_ccc_x86.cc.o
  1639. [ 30%] Building CXX object gnuradio-core/src/lib/CMakeFiles/gnuradio-core.dir/filter/gr_fir_fff_simd.cc.o
  1640. [ 30%] Building CXX object gnuradio-core/src/lib/CMakeFiles/gnuradio-core.dir/filter/gr_fir_fff_x86.cc.o
  1641. [ 30%] Building CXX object gnuradio-core/src/lib/CMakeFiles/gnuradio-core.dir/filter/gr_fir_fsf_simd.cc.o
  1642. [ 30%] Building CXX object gnuradio-core/src/lib/CMakeFiles/gnuradio-core.dir/filter/gr_fir_fsf_x86.cc.o
  1643. [ 30%] Building CXX object gnuradio-core/src/lib/CMakeFiles/gnuradio-core.dir/filter/gr_fir_scc_simd.cc.o
  1644. [ 30%] Building CXX object gnuradio-core/src/lib/CMakeFiles/gnuradio-core.dir/filter/gr_fir_scc_x86.cc.o
  1645. [ 30%] Building CXX object gnuradio-core/src/lib/CMakeFiles/gnuradio-core.dir/filter/gr_fir_fcc_simd.cc.o
  1646. [ 31%] Building CXX object gnuradio-core/src/lib/CMakeFiles/gnuradio-core.dir/filter/gr_fir_fcc_x86.cc.o
  1647. [ 31%] Building CXX object gnuradio-core/src/lib/CMakeFiles/gnuradio-core.dir/filter/gr_fir_ccf_simd.cc.o
  1648. [ 31%] Building CXX object gnuradio-core/src/lib/CMakeFiles/gnuradio-core.dir/filter/gr_fir_ccf_x86.cc.o
  1649. [ 31%] Generating gnuradio_core_io.pyc
  1650. [ 32%] Generating gnuradio_core_io.pyo
  1651. [ 32%] Built target pygen_gnuradio_core_src_lib_swig_d592a
  1652. [ 32%] Building C object gnuradio-core/src/lib/CMakeFiles/gnuradio-core.dir/filter/sse_debug.c.o
  1653. [ 32%] Building C object gnuradio-core/src/lib/CMakeFiles/gnuradio-core.dir/filter/float_dotprod_sse64.S.o
  1654. [ 32%] Building C object gnuradio-core/src/lib/CMakeFiles/gnuradio-core.dir/filter/float_dotprod_3dnow64.S.o
  1655. [ 32%] Scanning dependencies of target pygen_gnuradio_core_src_lib_swig_e1dac
  1656. Building C object gnuradio-core/src/lib/CMakeFiles/gnuradio-core.dir/filter/complex_dotprod_3dnowext64.S.o
  1657. [ 32%] Generating gnuradio_core_general.tag
  1658. [ 32%] Building C object gnuradio-core/src/lib/CMakeFiles/gnuradio-core.dir/filter/complex_dotprod_3dnow64.S.o
  1659. [ 32%] Swig source
  1660. [ 32%] Building C object gnuradio-core/src/lib/CMakeFiles/gnuradio-core.dir/filter/complex_dotprod_sse64.S.o
  1661. [ 32%] Building C object gnuradio-core/src/lib/CMakeFiles/gnuradio-core.dir/filter/ccomplex_dotprod_3dnowext64.S.o
  1662. [ 32%] Building C object gnuradio-core/src/lib/CMakeFiles/gnuradio-core.dir/filter/ccomplex_dotprod_3dnow64.S.o
  1663. [ 32%] Building C object gnuradio-core/src/lib/CMakeFiles/gnuradio-core.dir/filter/ccomplex_dotprod_sse64.S.o
  1664. [ 32%] Building C object gnuradio-core/src/lib/CMakeFiles/gnuradio-core.dir/filter/fcomplex_dotprod_3dnow64.S.o
  1665. [ 32%] Building C object gnuradio-core/src/lib/CMakeFiles/gnuradio-core.dir/filter/fcomplex_dotprod_sse64.S.o
  1666. [ 32%] Building C object gnuradio-core/src/lib/CMakeFiles/gnuradio-core.dir/filter/short_dotprod_mmx64.S.o
  1667. [ 32%] Building CXX object gnuradio-core/src/lib/CMakeFiles/gnuradio-core.dir/filter/gr_fir_ccc.cc.o
  1668. [ 32%] [ 32%] Building CXX object gnuradio-core/src/lib/CMakeFiles/gnuradio-core.dir/filter/gr_fir_ccc_generic.cc.o
  1669. Generating trellis.pyc
  1670. [ 32%] Generating trellis.pyo
  1671. [ 32%] Built target pygen_gr_trellis_src_lib_c9b14
  1672. Scanning dependencies of target pygen_gnuradio_core_src_lib_swig_f287b
  1673. [ 32%] Generating gnuradio_core_hier.tag
  1674. [ 32%] Swig source
  1675. [ 32%] Building CXX object gnuradio-core/src/lib/CMakeFiles/gnuradio-core.dir/filter/gr_fir_ccf.cc.o
  1676. [ 32%] Building CXX object gnuradio-core/src/lib/CMakeFiles/gnuradio-core.dir/filter/gr_fir_ccf_generic.cc.o
  1677. [ 32%] Building CXX object gnuradio-core/src/lib/CMakeFiles/gnuradio-core.dir/filter/gr_fir_fcc.cc.o
  1678. [ 33%] Building CXX object gnuradio-core/src/lib/CMakeFiles/gnuradio-core.dir/filter/gr_fir_fcc_generic.cc.o
  1679. [ 33%] Building CXX object gnuradio-core/src/lib/CMakeFiles/gnuradio-core.dir/filter/gr_fir_fff.cc.o
  1680. [ 33%] Building CXX object gnuradio-core/src/lib/CMakeFiles/gnuradio-core.dir/filter/gr_fir_fff_generic.cc.o
  1681. [ 33%] Generating gnuradio_core_hier.pyc
  1682. [ 33%] Generating gnuradio_core_hier.pyo
  1683. [ 33%] Built target pygen_gnuradio_core_src_lib_swig_f287b
  1684. Scanning dependencies of target pygen_gnuradio_core_src_lib_swig_f31cd
  1685. [ 33%] Generating gnuradio_core_filter.tag
  1686. [ 33%] Swig source
  1687. [ 33%] Building CXX object gnuradio-core/src/lib/CMakeFiles/gnuradio-core.dir/filter/gr_fir_filter_ccc.cc.o
  1688. [ 33%] Building CXX object gnuradio-core/src/lib/CMakeFiles/gnuradio-core.dir/filter/gr_fir_filter_ccf.cc.o
  1689. [ 33%] Building CXX object gnuradio-core/src/lib/CMakeFiles/gnuradio-core.dir/filter/gr_fir_filter_fcc.cc.o
  1690. [ 33%] Building CXX object gnuradio-core/src/lib/CMakeFiles/gnuradio-core.dir/filter/gr_fir_filter_fff.cc.o
  1691. [ 33%] Building CXX object gnuradio-core/src/lib/CMakeFiles/gnuradio-core.dir/filter/gr_fir_filter_fsf.cc.o
  1692. [ 33%] Building CXX object gnuradio-core/src/lib/CMakeFiles/gnuradio-core.dir/filter/gr_fir_filter_scc.cc.o
  1693. [ 33%] Building CXX object gnuradio-core/src/lib/CMakeFiles/gnuradio-core.dir/filter/gr_fir_fsf.cc.o
  1694. [ 33%] Building CXX object gnuradio-core/src/lib/CMakeFiles/gnuradio-core.dir/filter/gr_fir_fsf_generic.cc.o
  1695. [ 33%] Building CXX object gnuradio-core/src/lib/CMakeFiles/gnuradio-core.dir/filter/gr_fir_scc.cc.o
  1696. [ 33%] Building CXX object gnuradio-core/src/lib/CMakeFiles/gnuradio-core.dir/filter/gr_fir_scc_generic.cc.o
  1697. [ 33%] Generating gnuradio_core_filter.pyc
  1698. [ 33%] Generating gnuradio_core_filter.pyo
  1699. [ 33%] Building CXX object gnuradio-core/src/lib/CMakeFiles/gnuradio-core.dir/filter/gr_fir_sysconfig.cc.o
  1700. [ 33%] Built target pygen_gnuradio_core_src_lib_swig_f31cd
  1701. [ 33%] Building CXX object gnuradio-core/src/lib/CMakeFiles/gnuradio-core.dir/filter/gr_fir_sysconfig_generic.cc.o
  1702. [ 33%] Building CXX object gnuradio-core/src/lib/CMakeFiles/gnuradio-core.dir/filter/gr_fir_util.cc.o
  1703. Scanning dependencies of target pygen_gnuradio_core_src_lib_swig_2e13e
  1704. [ 33%] Generating gnuradio_core_runtime.tag
  1705. [ 33%] Swig source
  1706. [ 33%] Building CXX object gnuradio-core/src/lib/CMakeFiles/gnuradio-core.dir/filter/gr_freq_xlating_fir_filter_ccc.cc.o
  1707. [ 33%] Building CXX object gnuradio-core/src/lib/CMakeFiles/gnuradio-core.dir/filter/gr_freq_xlating_fir_filter_ccf.cc.o
  1708. [ 33%] Building CXX object gnuradio-core/src/lib/CMakeFiles/gnuradio-core.dir/filter/gr_freq_xlating_fir_filter_fcc.cc.o
  1709. [ 33%] Generating gnuradio_core_runtime.pyc
  1710. [ 33%] Generating gnuradio_core_runtime.pyo
  1711. [ 33%] Built target pygen_gnuradio_core_src_lib_swig_2e13e
  1712. [ 34%] Building CXX object gnuradio-core/src/lib/CMakeFiles/gnuradio-core.dir/filter/gr_freq_xlating_fir_filter_fcf.cc.o
  1713. [ 34%] Building CXX object gnuradio-core/src/lib/CMakeFiles/gnuradio-core.dir/filter/gr_freq_xlating_fir_filter_scc.cc.o
  1714. [ 34%] Building CXX object gnuradio-core/src/lib/CMakeFiles/gnuradio-core.dir/filter/gr_freq_xlating_fir_filter_scf.cc.o
  1715. [ 34%] Building CXX object gnuradio-core/src/lib/CMakeFiles/gnuradio-core.dir/filter/gr_interp_fir_filter_ccc.cc.o
  1716. [ 34%] Building CXX object gnuradio-core/src/lib/CMakeFiles/gnuradio-core.dir/filter/gr_interp_fir_filter_ccf.cc.o
  1717. [ 34%] Generating gnuradio_core_gengen.pyc
  1718. [ 34%] Generating gnuradio_core_gengen.pyo
  1719. [ 34%] Building CXX object gnuradio-core/src/lib/CMakeFiles/gnuradio-core.dir/filter/gr_interp_fir_filter_fcc.cc.o
  1720. [ 34%] Built target pygen_gnuradio_core_src_lib_swig_1e901
  1721. [ 34%] Building CXX object gnuradio-core/src/lib/CMakeFiles/gnuradio-core.dir/filter/gr_interp_fir_filter_fff.cc.o
  1722. [ 34%] Building CXX object gnuradio-core/src/lib/CMakeFiles/gnuradio-core.dir/filter/gr_interp_fir_filter_fsf.cc.o
  1723. [ 34%] Building CXX object gnuradio-core/src/lib/CMakeFiles/gnuradio-core.dir/filter/gr_interp_fir_filter_scc.cc.o
  1724. [ 34%] Building CXX object gnuradio-core/src/lib/CMakeFiles/gnuradio-core.dir/filter/gr_rational_resampler_base_ccc.cc.o
  1725. [ 34%] Building CXX object gnuradio-core/src/lib/CMakeFiles/gnuradio-core.dir/filter/gr_rational_resampler_base_ccf.cc.o
  1726. [ 34%] Building CXX object gnuradio-core/src/lib/CMakeFiles/gnuradio-core.dir/filter/gr_rational_resampler_base_fcc.cc.o
  1727. [ 34%] Building CXX object gnuradio-core/src/lib/CMakeFiles/gnuradio-core.dir/filter/gr_rational_resampler_base_fff.cc.o
  1728. [ 34%] Building CXX object gnuradio-core/src/lib/CMakeFiles/gnuradio-core.dir/filter/gr_rational_resampler_base_fsf.cc.o
  1729. [ 34%] Building CXX object gnuradio-core/src/lib/CMakeFiles/gnuradio-core.dir/filter/gr_rational_resampler_base_scc.cc.o
  1730. [ 34%] Building CXX object gnuradio-core/src/lib/CMakeFiles/gnuradio-core.dir/filter/gri_fir_filter_with_buffer_ccc.cc.o
  1731. [ 34%] Building CXX object gnuradio-core/src/lib/CMakeFiles/gnuradio-core.dir/filter/gri_fir_filter_with_buffer_ccf.cc.o
  1732. [ 34%] Building CXX object gnuradio-core/src/lib/CMakeFiles/gnuradio-core.dir/filter/gri_fir_filter_with_buffer_fcc.cc.o
  1733. [ 34%] Building CXX object gnuradio-core/src/lib/CMakeFiles/gnuradio-core.dir/filter/gri_fir_filter_with_buffer_fff.cc.o
  1734. [ 35%] Building CXX object gnuradio-core/src/lib/CMakeFiles/gnuradio-core.dir/filter/gri_fir_filter_with_buffer_fsf.cc.o
  1735. [ 35%] Building CXX object gnuradio-core/src/lib/CMakeFiles/gnuradio-core.dir/filter/gri_fir_filter_with_buffer_scc.cc.o
  1736. [ 35%] Building CXX object gnuradio-core/src/lib/CMakeFiles/gnuradio-core.dir/filter/gri_fft_filter_fff_generic.cc.o
  1737. [ 35%] Building CXX object gnuradio-core/src/lib/CMakeFiles/gnuradio-core.dir/filter/gri_fft_filter_ccc_generic.cc.o
  1738. [ 35%] Building C object gnuradio-core/src/lib/CMakeFiles/gnuradio-core.dir/filter/gr_sincos.c.o
  1739. [ 35%] Building CXX object gnuradio-core/src/lib/CMakeFiles/gnuradio-core.dir/filter/gri_goertzel.cc.o
  1740. [ 35%] Building CXX object gnuradio-core/src/lib/CMakeFiles/gnuradio-core.dir/filter/gri_mmse_fir_interpolator.cc.o
  1741. [ 35%] Building CXX object gnuradio-core/src/lib/CMakeFiles/gnuradio-core.dir/filter/gri_mmse_fir_interpolator_cc.cc.o
  1742. [ 35%] Building CXX object gnuradio-core/src/lib/CMakeFiles/gnuradio-core.dir/filter/complex_dotprod_generic.cc.o
  1743. [ 35%] Building CXX object gnuradio-core/src/lib/CMakeFiles/gnuradio-core.dir/filter/ccomplex_dotprod_generic.cc.o
  1744. [ 35%] Building C object gnuradio-core/src/lib/CMakeFiles/gnuradio-core.dir/filter/float_dotprod_generic.c.o
  1745. [ 35%] Building C object gnuradio-core/src/lib/CMakeFiles/gnuradio-core.dir/filter/short_dotprod_generic.c.o
  1746. [ 35%] [ 35%] Building CXX object gnuradio-core/src/lib/CMakeFiles/gnuradio-core.dir/filter/gr_adaptive_fir_ccc.cc.o
  1747. Building CXX object gnuradio-core/src/lib/CMakeFiles/gnuradio-core.dir/filter/gr_adaptive_fir_ccf.cc.o
  1748. [ 35%] Building CXX object gnuradio-core/src/lib/CMakeFiles/gnuradio-core.dir/filter/gr_dc_blocker_cc.cc.o
  1749. [ 35%] [ 35%] Building CXX object gnuradio-core/src/lib/CMakeFiles/gnuradio-core.dir/filter/gr_dc_blocker_ff.cc.o
  1750. Building CXX object gnuradio-core/src/lib/CMakeFiles/gnuradio-core.dir/filter/gr_fft_filter_ccc.cc.o
  1751. [ 35%] Building CXX object gnuradio-core/src/lib/CMakeFiles/gnuradio-core.dir/filter/gr_fft_filter_fff.cc.o
  1752. [ 35%] Generating gnuradio_core_general.pyc
  1753. [ 35%] Generating gnuradio_core_general.pyo
  1754. [ 35%] Building CXX object gnuradio-core/src/lib/CMakeFiles/gnuradio-core.dir/filter/gr_filter_delay_fc.cc.o
  1755. [ 35%] Built target pygen_gnuradio_core_src_lib_swig_e1dac
  1756. [ 36%] Building CXX object gnuradio-core/src/lib/CMakeFiles/gnuradio-core.dir/filter/gr_fractional_interpolator_ff.cc.o
  1757. [ 36%] Building CXX object gnuradio-core/src/lib/CMakeFiles/gnuradio-core.dir/filter/gr_fractional_interpolator_cc.cc.o
  1758. [ 36%] Building CXX object gnuradio-core/src/lib/CMakeFiles/gnuradio-core.dir/filter/gr_goertzel_fc.cc.o
  1759. [ 36%] Building CXX object gnuradio-core/src/lib/CMakeFiles/gnuradio-core.dir/filter/gr_hilbert_fc.cc.o
  1760. [ 36%] Building CXX object gnuradio-core/src/lib/CMakeFiles/gnuradio-core.dir/filter/gr_iir_filter_ffd.cc.o
  1761. [ 36%] Building CXX object gnuradio-core/src/lib/CMakeFiles/gnuradio-core.dir/filter/gr_single_pole_iir_filter_ff.cc.o
  1762. [ 36%] Building CXX object gnuradio-core/src/lib/CMakeFiles/gnuradio-core.dir/filter/gr_single_pole_iir_filter_cc.cc.o
  1763. [ 36%] Building CXX object gnuradio-core/src/lib/CMakeFiles/gnuradio-core.dir/filter/gr_pfb_channelizer_ccf.cc.o
  1764. [ 36%] Building CXX object gnuradio-core/src/lib/CMakeFiles/gnuradio-core.dir/filter/gr_pfb_synthesizer_ccf.cc.o
  1765. [ 36%] Building CXX object gnuradio-core/src/lib/CMakeFiles/gnuradio-core.dir/filter/gr_pfb_decimator_ccf.cc.o
  1766. [ 36%] Building CXX object gnuradio-core/src/lib/CMakeFiles/gnuradio-core.dir/filter/gr_pfb_interpolator_ccf.cc.o
  1767. [ 36%] Building CXX object gnuradio-core/src/lib/CMakeFiles/gnuradio-core.dir/filter/gr_pfb_arb_resampler_ccf.cc.o
  1768. [ 36%] Building CXX object gnuradio-core/src/lib/CMakeFiles/gnuradio-core.dir/filter/gr_pfb_arb_resampler_fff.cc.o
  1769. [ 36%] Building CXX object gnuradio-core/src/lib/CMakeFiles/gnuradio-core.dir/filter/gr_pfb_clock_sync_ccf.cc.o
  1770. [ 36%] Building CXX object gnuradio-core/src/lib/CMakeFiles/gnuradio-core.dir/filter/gr_pfb_clock_sync_fff.cc.o
  1771. [ 36%] Building C object gnuradio-core/src/lib/CMakeFiles/gnuradio-core.dir/viterbi/metrics.c.o
  1772. [ 36%] Building C object gnuradio-core/src/lib/CMakeFiles/gnuradio-core.dir/viterbi/tab.c.o
  1773. [ 36%] [ 36%] [ 37%] [ 37%] Building C object gnuradio-core/src/lib/CMakeFiles/gnuradio-core.dir/viterbi/viterbi.c.o
  1774. Building CXX object gnuradio-core/src/lib/CMakeFiles/gnuradio-core.dir/general/gr_constants.cc.o
  1775. Building CXX object gnuradio-core/src/lib/CMakeFiles/gnuradio-core.dir/general/gr_count_bits.cc.o
  1776. Building CXX object gnuradio-core/src/lib/CMakeFiles/gnuradio-core.dir/general/gr_circular_file.cc.o
  1777. [ 37%] Building CXX object gnuradio-core/src/lib/CMakeFiles/gnuradio-core.dir/general/gr_fast_atan2f.cc.o
  1778. [ 37%] Building CXX object gnuradio-core/src/lib/CMakeFiles/gnuradio-core.dir/general/gr_fft_vcc_fftw.cc.o
  1779. [ 37%] Building CXX object gnuradio-core/src/lib/CMakeFiles/gnuradio-core.dir/general/gr_fxpt.cc.o
  1780. [ 37%] Building CXX object gnuradio-core/src/lib/CMakeFiles/gnuradio-core.dir/general/gr_misc.cc.o
  1781. [ 37%] Building CXX object gnuradio-core/src/lib/CMakeFiles/gnuradio-core.dir/general/gr_random.cc.o
  1782. [ 37%] Building CXX object gnuradio-core/src/lib/CMakeFiles/gnuradio-core.dir/general/gr_reverse.cc.o
  1783. [ 37%] [ 37%] Building CXX object gnuradio-core/src/lib/CMakeFiles/gnuradio-core.dir/general/gri_add_const_ss_generic.cc.o
  1784. Building CXX object gnuradio-core/src/lib/CMakeFiles/gnuradio-core.dir/general/gri_char_to_float.cc.o
  1785. [ 37%] [ 37%] Building CXX object gnuradio-core/src/lib/CMakeFiles/gnuradio-core.dir/general/gri_control_loop.cc.o
  1786. Building CXX object gnuradio-core/src/lib/CMakeFiles/gnuradio-core.dir/general/gri_debugger_hook.cc.o
  1787. [ 37%] Building CXX object gnuradio-core/src/lib/CMakeFiles/gnuradio-core.dir/general/gri_fft.cc.o
  1788. [ 37%] Building CXX object gnuradio-core/src/lib/CMakeFiles/gnuradio-core.dir/general/gri_float_to_char.cc.o
  1789. [ 37%] Building CXX object gnuradio-core/src/lib/CMakeFiles/gnuradio-core.dir/general/gri_float_to_int.cc.o
  1790. [ 37%] Building CXX object gnuradio-core/src/lib/CMakeFiles/gnuradio-core.dir/general/gri_float_to_short.cc.o
  1791. [ 37%] Building CXX object gnuradio-core/src/lib/CMakeFiles/gnuradio-core.dir/general/gri_float_to_uchar.cc.o
  1792. [ 37%] Building CXX object gnuradio-core/src/lib/CMakeFiles/gnuradio-core.dir/general/gri_glfsr.cc.o
  1793. [ 37%] Building CXX object gnuradio-core/src/lib/CMakeFiles/gnuradio-core.dir/general/gri_interleaved_short_to_complex.cc.o
  1794. [ 38%] Building CXX object gnuradio-core/src/lib/CMakeFiles/gnuradio-core.dir/general/gri_int_to_float.cc.o
  1795. [ 38%] Building CXX object gnuradio-core/src/lib/CMakeFiles/gnuradio-core.dir/general/gri_short_to_float.cc.o
  1796. [ 38%] Building CXX object gnuradio-core/src/lib/CMakeFiles/gnuradio-core.dir/general/gri_uchar_to_float.cc.o
  1797. [ 38%] Building C object gnuradio-core/src/lib/CMakeFiles/gnuradio-core.dir/general/malloc16.c.o
  1798. [ 38%] Building CXX object gnuradio-core/src/lib/CMakeFiles/gnuradio-core.dir/general/complex_vec_test.cc.o
  1799. [ 38%] Building CXX object gnuradio-core/src/lib/CMakeFiles/gnuradio-core.dir/general/gr_add_ff.cc.o
  1800. [ 38%] Building CXX object gnuradio-core/src/lib/CMakeFiles/gnuradio-core.dir/general/gr_additive_scrambler_bb.cc.o
  1801. [ 38%] Building CXX object gnuradio-core/src/lib/CMakeFiles/gnuradio-core.dir/general/gr_agc_cc.cc.o
  1802. [ 38%] Building CXX object gnuradio-core/src/lib/CMakeFiles/gnuradio-core.dir/general/gr_agc_ff.cc.o
  1803. [ 38%] Building CXX object gnuradio-core/src/lib/CMakeFiles/gnuradio-core.dir/general/gr_agc2_cc.cc.o
  1804. [ 38%] Building CXX object gnuradio-core/src/lib/CMakeFiles/gnuradio-core.dir/general/gr_agc2_ff.cc.o
  1805. [ 38%] Building CXX object gnuradio-core/src/lib/CMakeFiles/gnuradio-core.dir/general/gr_align_on_samplenumbers_ss.cc.o
  1806. [ 38%] Building CXX object gnuradio-core/src/lib/CMakeFiles/gnuradio-core.dir/general/gr_bin_statistics_f.cc.o
  1807. [ 38%] Building CXX object gnuradio-core/src/lib/CMakeFiles/gnuradio-core.dir/general/gr_block_gateway.cc.o
  1808. [ 38%] Building CXX object gnuradio-core/src/lib/CMakeFiles/gnuradio-core.dir/general/gr_bytes_to_syms.cc.o
  1809. [ 38%] Building CXX object gnuradio-core/src/lib/CMakeFiles/gnuradio-core.dir/general/gr_char_to_float.cc.o
  1810. [ 38%] Building CXX object gnuradio-core/src/lib/CMakeFiles/gnuradio-core.dir/general/gr_char_to_short.cc.o
  1811. [ 38%] Building CXX object gnuradio-core/src/lib/CMakeFiles/gnuradio-core.dir/general/gr_check_counting_s.cc.o
  1812. [ 38%] Building CXX object gnuradio-core/src/lib/CMakeFiles/gnuradio-core.dir/general/gr_check_lfsr_32k_s.cc.o
  1813. [ 39%] Building CXX object gnuradio-core/src/lib/CMakeFiles/gnuradio-core.dir/general/gr_complex_to_interleaved_short.cc.o
  1814. [ 39%] Building CXX object gnuradio-core/src/lib/CMakeFiles/gnuradio-core.dir/general/gr_complex_to_xxx.cc.o
  1815. [ 39%] Building CXX object gnuradio-core/src/lib/CMakeFiles/gnuradio-core.dir/general/gr_conjugate_cc.cc.o
  1816. [ 39%] Building CXX object gnuradio-core/src/lib/CMakeFiles/gnuradio-core.dir/general/gr_copy.cc.o
  1817. [ 39%] Building CXX object gnuradio-core/src/lib/CMakeFiles/gnuradio-core.dir/general/gr_cpfsk_bc.cc.o
  1818. [ 39%] Building CXX object gnuradio-core/src/lib/CMakeFiles/gnuradio-core.dir/general/gr_cpm.cc.o
  1819. [ 39%] Building CXX object gnuradio-core/src/lib/CMakeFiles/gnuradio-core.dir/general/gr_ctcss_squelch_ff.cc.o
  1820. [ 39%] Building CXX object gnuradio-core/src/lib/CMakeFiles/gnuradio-core.dir/general/gr_decode_ccsds_27_fb.cc.o
  1821. [ 39%] Building CXX object gnuradio-core/src/lib/CMakeFiles/gnuradio-core.dir/general/gr_diff_decoder_bb.cc.o
  1822. [ 39%] Building CXX object gnuradio-core/src/lib/CMakeFiles/gnuradio-core.dir/general/gr_diff_encoder_bb.cc.o
  1823. [ 39%] Building CXX object gnuradio-core/src/lib/CMakeFiles/gnuradio-core.dir/general/gr_diff_phasor_cc.cc.o
  1824. [ 39%] Building CXX object gnuradio-core/src/lib/CMakeFiles/gnuradio-core.dir/general/gr_dpll_bb.cc.o
  1825. [ 39%] Building CXX object gnuradio-core/src/lib/CMakeFiles/gnuradio-core.dir/general/gr_deinterleave.cc.o
  1826. [ 39%] Building CXX object gnuradio-core/src/lib/CMakeFiles/gnuradio-core.dir/general/gr_delay.cc.o
  1827. [ 39%] Building CXX object gnuradio-core/src/lib/CMakeFiles/gnuradio-core.dir/general/gr_encode_ccsds_27_bb.cc.o
  1828. [ 39%] Building CXX object gnuradio-core/src/lib/CMakeFiles/gnuradio-core.dir/general/gr_endian_swap.cc.o
  1829. [ 39%] Building CXX object gnuradio-core/src/lib/CMakeFiles/gnuradio-core.dir/general/gr_fake_channel_coder_pp.cc.o
  1830. [ 39%] Building CXX object gnuradio-core/src/lib/CMakeFiles/gnuradio-core.dir/general/gr_feedforward_agc_cc.cc.o
  1831. [ 39%] Building CXX object gnuradio-core/src/lib/CMakeFiles/gnuradio-core.dir/general/gr_feval.cc.o
  1832. [ 40%] Building CXX object gnuradio-core/src/lib/CMakeFiles/gnuradio-core.dir/general/gr_fft_vcc.cc.o
  1833. [ 40%] Building CXX object gnuradio-core/src/lib/CMakeFiles/gnuradio-core.dir/general/gr_fft_vfc.cc.o
  1834. [ 40%] Building CXX object gnuradio-core/src/lib/CMakeFiles/gnuradio-core.dir/general/gr_firdes.cc.o
  1835. [ 40%] Building CXX object gnuradio-core/src/lib/CMakeFiles/gnuradio-core.dir/general/gr_float_to_char.cc.o
  1836. [ 40%] Building CXX object gnuradio-core/src/lib/CMakeFiles/gnuradio-core.dir/general/gr_float_to_complex.cc.o
  1837. [ 40%] Building CXX object gnuradio-core/src/lib/CMakeFiles/gnuradio-core.dir/general/gr_float_to_int.cc.o
  1838. [ 40%] Building CXX object gnuradio-core/src/lib/CMakeFiles/gnuradio-core.dir/general/gr_float_to_short.cc.o
  1839. [ 40%] Building CXX object gnuradio-core/src/lib/CMakeFiles/gnuradio-core.dir/general/gr_float_to_uchar.cc.o
  1840. [ 40%] Building CXX object gnuradio-core/src/lib/CMakeFiles/gnuradio-core.dir/general/gr_fmdet_cf.cc.o
  1841. [ 40%] Building CXX object gnuradio-core/src/lib/CMakeFiles/gnuradio-core.dir/general/gr_frequency_modulator_fc.cc.o
  1842. [ 40%] Building CXX object gnuradio-core/src/lib/CMakeFiles/gnuradio-core.dir/general/gr_framer_sink_1.cc.o
  1843. [ 40%] Building CXX object gnuradio-core/src/lib/CMakeFiles/gnuradio-core.dir/general/gr_glfsr_source_b.cc.o
  1844. [ 40%] Building CXX object gnuradio-core/src/lib/CMakeFiles/gnuradio-core.dir/general/gr_glfsr_source_f.cc.o
  1845. [ 40%] Building CXX object gnuradio-core/src/lib/CMakeFiles/gnuradio-core.dir/general/gr_head.cc.o
  1846. [ 40%] Building CXX object gnuradio-core/src/lib/CMakeFiles/gnuradio-core.dir/general/gr_int_to_float.cc.o
  1847. [ 40%] Building CXX object gnuradio-core/src/lib/CMakeFiles/gnuradio-core.dir/general/gr_interleave.cc.o
  1848. [ 40%] Building CXX object gnuradio-core/src/lib/CMakeFiles/gnuradio-core.dir/general/gr_interleaved_short_to_complex.cc.o
  1849. [ 40%] Building CXX object gnuradio-core/src/lib/CMakeFiles/gnuradio-core.dir/general/gr_iqcomp_cc.cc.o
  1850. [ 40%] Building CXX object gnuradio-core/src/lib/CMakeFiles/gnuradio-core.dir/general/gr_keep_one_in_n.cc.o
  1851. [ 41%] Building CXX object gnuradio-core/src/lib/CMakeFiles/gnuradio-core.dir/general/gr_keep_m_in_n.cc.o
  1852. [ 41%] Building CXX object gnuradio-core/src/lib/CMakeFiles/gnuradio-core.dir/general/gr_kludge_copy.cc.o
  1853. [ 41%] Building CXX object gnuradio-core/src/lib/CMakeFiles/gnuradio-core.dir/general/gr_lfsr_32k_source_s.cc.o
  1854. [ 41%] Building CXX object gnuradio-core/src/lib/CMakeFiles/gnuradio-core.dir/general/gr_map_bb.cc.o
  1855. [ 41%] Building CXX object gnuradio-core/src/lib/CMakeFiles/gnuradio-core.dir/general/gr_multiply_cc.cc.o
  1856. [ 41%] Building CXX object gnuradio-core/src/lib/CMakeFiles/gnuradio-core.dir/general/gr_multiply_ff.cc.o
  1857. [ 41%] Building CXX object gnuradio-core/src/lib/CMakeFiles/gnuradio-core.dir/general/gr_multiply_const_cc.cc.o
  1858. [ 41%] Building CXX object gnuradio-core/src/lib/CMakeFiles/gnuradio-core.dir/general/gr_multiply_const_ff.cc.o
  1859. [ 41%] Building CXX object gnuradio-core/src/lib/CMakeFiles/gnuradio-core.dir/general/gr_multiply_conjugate_cc.cc.o
  1860. [ 41%] Building CXX object gnuradio-core/src/lib/CMakeFiles/gnuradio-core.dir/general/gr_nlog10_ff.cc.o
  1861. [ 41%] Building CXX object gnuradio-core/src/lib/CMakeFiles/gnuradio-core.dir/general/gr_nop.cc.o
  1862. [ 41%] Building CXX object gnuradio-core/src/lib/CMakeFiles/gnuradio-core.dir/general/gr_null_sink.cc.o
  1863. [ 41%] Building CXX object gnuradio-core/src/lib/CMakeFiles/gnuradio-core.dir/general/gr_null_source.cc.o
  1864. [ 41%] Building CXX object gnuradio-core/src/lib/CMakeFiles/gnuradio-core.dir/general/gr_pa_2x2_phase_combiner.cc.o
  1865. [ 41%] Building CXX object gnuradio-core/src/lib/CMakeFiles/gnuradio-core.dir/general/gr_packet_sink.cc.o
  1866. [ 41%] Building CXX object gnuradio-core/src/lib/CMakeFiles/gnuradio-core.dir/general/gr_peak_detector2_fb.cc.o
  1867. [ 41%] Building CXX object gnuradio-core/src/lib/CMakeFiles/gnuradio-core.dir/general/gr_phase_modulator_fc.cc.o
  1868. [ 41%] Building CXX object gnuradio-core/src/lib/CMakeFiles/gnuradio-core.dir/general/gr_pll_carriertracking_cc.cc.o
  1869. [ 41%] Building CXX object gnuradio-core/src/lib/CMakeFiles/gnuradio-core.dir/general/gr_pll_freqdet_cf.cc.o
  1870. [ 41%] Building CXX object gnuradio-core/src/lib/CMakeFiles/gnuradio-core.dir/general/gr_pll_refout_cc.cc.o
  1871. [ 42%] Building CXX object gnuradio-core/src/lib/CMakeFiles/gnuradio-core.dir/general/gr_pn_correlator_cc.cc.o
  1872. [ 42%] Building CXX object gnuradio-core/src/lib/CMakeFiles/gnuradio-core.dir/general/gr_prefs.cc.o
  1873. [ 42%] Building CXX object gnuradio-core/src/lib/CMakeFiles/gnuradio-core.dir/general/gr_probe_avg_mag_sqrd_c.cc.o
  1874. [ 42%] Building CXX object gnuradio-core/src/lib/CMakeFiles/gnuradio-core.dir/general/gr_probe_avg_mag_sqrd_cf.cc.o
  1875. [ 42%] Building CXX object gnuradio-core/src/lib/CMakeFiles/gnuradio-core.dir/general/gr_probe_avg_mag_sqrd_f.cc.o
  1876. [ 42%] Building CXX object gnuradio-core/src/lib/CMakeFiles/gnuradio-core.dir/general/gr_pwr_squelch_cc.cc.o
  1877. [ 42%] Building CXX object gnuradio-core/src/lib/CMakeFiles/gnuradio-core.dir/general/gr_pwr_squelch_ff.cc.o
  1878. [ 42%] Building CXX object gnuradio-core/src/lib/CMakeFiles/gnuradio-core.dir/general/gr_quadrature_demod_cf.cc.o
  1879. [ 42%] Building CXX object gnuradio-core/src/lib/CMakeFiles/gnuradio-core.dir/general/gr_random_pdu.cc.o
  1880. [ 42%] Building CXX object gnuradio-core/src/lib/CMakeFiles/gnuradio-core.dir/general/gr_rail_ff.cc.o
  1881. [ 42%] [ 42%] Building CXX object gnuradio-core/src/lib/CMakeFiles/gnuradio-core.dir/general/gr_regenerate_bb.cc.o
  1882. Building CXX object gnuradio-core/src/lib/CMakeFiles/gnuradio-core.dir/general/gr_remez.cc.o
  1883. [ 42%] Building CXX object gnuradio-core/src/lib/CMakeFiles/gnuradio-core.dir/general/gr_rms_cf.cc.o
  1884. [ 42%] Building CXX object gnuradio-core/src/lib/CMakeFiles/gnuradio-core.dir/general/gr_rms_ff.cc.o
  1885. [ 42%] Building CXX object gnuradio-core/src/lib/CMakeFiles/gnuradio-core.dir/general/gr_repeat.cc.o
  1886. [ 42%] Building CXX object gnuradio-core/src/lib/CMakeFiles/gnuradio-core.dir/general/gr_short_to_float.cc.o
  1887. [ 42%] Building CXX object gnuradio-core/src/lib/CMakeFiles/gnuradio-core.dir/general/gr_short_to_char.cc.o
  1888. [ 42%] Building CXX object gnuradio-core/src/lib/CMakeFiles/gnuradio-core.dir/general/gr_simple_correlator.cc.o
  1889. [ 42%] Building CXX object gnuradio-core/src/lib/CMakeFiles/gnuradio-core.dir/general/gr_simple_framer.cc.o
  1890. [ 43%] Building CXX object gnuradio-core/src/lib/CMakeFiles/gnuradio-core.dir/general/gr_simple_squelch_cc.cc.o
  1891. [ 43%] Building CXX object gnuradio-core/src/lib/CMakeFiles/gnuradio-core.dir/general/gr_skiphead.cc.o
  1892. [ 43%] Building CXX object gnuradio-core/src/lib/CMakeFiles/gnuradio-core.dir/general/gr_squelch_base_cc.cc.o
  1893. [ 43%] Building CXX object gnuradio-core/src/lib/CMakeFiles/gnuradio-core.dir/general/gr_squelch_base_ff.cc.o
  1894. [ 43%] [ 43%] Building CXX object gnuradio-core/src/lib/CMakeFiles/gnuradio-core.dir/general/gr_stream_mux.cc.o
  1895. Building CXX object gnuradio-core/src/lib/CMakeFiles/gnuradio-core.dir/general/gr_stream_to_streams.cc.o
  1896. [ 43%] Building CXX object gnuradio-core/src/lib/CMakeFiles/gnuradio-core.dir/general/gr_stream_to_vector.cc.o
  1897. [ 43%] Building CXX object gnuradio-core/src/lib/CMakeFiles/gnuradio-core.dir/general/gr_streams_to_stream.cc.o
  1898. [ 43%] Building CXX object gnuradio-core/src/lib/CMakeFiles/gnuradio-core.dir/general/gr_streams_to_vector.cc.o
  1899. [ 43%] [ 43%] Building CXX object gnuradio-core/src/lib/CMakeFiles/gnuradio-core.dir/general/gr_stretch_ff.cc.o
  1900. Building CXX object gnuradio-core/src/lib/CMakeFiles/gnuradio-core.dir/general/gr_test.cc.o
  1901. [ 43%] Building CXX object gnuradio-core/src/lib/CMakeFiles/gnuradio-core.dir/general/gr_threshold_ff.cc.o
  1902. [ 43%] Building CXX object gnuradio-core/src/lib/CMakeFiles/gnuradio-core.dir/general/gr_throttle.cc.o
  1903. [ 43%] Building CXX object gnuradio-core/src/lib/CMakeFiles/gnuradio-core.dir/general/gr_transcendental.cc.o
  1904. [ 43%] Building CXX object gnuradio-core/src/lib/CMakeFiles/gnuradio-core.dir/general/gr_uchar_to_float.cc.o
  1905. [ 43%] Building CXX object gnuradio-core/src/lib/CMakeFiles/gnuradio-core.dir/general/gr_vco_f.cc.o
  1906. [ 43%] Building CXX object gnuradio-core/src/lib/CMakeFiles/gnuradio-core.dir/general/gr_vector_map.cc.o
  1907. [ 43%] Building CXX object gnuradio-core/src/lib/CMakeFiles/gnuradio-core.dir/general/gr_vector_to_stream.cc.o
  1908. [ 43%] Building CXX object gnuradio-core/src/lib/CMakeFiles/gnuradio-core.dir/general/gr_vector_to_streams.cc.o
  1909. [ 44%] Building CXX object gnuradio-core/src/lib/CMakeFiles/gnuradio-core.dir/general/gr_unpack_k_bits_bb.cc.o
  1910. [ 44%] Building CXX object gnuradio-core/src/lib/CMakeFiles/gnuradio-core.dir/general/gr_pack_k_bits_bb.cc.o
  1911. [ 44%] Building CXX object gnuradio-core/src/lib/CMakeFiles/gnuradio-core.dir/general/gr_descrambler_bb.cc.o
  1912. [ 44%] Building CXX object gnuradio-core/src/lib/CMakeFiles/gnuradio-core.dir/general/gr_scrambler_bb.cc.o
  1913. [ 44%] Building CXX object gnuradio-core/src/lib/CMakeFiles/gnuradio-core.dir/general/gr_probe_density_b.cc.o
  1914. [ 44%] Building CXX object gnuradio-core/src/lib/CMakeFiles/gnuradio-core.dir/general/gr_annotator_alltoall.cc.o
  1915. [ 44%] Building CXX object gnuradio-core/src/lib/CMakeFiles/gnuradio-core.dir/general/gr_annotator_1to1.cc.o
  1916. [ 44%] Building CXX object gnuradio-core/src/lib/CMakeFiles/gnuradio-core.dir/general/gr_annotator_raw.cc.o
  1917. [ 44%] Building CXX object gnuradio-core/src/lib/CMakeFiles/gnuradio-core.dir/general/gr_burst_tagger.cc.o
  1918. [ 44%] Building CXX object gnuradio-core/src/lib/CMakeFiles/gnuradio-core.dir/general/gr_correlate_access_code_tag_bb.cc.o
  1919. [ 44%] Building CXX object gnuradio-core/src/lib/CMakeFiles/gnuradio-core.dir/general/gr_tag_debug.cc.o
  1920. [ 44%] Building CXX object gnuradio-core/src/lib/CMakeFiles/gnuradio-core.dir/general/gr_message_strobe.cc.o
  1921. [ 44%] Building CXX object gnuradio-core/src/lib/CMakeFiles/gnuradio-core.dir/gengen/gr_vector_source_b.cc.o
  1922. [ 44%] Building CXX object gnuradio-core/src/lib/CMakeFiles/gnuradio-core.dir/gengen/gr_vector_source_s.cc.o
  1923. [ 44%] Building CXX object gnuradio-core/src/lib/CMakeFiles/gnuradio-core.dir/gengen/gr_vector_source_i.cc.o
  1924. [ 44%] Building CXX object gnuradio-core/src/lib/CMakeFiles/gnuradio-core.dir/gengen/gr_vector_source_f.cc.o
  1925. [ 44%] Building CXX object gnuradio-core/src/lib/CMakeFiles/gnuradio-core.dir/gengen/gr_vector_source_c.cc.o
  1926. [ 44%] Building CXX object gnuradio-core/src/lib/CMakeFiles/gnuradio-core.dir/gengen/gr_vector_insert_b.cc.o
  1927. [ 44%] Building CXX object gnuradio-core/src/lib/CMakeFiles/gnuradio-core.dir/gengen/gr_vector_sink_b.cc.o
  1928. [ 45%] Building CXX object gnuradio-core/src/lib/CMakeFiles/gnuradio-core.dir/gengen/gr_vector_sink_s.cc.o
  1929. [ 45%] Building CXX object gnuradio-core/src/lib/CMakeFiles/gnuradio-core.dir/gengen/gr_vector_sink_i.cc.o
  1930. [ 45%] Building CXX object gnuradio-core/src/lib/CMakeFiles/gnuradio-core.dir/gengen/gr_vector_sink_f.cc.o
  1931. [ 45%] Building CXX object gnuradio-core/src/lib/CMakeFiles/gnuradio-core.dir/gengen/gr_vector_sink_c.cc.o
  1932. [ 45%] Building CXX object gnuradio-core/src/lib/CMakeFiles/gnuradio-core.dir/gengen/gr_noise_source_s.cc.o
  1933. [ 45%] Building CXX object gnuradio-core/src/lib/CMakeFiles/gnuradio-core.dir/gengen/gr_noise_source_i.cc.o
  1934. [ 45%] Building CXX object gnuradio-core/src/lib/CMakeFiles/gnuradio-core.dir/gengen/gr_noise_source_f.cc.o
  1935. [ 45%] Building CXX object gnuradio-core/src/lib/CMakeFiles/gnuradio-core.dir/gengen/gr_noise_source_c.cc.o
  1936. [ 45%] Building CXX object gnuradio-core/src/lib/CMakeFiles/gnuradio-core.dir/gengen/gr_fastnoise_source_s.cc.o
  1937. [ 45%] Building CXX object gnuradio-core/src/lib/CMakeFiles/gnuradio-core.dir/gengen/gr_fastnoise_source_i.cc.o
  1938. [ 45%] Building CXX object gnuradio-core/src/lib/CMakeFiles/gnuradio-core.dir/gengen/gr_fastnoise_source_f.cc.o
  1939. [ 45%] Building CXX object gnuradio-core/src/lib/CMakeFiles/gnuradio-core.dir/gengen/gr_fastnoise_source_c.cc.o
  1940. [ 45%] Building CXX object gnuradio-core/src/lib/CMakeFiles/gnuradio-core.dir/gengen/gr_sig_source_s.cc.o
  1941. [ 45%] Building CXX object gnuradio-core/src/lib/CMakeFiles/gnuradio-core.dir/gengen/gr_sig_source_i.cc.o
  1942. [ 45%] Building CXX object gnuradio-core/src/lib/CMakeFiles/gnuradio-core.dir/gengen/gr_sig_source_f.cc.o
  1943. [ 45%] Building CXX object gnuradio-core/src/lib/CMakeFiles/gnuradio-core.dir/gengen/gr_sig_source_c.cc.o
  1944. [ 45%] Building CXX object gnuradio-core/src/lib/CMakeFiles/gnuradio-core.dir/gengen/gr_probe_signal_b.cc.o
  1945. [ 45%] Building CXX object gnuradio-core/src/lib/CMakeFiles/gnuradio-core.dir/gengen/gr_probe_signal_s.cc.o
  1946. [ 45%] Building CXX object gnuradio-core/src/lib/CMakeFiles/gnuradio-core.dir/gengen/gr_probe_signal_i.cc.o
  1947. [ 46%] Building CXX object gnuradio-core/src/lib/CMakeFiles/gnuradio-core.dir/gengen/gr_probe_signal_f.cc.o
  1948. [ 46%] Building CXX object gnuradio-core/src/lib/CMakeFiles/gnuradio-core.dir/gengen/gr_probe_signal_c.cc.o
  1949. [ 46%] Building CXX object gnuradio-core/src/lib/CMakeFiles/gnuradio-core.dir/gengen/gr_probe_signal_vb.cc.o
  1950. [ 46%] Building CXX object gnuradio-core/src/lib/CMakeFiles/gnuradio-core.dir/gengen/gr_probe_signal_vs.cc.o
  1951. [ 46%] Building CXX object gnuradio-core/src/lib/CMakeFiles/gnuradio-core.dir/gengen/gr_probe_signal_vi.cc.o
  1952. [ 46%] Building CXX object gnuradio-core/src/lib/CMakeFiles/gnuradio-core.dir/gengen/gr_probe_signal_vf.cc.o
  1953. [ 46%] Building CXX object gnuradio-core/src/lib/CMakeFiles/gnuradio-core.dir/gengen/gr_probe_signal_vc.cc.o
  1954. [ 46%] Building CXX object gnuradio-core/src/lib/CMakeFiles/gnuradio-core.dir/gengen/gr_add_const_bb.cc.o
  1955. [ 46%] Building CXX object gnuradio-core/src/lib/CMakeFiles/gnuradio-core.dir/gengen/gr_add_const_ss.cc.o
  1956. [ 46%] Building CXX object gnuradio-core/src/lib/CMakeFiles/gnuradio-core.dir/gengen/gr_add_const_ii.cc.o
  1957. [ 46%] Building CXX object gnuradio-core/src/lib/CMakeFiles/gnuradio-core.dir/gengen/gr_add_const_ff.cc.o
  1958. [ 46%] Building CXX object gnuradio-core/src/lib/CMakeFiles/gnuradio-core.dir/gengen/gr_add_const_cc.cc.o
  1959. [ 46%] Building CXX object gnuradio-core/src/lib/CMakeFiles/gnuradio-core.dir/gengen/gr_add_const_sf.cc.o
  1960. [ 46%] Building CXX object gnuradio-core/src/lib/CMakeFiles/gnuradio-core.dir/gengen/gr_multiply_const_ss.cc.o
  1961. [ 46%] Building CXX object gnuradio-core/src/lib/CMakeFiles/gnuradio-core.dir/gengen/gr_multiply_const_ii.cc.o
  1962. [ 46%] Building CXX object gnuradio-core/src/lib/CMakeFiles/gnuradio-core.dir/gengen/gr_add_ss.cc.o
  1963. [ 46%] Building CXX object gnuradio-core/src/lib/CMakeFiles/gnuradio-core.dir/gengen/gr_add_ii.cc.o
  1964. [ 46%] Building CXX object gnuradio-core/src/lib/CMakeFiles/gnuradio-core.dir/gengen/gr_add_cc.cc.o
  1965. [ 46%] Building CXX object gnuradio-core/src/lib/CMakeFiles/gnuradio-core.dir/gengen/gr_sub_ss.cc.o
  1966. [ 47%] Building CXX object gnuradio-core/src/lib/CMakeFiles/gnuradio-core.dir/gengen/gr_sub_ii.cc.o
  1967. [ 47%] Building CXX object gnuradio-core/src/lib/CMakeFiles/gnuradio-core.dir/gengen/gr_sub_ff.cc.o
  1968. [ 47%] Building CXX object gnuradio-core/src/lib/CMakeFiles/gnuradio-core.dir/gengen/gr_sub_cc.cc.o
  1969. [ 47%] Building CXX object gnuradio-core/src/lib/CMakeFiles/gnuradio-core.dir/gengen/gr_multiply_ss.cc.o
  1970. [ 47%] Building CXX object gnuradio-core/src/lib/CMakeFiles/gnuradio-core.dir/gengen/gr_multiply_ii.cc.o
  1971. [ 47%] Building CXX object gnuradio-core/src/lib/CMakeFiles/gnuradio-core.dir/gengen/gr_divide_ss.cc.o
  1972. [ 47%] Building CXX object gnuradio-core/src/lib/CMakeFiles/gnuradio-core.dir/gengen/gr_divide_ii.cc.o
  1973. [ 47%] Building CXX object gnuradio-core/src/lib/CMakeFiles/gnuradio-core.dir/gengen/gr_divide_ff.cc.o
  1974. [ 47%] Building CXX object gnuradio-core/src/lib/CMakeFiles/gnuradio-core.dir/gengen/gr_divide_cc.cc.o
  1975. [ 47%] Building CXX object gnuradio-core/src/lib/CMakeFiles/gnuradio-core.dir/gengen/gr_mute_ss.cc.o
  1976. [ 47%] Building CXX object gnuradio-core/src/lib/CMakeFiles/gnuradio-core.dir/gengen/gr_mute_ii.cc.o
  1977. [ 47%] Building CXX object gnuradio-core/src/lib/CMakeFiles/gnuradio-core.dir/gengen/gr_mute_ff.cc.o
  1978. [ 47%] Building CXX object gnuradio-core/src/lib/CMakeFiles/gnuradio-core.dir/gengen/gr_mute_cc.cc.o
  1979. [ 47%] Building CXX object gnuradio-core/src/lib/CMakeFiles/gnuradio-core.dir/gengen/gr_add_const_vss.cc.o
  1980. [ 47%] Building CXX object gnuradio-core/src/lib/CMakeFiles/gnuradio-core.dir/gengen/gr_add_const_vii.cc.o
  1981. [ 47%] Building CXX object gnuradio-core/src/lib/CMakeFiles/gnuradio-core.dir/gengen/gr_add_const_vff.cc.o
  1982. [ 47%] Building CXX object gnuradio-core/src/lib/CMakeFiles/gnuradio-core.dir/gengen/gr_add_const_vcc.cc.o
  1983. [ 47%] Building CXX object gnuradio-core/src/lib/CMakeFiles/gnuradio-core.dir/gengen/gr_multiply_const_vss.cc.o
  1984. [ 47%] Building CXX object gnuradio-core/src/lib/CMakeFiles/gnuradio-core.dir/gengen/gr_multiply_const_vii.cc.o
  1985. [ 48%] Building CXX object gnuradio-core/src/lib/CMakeFiles/gnuradio-core.dir/gengen/gr_multiply_const_vff.cc.o
  1986. [ 48%] Building CXX object gnuradio-core/src/lib/CMakeFiles/gnuradio-core.dir/gengen/gr_multiply_const_vcc.cc.o
  1987. [ 48%] Building CXX object gnuradio-core/src/lib/CMakeFiles/gnuradio-core.dir/gengen/gr_integrate_ss.cc.o
  1988. [ 48%] Building CXX object gnuradio-core/src/lib/CMakeFiles/gnuradio-core.dir/gengen/gr_integrate_ii.cc.o
  1989. [ 48%] Building CXX object gnuradio-core/src/lib/CMakeFiles/gnuradio-core.dir/gengen/gr_integrate_ff.cc.o
  1990. [ 48%] Building CXX object gnuradio-core/src/lib/CMakeFiles/gnuradio-core.dir/gengen/gr_integrate_cc.cc.o
  1991. [ 48%] Building CXX object gnuradio-core/src/lib/CMakeFiles/gnuradio-core.dir/gengen/gr_moving_average_ss.cc.o
  1992. [ 48%] Building CXX object gnuradio-core/src/lib/CMakeFiles/gnuradio-core.dir/gengen/gr_moving_average_ii.cc.o
  1993. [ 48%] Building CXX object gnuradio-core/src/lib/CMakeFiles/gnuradio-core.dir/gengen/gr_moving_average_ff.cc.o
  1994. [ 48%] Building CXX object gnuradio-core/src/lib/CMakeFiles/gnuradio-core.dir/gengen/gr_moving_average_cc.cc.o
  1995. [ 48%] Building CXX object gnuradio-core/src/lib/CMakeFiles/gnuradio-core.dir/gengen/gr_chunks_to_symbols_bf.cc.o
  1996. [ 48%] Building CXX object gnuradio-core/src/lib/CMakeFiles/gnuradio-core.dir/gengen/gr_chunks_to_symbols_bc.cc.o
  1997. [ 48%] Building CXX object gnuradio-core/src/lib/CMakeFiles/gnuradio-core.dir/gengen/gr_chunks_to_symbols_sf.cc.o
  1998. [ 48%] Building CXX object gnuradio-core/src/lib/CMakeFiles/gnuradio-core.dir/gengen/gr_chunks_to_symbols_sc.cc.o
  1999. [ 48%] Building CXX object gnuradio-core/src/lib/CMakeFiles/gnuradio-core.dir/gengen/gr_chunks_to_symbols_if.cc.o
  2000. [ 48%] Building CXX object gnuradio-core/src/lib/CMakeFiles/gnuradio-core.dir/gengen/gr_chunks_to_symbols_ic.cc.o
  2001. [ 48%] Building CXX object gnuradio-core/src/lib/CMakeFiles/gnuradio-core.dir/gengen/gr_unpacked_to_packed_bb.cc.o
  2002. [ 48%] Building CXX object gnuradio-core/src/lib/CMakeFiles/gnuradio-core.dir/gengen/gr_unpacked_to_packed_ss.cc.o
  2003. [ 48%] Building CXX object gnuradio-core/src/lib/CMakeFiles/gnuradio-core.dir/gengen/gr_unpacked_to_packed_ii.cc.o
  2004. [ 49%] Building CXX object gnuradio-core/src/lib/CMakeFiles/gnuradio-core.dir/gengen/gr_packed_to_unpacked_bb.cc.o
  2005. [ 49%] Building CXX object gnuradio-core/src/lib/CMakeFiles/gnuradio-core.dir/gengen/gr_packed_to_unpacked_ss.cc.o
  2006. [ 49%] Building CXX object gnuradio-core/src/lib/CMakeFiles/gnuradio-core.dir/gengen/gr_packed_to_unpacked_ii.cc.o
  2007. [ 49%] Building CXX object gnuradio-core/src/lib/CMakeFiles/gnuradio-core.dir/gengen/gr_xor_bb.cc.o
  2008. [ 49%] Building CXX object gnuradio-core/src/lib/CMakeFiles/gnuradio-core.dir/gengen/gr_xor_ss.cc.o
  2009. [ 49%] Building CXX object gnuradio-core/src/lib/CMakeFiles/gnuradio-core.dir/gengen/gr_xor_ii.cc.o
  2010. [ 49%] Building CXX object gnuradio-core/src/lib/CMakeFiles/gnuradio-core.dir/gengen/gr_and_bb.cc.o
  2011. [ 49%] Building CXX object gnuradio-core/src/lib/CMakeFiles/gnuradio-core.dir/gengen/gr_and_ss.cc.o
  2012. [ 49%] Building CXX object gnuradio-core/src/lib/CMakeFiles/gnuradio-core.dir/gengen/gr_and_ii.cc.o
  2013. [ 49%] Building CXX object gnuradio-core/src/lib/CMakeFiles/gnuradio-core.dir/gengen/gr_and_const_bb.cc.o
  2014. [ 49%] Building CXX object gnuradio-core/src/lib/CMakeFiles/gnuradio-core.dir/gengen/gr_and_const_ss.cc.o
  2015. [ 49%] Building CXX object gnuradio-core/src/lib/CMakeFiles/gnuradio-core.dir/gengen/gr_and_const_ii.cc.o
  2016. [ 49%] Building CXX object gnuradio-core/src/lib/CMakeFiles/gnuradio-core.dir/gengen/gr_or_bb.cc.o
  2017. [ 49%] Building CXX object gnuradio-core/src/lib/CMakeFiles/gnuradio-core.dir/gengen/gr_or_ss.cc.o
  2018. [ 49%] Building CXX object gnuradio-core/src/lib/CMakeFiles/gnuradio-core.dir/gengen/gr_or_ii.cc.o
  2019. [ 49%] Building CXX object gnuradio-core/src/lib/CMakeFiles/gnuradio-core.dir/gengen/gr_not_bb.cc.o
  2020. [ 49%] Building CXX object gnuradio-core/src/lib/CMakeFiles/gnuradio-core.dir/gengen/gr_not_ss.cc.o
  2021. [ 49%] Building CXX object gnuradio-core/src/lib/CMakeFiles/gnuradio-core.dir/gengen/gr_not_ii.cc.o
  2022. [ 49%] Building CXX object gnuradio-core/src/lib/CMakeFiles/gnuradio-core.dir/gengen/gr_sample_and_hold_bb.cc.o
  2023. [ 50%] Building CXX object gnuradio-core/src/lib/CMakeFiles/gnuradio-core.dir/gengen/gr_sample_and_hold_ss.cc.o
  2024. [ 50%] Building CXX object gnuradio-core/src/lib/CMakeFiles/gnuradio-core.dir/gengen/gr_sample_and_hold_ii.cc.o
  2025. [ 50%] Building CXX object gnuradio-core/src/lib/CMakeFiles/gnuradio-core.dir/gengen/gr_sample_and_hold_ff.cc.o
  2026. [ 50%] Building CXX object gnuradio-core/src/lib/CMakeFiles/gnuradio-core.dir/gengen/gr_argmax_fs.cc.o
  2027. [ 50%] Building CXX object gnuradio-core/src/lib/CMakeFiles/gnuradio-core.dir/gengen/gr_argmax_is.cc.o
  2028. [ 50%] Building CXX object gnuradio-core/src/lib/CMakeFiles/gnuradio-core.dir/gengen/gr_argmax_ss.cc.o
  2029. [ 50%] Building CXX object gnuradio-core/src/lib/CMakeFiles/gnuradio-core.dir/gengen/gr_max_ff.cc.o
  2030. [ 50%] Building CXX object gnuradio-core/src/lib/CMakeFiles/gnuradio-core.dir/gengen/gr_max_ii.cc.o
  2031. [ 50%] Building CXX object gnuradio-core/src/lib/CMakeFiles/gnuradio-core.dir/gengen/gr_max_ss.cc.o
  2032. [ 50%] Building CXX object gnuradio-core/src/lib/CMakeFiles/gnuradio-core.dir/gengen/gr_peak_detector_fb.cc.o
  2033. [ 50%] Building CXX object gnuradio-core/src/lib/CMakeFiles/gnuradio-core.dir/gengen/gr_peak_detector_ib.cc.o
  2034. [ 50%] Building CXX object gnuradio-core/src/lib/CMakeFiles/gnuradio-core.dir/gengen/gr_peak_detector_sb.cc.o
  2035. [ 50%] Building C object gnuradio-core/src/lib/CMakeFiles/gnuradio-core.dir/reed-solomon/encode_rs.c.o
  2036. [ 50%] Building C object gnuradio-core/src/lib/CMakeFiles/gnuradio-core.dir/reed-solomon/decode_rs.c.o
  2037. /tmp/gnuradio-qTEC/gnuradio-3.6.5.1/gnuradio-core/src/lib/reed-solomon/decode_rs.c:12:1: warning: "NULL" redefined
  2038. In file included from /tmp/gnuradio-qTEC/gnuradio-3.6.5.1/gnuradio-core/src/lib/reed-solomon/decode_rs.c:10:
  2039. /usr/include/string.h:72:1: warning: this is the location of the previous definition
  2040. [ 50%] Building C object gnuradio-core/src/lib/CMakeFiles/gnuradio-core.dir/reed-solomon/init_rs.c.o
  2041. [ 50%] Building CXX object gnuradio-core/src/lib/CMakeFiles/gnuradio-core.dir/io/gr_histo_sink_f.cc.o
  2042. /tmp/gnuradio-qTEC/gnuradio-3.6.5.1/gnuradio-core/src/lib/reed-solomon/init_rs.c:16:1: warning: "NULL" redefined
  2043. In file included from /tmp/gnuradio-qTEC/gnuradio-3.6.5.1/gnuradio-core/src/lib/reed-solomon/init_rs.c:6:
  2044. /usr/include/stdlib.h:115:1: warning: this is the location of the previous definition
  2045. [ 50%] Building CXX object gnuradio-core/src/lib/CMakeFiles/gnuradio-core.dir/io/gr_oscope_guts.cc.o
  2046. [ 50%] Building CXX object gnuradio-core/src/lib/CMakeFiles/gnuradio-core.dir/io/gr_oscope_sink_f.cc.o
  2047. [ 50%] Building CXX object gnuradio-core/src/lib/CMakeFiles/gnuradio-core.dir/io/gr_oscope_sink_x.cc.o
  2048. [ 50%] Building CXX object gnuradio-core/src/lib/CMakeFiles/gnuradio-core.dir/io/i2c.cc.o
  2049. [ 51%] Building CXX object gnuradio-core/src/lib/CMakeFiles/gnuradio-core.dir/io/i2c_bitbang.cc.o
  2050. [ 51%] Building CXX object gnuradio-core/src/lib/CMakeFiles/gnuradio-core.dir/io/i2c_bbio.cc.o
  2051. [ 51%] Building CXX object gnuradio-core/src/lib/CMakeFiles/gnuradio-core.dir/io/i2c_bbio_pp.cc.o
  2052. [ 51%] Building CXX object gnuradio-core/src/lib/CMakeFiles/gnuradio-core.dir/io/microtune_4702.cc.o
  2053. [ 51%] Building CXX object gnuradio-core/src/lib/CMakeFiles/gnuradio-core.dir/io/microtune_4937.cc.o
  2054. [ 51%] Building CXX object gnuradio-core/src/lib/CMakeFiles/gnuradio-core.dir/io/microtune_xxxx.cc.o
  2055. [ 51%] Building CXX object gnuradio-core/src/lib/CMakeFiles/gnuradio-core.dir/io/ppio_ppdev.cc.o
  2056. [ 51%] Building CXX object gnuradio-core/src/lib/CMakeFiles/gnuradio-core.dir/io/gri_wavfile.cc.o
  2057. [ 51%] [ 51%] Building CXX object gnuradio-core/src/lib/CMakeFiles/gnuradio-core.dir/io/gr_pdu.cc.o
  2058. Building CXX object gnuradio-core/src/lib/CMakeFiles/gnuradio-core.dir/io/gr_stream_pdu_base.cc.o
  2059. [ 51%] Building CXX object gnuradio-core/src/lib/CMakeFiles/gnuradio-core.dir/io/gr_file_sink.cc.o
  2060. /tmp/gnuradio-qTEC/gnuradio-3.6.5.1/gnuradio-core/src/lib/io/ppio_ppdev.cc:53: warning: ‘CP_ACTIVE_LOW_BITS’ defined but not used
  2061. /tmp/gnuradio-qTEC/gnuradio-3.6.5.1/gnuradio-core/src/lib/io/ppio_ppdev.cc:59: warning: ‘SP_ACTIVE_LOW_BITS’ defined but not used
  2062. [ 51%] Building CXX object gnuradio-core/src/lib/CMakeFiles/gnuradio-core.dir/io/gr_file_sink_base.cc.o
  2063. [ 51%] Building CXX object gnuradio-core/src/lib/CMakeFiles/gnuradio-core.dir/io/gr_file_source.cc.o
  2064. [ 51%] Building CXX object gnuradio-core/src/lib/CMakeFiles/gnuradio-core.dir/io/gr_file_descriptor_sink.cc.o
  2065. [ 51%] Building CXX object gnuradio-core/src/lib/CMakeFiles/gnuradio-core.dir/io/gr_file_descriptor_source.cc.o
  2066. [ 51%] Building CXX object gnuradio-core/src/lib/CMakeFiles/gnuradio-core.dir/io/gr_message_debug.cc.o
  2067. [ 51%] Building CXX object gnuradio-core/src/lib/CMakeFiles/gnuradio-core.dir/io/gr_message_sink.cc.o
  2068. [ 51%] Building CXX object gnuradio-core/src/lib/CMakeFiles/gnuradio-core.dir/io/gr_message_source.cc.o
  2069. [ 51%] Building CXX object gnuradio-core/src/lib/CMakeFiles/gnuradio-core.dir/io/gr_message_burst_source.cc.o
  2070. [ 52%] Building CXX object gnuradio-core/src/lib/CMakeFiles/gnuradio-core.dir/io/gr_pdu_to_tagged_stream.cc.o
  2071. [ 52%] Building CXX object gnuradio-core/src/lib/CMakeFiles/gnuradio-core.dir/io/microtune_xxxx_eval_board.cc.o
  2072. [ 52%] Building CXX object gnuradio-core/src/lib/CMakeFiles/gnuradio-core.dir/io/microtune_4702_eval_board.cc.o
  2073. [ 52%] Building CXX object gnuradio-core/src/lib/CMakeFiles/gnuradio-core.dir/io/microtune_4937_eval_board.cc.o
  2074. [ 52%] Building CXX object gnuradio-core/src/lib/CMakeFiles/gnuradio-core.dir/io/ppio.cc.o
  2075. [ 52%] [ 52%] Building CXX object gnuradio-core/src/lib/CMakeFiles/gnuradio-core.dir/io/sdr_1000.cc.o
  2076. Building CXX object gnuradio-core/src/lib/CMakeFiles/gnuradio-core.dir/io/gr_udp_sink.cc.o
  2077. [ 52%] Building CXX object gnuradio-core/src/lib/CMakeFiles/gnuradio-core.dir/io/gr_udp_source.cc.o
  2078. [ 52%] Building CXX object gnuradio-core/src/lib/CMakeFiles/gnuradio-core.dir/io/gr_wavfile_source.cc.o
  2079. [ 52%] Building CXX object gnuradio-core/src/lib/CMakeFiles/gnuradio-core.dir/io/gr_wavfile_sink.cc.o
  2080. [ 52%] Building CXX object gnuradio-core/src/lib/CMakeFiles/gnuradio-core.dir/io/gr_tagged_file_sink.cc.o
  2081. [ 52%] Building CXX object gnuradio-core/src/lib/CMakeFiles/gnuradio-core.dir/io/gr_tagged_stream_to_pdu.cc.o
  2082. [ 52%] Building CXX object gnuradio-core/src/lib/CMakeFiles/gnuradio-core.dir/io/gr_tuntap_pdu.cc.o
  2083. [ 52%] Building CXX object gnuradio-core/src/lib/CMakeFiles/gnuradio-core.dir/io/gr_socket_pdu.cc.o
  2084. [ 52%] [ 52%] Building CXX object gnuradio-core/src/lib/CMakeFiles/gnuradio-core.dir/hier/gr_channel_model.cc.o
  2085. Building CXX object gnuradio-core/src/lib/CMakeFiles/gnuradio-core.dir/bug_work_around_6.cc.o
  2086. Linking CXX shared library libgnuradio-core.dylib
  2087. [ 54%] Built target gnuradio-core
  2088. Scanning dependencies of target gnuradio-config-info
  2089. Scanning dependencies of target _gnuradio_core_filter
  2090. Scanning dependencies of target test-gnuradio-core
  2091. Scanning dependencies of target _gnuradio_core_general
  2092. [ 54%] Building CXX object gnuradio-core/src/lib/CMakeFiles/gnuradio-config-info.dir/gnuradio-config-info.cc.o
  2093. [ 54%] Building CXX object gnuradio-core/src/lib/swig/CMakeFiles/_gnuradio_core_filter.dir/gnuradio_core_filterPYTHON_wrap.cxx.o
  2094. [ 54%] Building CXX object gnuradio-core/src/lib/swig/CMakeFiles/_gnuradio_core_general.dir/gnuradio_core_generalPYTHON_wrap.cxx.o
  2095. [ 54%] Building CXX object gnuradio-core/src/lib/CMakeFiles/test-gnuradio-core.dir/runtime/qa_gr_block.cc.o
  2096. Linking CXX executable gnuradio-config-info
  2097. [ 54%] Built target gnuradio-config-info
  2098. Scanning dependencies of target _gnuradio_core_gengen
  2099. [ 54%] Building CXX object gnuradio-core/src/lib/swig/CMakeFiles/_gnuradio_core_gengen.dir/gnuradio_core_gengenPYTHON_wrap.cxx.o
  2100. [ 54%] Building CXX object gnuradio-core/src/lib/CMakeFiles/test-gnuradio-core.dir/runtime/qa_gr_hier_block2.cc.o
  2101. [ 54%] Building CXX object gnuradio-core/src/lib/CMakeFiles/test-gnuradio-core.dir/runtime/qa_gr_hier_block2_derived.cc.o
  2102. [ 54%] Building CXX object gnuradio-core/src/lib/CMakeFiles/test-gnuradio-core.dir/runtime/qa_gr_buffer.cc.o
  2103. [ 54%] Building CXX object gnuradio-core/src/lib/CMakeFiles/test-gnuradio-core.dir/runtime/qa_gr_flowgraph.cc.o
  2104. [ 54%] Building CXX object gnuradio-core/src/lib/CMakeFiles/test-gnuradio-core.dir/runtime/qa_gr_top_block.cc.o
  2105. [ 54%] Building CXX object gnuradio-core/src/lib/CMakeFiles/test-gnuradio-core.dir/runtime/qa_gr_io_signature.cc.o
  2106. [ 54%] Building CXX object gnuradio-core/src/lib/CMakeFiles/test-gnuradio-core.dir/runtime/qa_gr_vmcircbuf.cc.o
  2107. [ 54%] Building CXX object gnuradio-core/src/lib/CMakeFiles/test-gnuradio-core.dir/runtime/qa_block_tags.cc.o
  2108. [ 54%] Building CXX object gnuradio-core/src/lib/CMakeFiles/test-gnuradio-core.dir/runtime/qa_runtime.cc.o
  2109. [ 54%] Building CXX object gnuradio-core/src/lib/CMakeFiles/test-gnuradio-core.dir/runtime/qa_set_msg_handler.cc.o
  2110. Linking CXX shared module _gnuradio_core_filter.so
  2111. [ 54%] Built target _gnuradio_core_filter
  2112. Scanning dependencies of target _gnuradio_core_hier
  2113. [ 54%] Building CXX object gnuradio-core/src/lib/swig/CMakeFiles/_gnuradio_core_hier.dir/gnuradio_core_hierPYTHON_wrap.cxx.o
  2114. [ 54%] Building CXX object gnuradio-core/src/lib/CMakeFiles/test-gnuradio-core.dir/runtime/qa_gr_logger.cc.o
  2115. [ 54%] Building CXX object gnuradio-core/src/lib/CMakeFiles/test-gnuradio-core.dir/filter/qa_dotprod_x86.cc.o
  2116. Linking CXX shared module _gnuradio_core_hier.so
  2117. [ 54%] Built target _gnuradio_core_hier
  2118. Scanning dependencies of target _gnuradio_core_io
  2119. [ 55%] Building CXX object gnuradio-core/src/lib/CMakeFiles/test-gnuradio-core.dir/filter/qa_float_dotprod_x86.cc.o
  2120. [ 55%] Building CXX object gnuradio-core/src/lib/swig/CMakeFiles/_gnuradio_core_io.dir/gnuradio_core_ioPYTHON_wrap.cxx.o
  2121. [ 55%] Building CXX object gnuradio-core/src/lib/CMakeFiles/test-gnuradio-core.dir/filter/qa_complex_dotprod_x86.cc.o
  2122. [ 55%] Building CXX object gnuradio-core/src/lib/CMakeFiles/test-gnuradio-core.dir/filter/qa_ccomplex_dotprod_x86.cc.o
  2123. [ 55%] Building CXX object gnuradio-core/src/lib/CMakeFiles/test-gnuradio-core.dir/filter/qa_filter.cc.o
  2124. [ 55%] Building CXX object gnuradio-core/src/lib/CMakeFiles/test-gnuradio-core.dir/filter/qa_gr_fir_ccf.cc.o
  2125. [ 55%] Building CXX object gnuradio-core/src/lib/CMakeFiles/test-gnuradio-core.dir/filter/qa_gr_fir_fcc.cc.o
  2126. [ 55%] Building CXX object gnuradio-core/src/lib/CMakeFiles/test-gnuradio-core.dir/filter/qa_gr_fir_fff.cc.o
  2127. [ 55%] Building CXX object gnuradio-core/src/lib/CMakeFiles/test-gnuradio-core.dir/filter/qa_gr_fir_ccc.cc.o
  2128. [ 55%] Building CXX object gnuradio-core/src/lib/CMakeFiles/test-gnuradio-core.dir/filter/qa_gr_fir_scc.cc.o
  2129. [ 55%] Building CXX object gnuradio-core/src/lib/CMakeFiles/test-gnuradio-core.dir/filter/qa_gr_rotator.cc.o
  2130. [ 55%] Building CXX object gnuradio-core/src/lib/CMakeFiles/test-gnuradio-core.dir/filter/qa_gri_mmse_fir_interpolator.cc.o
  2131. [ 55%] Building CXX object gnuradio-core/src/lib/CMakeFiles/test-gnuradio-core.dir/filter/qa_gri_mmse_fir_interpolator_cc.cc.o
  2132. [ 55%] Building CXX object gnuradio-core/src/lib/CMakeFiles/test-gnuradio-core.dir/filter/qa_gri_fir_filter_with_buffer_ccf.cc.o
  2133. [ 55%] Building CXX object gnuradio-core/src/lib/CMakeFiles/test-gnuradio-core.dir/filter/qa_gri_fir_filter_with_buffer_ccc.cc.o
  2134. [ 55%] Building CXX object gnuradio-core/src/lib/CMakeFiles/test-gnuradio-core.dir/filter/qa_gri_fir_filter_with_buffer_fcc.cc.o
  2135. [ 55%] Building CXX object gnuradio-core/src/lib/CMakeFiles/test-gnuradio-core.dir/filter/qa_gri_fir_filter_with_buffer_fff.cc.o
  2136. [ 55%] Building CXX object gnuradio-core/src/lib/CMakeFiles/test-gnuradio-core.dir/filter/qa_gri_fir_filter_with_buffer_fsf.cc.o
  2137. [ 55%] Building CXX object gnuradio-core/src/lib/CMakeFiles/test-gnuradio-core.dir/filter/qa_gri_fir_filter_with_buffer_scc.cc.o
  2138. [ 55%] Building CXX object gnuradio-core/src/lib/CMakeFiles/test-gnuradio-core.dir/general/qa_general.cc.o
  2139. Linking CXX shared module _gnuradio_core_io.so
  2140. [ 56%] Built target _gnuradio_core_io
  2141. [ 57%] Building CXX object gnuradio-core/src/lib/CMakeFiles/test-gnuradio-core.dir/general/qa_gr_circular_file.cc.o
  2142. Scanning dependencies of target _gnuradio_core_runtime
  2143. [ 57%] Building CXX object gnuradio-core/src/lib/CMakeFiles/test-gnuradio-core.dir/general/qa_gr_cpm.cc.o
  2144. [ 57%] Building CXX object gnuradio-core/src/lib/swig/CMakeFiles/_gnuradio_core_runtime.dir/gnuradio_core_runtimePYTHON_wrap.cxx.o
  2145. [ 57%] Building CXX object gnuradio-core/src/lib/CMakeFiles/test-gnuradio-core.dir/general/qa_gr_firdes.cc.o
  2146. [ 57%] Building CXX object gnuradio-core/src/lib/CMakeFiles/test-gnuradio-core.dir/general/qa_gr_fxpt.cc.o
  2147. [ 57%] Building CXX object gnuradio-core/src/lib/CMakeFiles/test-gnuradio-core.dir/general/qa_gr_fxpt_nco.cc.o
  2148. [ 57%] Building CXX object gnuradio-core/src/lib/CMakeFiles/test-gnuradio-core.dir/general/qa_gr_fxpt_vco.cc.o
  2149. [ 57%] Building CXX object gnuradio-core/src/lib/CMakeFiles/test-gnuradio-core.dir/general/qa_gr_math.cc.o
  2150. [ 57%] Building CXX object gnuradio-core/src/lib/CMakeFiles/test-gnuradio-core.dir/general/qa_gri_lfsr.cc.o
  2151. [ 57%] Building CXX object gnuradio-core/src/lib/CMakeFiles/test-gnuradio-core.dir/bug_work_around_6.cc.o
  2152. Linking CXX shared library libtest-gnuradio-core.dylib
  2153. [ 57%] Built target test-gnuradio-core
  2154. [ 57%] Generating vector_source_b_impl.cc, vector_source_s_impl.cc, vector_source_i_impl.cc, vector_source_f_impl.cc, vector_source_c_impl.cc
  2155. [ 57%] Generating add_ss_impl.h, add_ii_impl.h, add_cc_impl.h
  2156. [ 57%] Generating add_ss_impl.cc, add_ii_impl.cc, add_cc_impl.cc
  2157. [ 57%] Generating add_const_ss_impl.h, add_const_ii_impl.h, add_const_ff_impl.h, add_const_cc_impl.h
  2158. [ 57%] Generating add_const_ss_impl.cc, add_const_ii_impl.cc, add_const_ff_impl.cc, add_const_cc_impl.cc
  2159. [ 57%] Generating add_const_vss_impl.h, add_const_vii_impl.h, add_const_vff_impl.h, add_const_vcc_impl.h
  2160. [ 57%] Generating add_const_vss_impl.cc, add_const_vii_impl.cc, add_const_vff_impl.cc, add_const_vcc_impl.cc
  2161. [ 57%] Generating and_bb_impl.h, and_ss_impl.h, and_ii_impl.h
  2162. [ 57%] Generating and_bb_impl.cc, and_ss_impl.cc, and_ii_impl.cc
  2163. [ 57%] Generating and_const_bb_impl.h, and_const_ss_impl.h, and_const_ii_impl.h
  2164. [ 57%] Generating and_const_bb_impl.cc, and_const_ss_impl.cc, and_const_ii_impl.cc
  2165. [ 57%] Generating argmax_fs_impl.h, argmax_is_impl.h, argmax_ss_impl.h
  2166. [ 57%] Generating argmax_fs_impl.cc, argmax_is_impl.cc, argmax_ss_impl.cc
  2167. [ 57%] Generating divide_ss_impl.h, divide_ii_impl.h, divide_ff_impl.h, divide_cc_impl.h
  2168. [ 58%] Generating divide_ss_impl.cc, divide_ii_impl.cc, divide_ff_impl.cc, divide_cc_impl.cc
  2169. [ 58%] Generating integrate_ss_impl.h, integrate_ii_impl.h, integrate_ff_impl.h, integrate_cc_impl.h
  2170. [ 58%] Generating integrate_ss_impl.cc, integrate_ii_impl.cc, integrate_ff_impl.cc, integrate_cc_impl.cc
  2171. [ 58%] Generating max_ff_impl.h, max_ii_impl.h, max_ss_impl.h
  2172. [ 58%] Generating max_ff_impl.cc, max_ii_impl.cc, max_ss_impl.cc
  2173. [ 58%] Generating moving_average_ss_impl.h, moving_average_ii_impl.h, moving_average_ff_impl.h, moving_average_cc_impl.h
  2174. [ 58%] Generating moving_average_ss_impl.cc, moving_average_ii_impl.cc, moving_average_ff_impl.cc, moving_average_cc_impl.cc
  2175. [ 58%] Generating multiply_ss_impl.h, multiply_ii_impl.h
  2176. [ 58%] Generating multiply_ss_impl.cc, multiply_ii_impl.cc
  2177. [ 58%] Generating multiply_const_ss_impl.h, multiply_const_ii_impl.h
  2178. [ 58%] Generating multiply_const_ss_impl.cc, multiply_const_ii_impl.cc
  2179. [ 58%] Generating multiply_const_vss_impl.h, multiply_const_vii_impl.h, multiply_const_vff_impl.h, multiply_const_vcc_impl.h
  2180. [ 58%] Generating multiply_const_vss_impl.cc, multiply_const_vii_impl.cc, multiply_const_vff_impl.cc, multiply_const_vcc_impl.cc
  2181. [ 58%] Generating mute_ss_impl.h, mute_ii_impl.h, mute_ff_impl.h, mute_cc_impl.h
  2182. [ 58%] Generating mute_ss_impl.cc, mute_ii_impl.cc, mute_ff_impl.cc, mute_cc_impl.cc
  2183. [ 58%] Generating not_bb_impl.h, not_ss_impl.h, not_ii_impl.h
  2184. [ 58%] Generating not_bb_impl.cc, not_ss_impl.cc, not_ii_impl.cc
  2185. [ 58%] Generating or_bb_impl.h, or_ss_impl.h, or_ii_impl.h
  2186. [ 58%] Generating or_bb_impl.cc, or_ss_impl.cc, or_ii_impl.cc
  2187. [ 59%] Generating peak_detector_fb_impl.h, peak_detector_ib_impl.h, peak_detector_sb_impl.h
  2188. [ 59%] Generating peak_detector_fb_impl.cc, peak_detector_ib_impl.cc, peak_detector_sb_impl.cc
  2189. [ 59%] Generating probe_signal_b_impl.h, probe_signal_s_impl.h, probe_signal_i_impl.h, probe_signal_f_impl.h, probe_signal_c_impl.h
  2190. [ 59%] Generating probe_signal_b_impl.cc, probe_signal_s_impl.cc, probe_signal_i_impl.cc, probe_signal_f_impl.cc, probe_signal_c_impl.cc
  2191. [ 59%] Generating probe_signal_vb_impl.h, probe_signal_vs_impl.h, probe_signal_vi_impl.h, probe_signal_vf_impl.h, probe_signal_vc_impl.h
  2192. [ 59%] Generating probe_signal_vb_impl.cc, probe_signal_vs_impl.cc, probe_signal_vi_impl.cc, probe_signal_vf_impl.cc, probe_signal_vc_impl.cc
  2193. [ 59%] Generating sample_and_hold_bb_impl.h, sample_and_hold_ss_impl.h, sample_and_hold_ii_impl.h, sample_and_hold_ff_impl.h
  2194. [ 59%] Generating sample_and_hold_bb_impl.cc, sample_and_hold_ss_impl.cc, sample_and_hold_ii_impl.cc, sample_and_hold_ff_impl.cc
  2195. [ 59%] Generating sub_ss_impl.h, sub_ii_impl.h, sub_ff_impl.h, sub_cc_impl.h
  2196. [ 59%] Generating sub_ss_impl.cc, sub_ii_impl.cc, sub_ff_impl.cc, sub_cc_impl.cc
  2197. [ 59%] Generating xor_bb_impl.h, xor_ss_impl.h, xor_ii_impl.h
  2198. [ 59%] Generating xor_bb_impl.cc, xor_ss_impl.cc, xor_ii_impl.cc
  2199. [ 59%] Generating packed_to_unpacked_bb_impl.h, packed_to_unpacked_ss_impl.h, packed_to_unpacked_ii_impl.h
  2200. [ 59%] Generating packed_to_unpacked_bb_impl.cc, packed_to_unpacked_ss_impl.cc, packed_to_unpacked_ii_impl.cc
  2201. [ 59%] Generating unpacked_to_packed_bb_impl.h, unpacked_to_packed_ss_impl.h, unpacked_to_packed_ii_impl.h
  2202. [ 59%] Generating unpacked_to_packed_bb_impl.cc, unpacked_to_packed_ss_impl.cc, unpacked_to_packed_ii_impl.cc
  2203. [ 59%] Generating vector_insert_b_impl.h, vector_insert_s_impl.h, vector_insert_i_impl.h, vector_insert_f_impl.h, vector_insert_c_impl.h
  2204. [ 59%] Generating vector_insert_b_impl.cc, vector_insert_s_impl.cc, vector_insert_i_impl.cc, vector_insert_f_impl.cc, vector_insert_c_impl.cc
  2205. [ 59%] Generating vector_sink_b_impl.h, vector_sink_s_impl.h, vector_sink_i_impl.h, vector_sink_f_impl.h, vector_sink_c_impl.h
  2206. [ 59%] Generating vector_sink_b_impl.cc, vector_sink_s_impl.cc, vector_sink_i_impl.cc, vector_sink_f_impl.cc, vector_sink_c_impl.cc
  2207. [ 60%] Generating vector_source_b_impl.h, vector_source_s_impl.h, vector_source_i_impl.h, vector_source_f_impl.h, vector_source_c_impl.h
  2208. Scanning dependencies of target gnuradio-blocks
  2209. Linking CXX shared module _gnuradio_core_runtime.so
  2210. [ 60%] Built target _gnuradio_core_runtime
  2211. Scanning dependencies of target gnuradio-fft
  2212. [ 60%] Building CXX object gr-fft/lib/CMakeFiles/gnuradio-fft.dir/fft.cc.o
  2213. [ 60%] Building CXX object gr-fft/lib/CMakeFiles/gnuradio-fft.dir/fft_vcc_fftw.cc.o
  2214. Linking CXX shared module _gnuradio_core_gengen.so
  2215. [ 60%] Built target _gnuradio_core_gengen
  2216. [ 60%] Building CXX object gr-fft/lib/CMakeFiles/gnuradio-fft.dir/fft_vfc_fftw.cc.o
  2217. [ 60%] Building CXX object gr-blocks/lib/CMakeFiles/gnuradio-blocks.dir/add_ss_impl.cc.o
  2218. [ 60%] Generating atsci_viterbi_mux.cc
  2219. [ 60%] Building CXX object gr-blocks/lib/CMakeFiles/gnuradio-blocks.dir/add_ii_impl.cc.o
  2220. Scanning dependencies of target gnuradio-atsc
  2221. [ 61%] [ 61%] Building CXX object gr-fft/lib/CMakeFiles/gnuradio-fft.dir/goertzel_fc_impl.cc.o
  2222. Building CXX object gr-atsc/src/lib/CMakeFiles/gnuradio-atsc.dir/atsci_viterbi_mux.cc.o
  2223. [ 61%] Building CXX object gr-atsc/src/lib/CMakeFiles/gnuradio-atsc.dir/atsc_derandomizer.cc.o
  2224. [ 61%] Building CXX object gr-blocks/lib/CMakeFiles/gnuradio-blocks.dir/add_cc_impl.cc.o
  2225. [ 61%] Building CXX object gr-fft/lib/CMakeFiles/gnuradio-fft.dir/goertzel.cc.o
  2226. [ 61%] Building CXX object gr-atsc/src/lib/CMakeFiles/gnuradio-atsc.dir/atsc_randomizer.cc.o
  2227. Linking CXX shared library libgnuradio-fft.dylib
  2228. [ 61%] Built target gnuradio-fft
  2229. [ 61%] Building CXX object gr-atsc/src/lib/CMakeFiles/gnuradio-atsc.dir/atsc_rs_decoder.cc.o
  2230. [ 61%] Building CXX object gr-blocks/lib/CMakeFiles/gnuradio-blocks.dir/add_const_ss_impl.cc.o
  2231. Linking CXX shared module _gnuradio_core_general.so
  2232. Scanning dependencies of target gnuradio-audio
  2233. [ 61%] Built target _gnuradio_core_general
  2234. Scanning dependencies of target gnuradio-noaa
  2235. [ 61%] [ 61%] Building CXX object gr-audio/lib/CMakeFiles/gnuradio-audio.dir/gr_audio_registry.cc.o
  2236. Building CXX object gr-noaa/lib/CMakeFiles/gnuradio-noaa.dir/noaa_hrpt_decoder.cc.o
  2237. [ 61%] Building CXX object gr-atsc/src/lib/CMakeFiles/gnuradio-atsc.dir/atsc_rs_encoder.cc.o
  2238. [ 61%] Building CXX object gr-blocks/lib/CMakeFiles/gnuradio-blocks.dir/add_const_ii_impl.cc.o
  2239. [ 62%] Building CXX object gr-noaa/lib/CMakeFiles/gnuradio-noaa.dir/noaa_hrpt_deframer.cc.o
  2240. [ 62%] Building CXX object gr-audio/lib/CMakeFiles/gnuradio-audio.dir/osx/audio_osx_source.cc.o
  2241. [ 62%] Building CXX object gr-atsc/src/lib/CMakeFiles/gnuradio-atsc.dir/atsc_interleaver.cc.o
  2242. [ 62%] Building CXX object gr-blocks/lib/CMakeFiles/gnuradio-blocks.dir/add_const_ff_impl.cc.o
  2243. [ 62%] Building CXX object gr-noaa/lib/CMakeFiles/gnuradio-noaa.dir/noaa_hrpt_pll_cf.cc.o
  2244. [ 62%] Building CXX object gr-atsc/src/lib/CMakeFiles/gnuradio-atsc.dir/atsc_deinterleaver.cc.o
  2245. [ 62%] Building CXX object gr-audio/lib/CMakeFiles/gnuradio-audio.dir/osx/audio_osx_sink.cc.o
  2246. [ 62%] Building CXX object gr-blocks/lib/CMakeFiles/gnuradio-blocks.dir/add_const_cc_impl.cc.o
  2247. Linking CXX shared library libgnuradio-noaa.dylib
  2248. [ 62%] Built target gnuradio-noaa
  2249. [ 62%] Building CXX object gr-atsc/src/lib/CMakeFiles/gnuradio-atsc.dir/atsc_trellis_encoder.cc.o
  2250. [ 62%] Building CXX object gr-blocks/lib/CMakeFiles/gnuradio-blocks.dir/add_const_vss_impl.cc.o
  2251. Linking CXX shared library libgnuradio-audio.dylib
  2252. [ 62%] Built target gnuradio-audio
  2253. Scanning dependencies of target gnuradio-pager
  2254. [ 62%] Building CXX object gr-atsc/src/lib/CMakeFiles/gnuradio-atsc.dir/atsc_viterbi_decoder.cc.o
  2255. [ 62%] Building CXX object gr-pager/lib/CMakeFiles/gnuradio-pager.dir/pager_flex_frame.cc.o
  2256. [ 62%] Building CXX object gr-pager/lib/CMakeFiles/gnuradio-pager.dir/pager_slicer_fb.cc.o
  2257. [ 62%] Building CXX object gr-blocks/lib/CMakeFiles/gnuradio-blocks.dir/add_const_vii_impl.cc.o
  2258. [ 62%] Building CXX object gr-blocks/lib/CMakeFiles/gnuradio-blocks.dir/add_const_vff_impl.cc.o
  2259. [ 62%] Building CXX object gr-atsc/src/lib/CMakeFiles/gnuradio-atsc.dir/atsc_ds_to_softds.cc.o
  2260. [ 62%] Building CXX object gr-pager/lib/CMakeFiles/gnuradio-pager.dir/pager_flex_sync.cc.o
  2261. [ 62%] Building CXX object gr-blocks/lib/CMakeFiles/gnuradio-blocks.dir/add_const_vcc_impl.cc.o
  2262. [ 62%] Building CXX object gr-atsc/src/lib/CMakeFiles/gnuradio-atsc.dir/atsc_field_sync_mux.cc.o
  2263. [ 62%] Building CXX object gr-atsc/src/lib/CMakeFiles/gnuradio-atsc.dir/atsc_field_sync_demux.cc.o
  2264. [ 62%] Building CXX object gr-pager/lib/CMakeFiles/gnuradio-pager.dir/pager_flex_deinterleave.cc.o
  2265. [ 62%] Building CXX object gr-blocks/lib/CMakeFiles/gnuradio-blocks.dir/and_bb_impl.cc.o
  2266. [ 62%] Building CXX object gr-atsc/src/lib/CMakeFiles/gnuradio-atsc.dir/atsc_equalizer.cc.o
  2267. [ 62%] Building CXX object gr-atsc/src/lib/CMakeFiles/gnuradio-atsc.dir/atsc_fs_checker.cc.o
  2268. [ 62%] Building CXX object gr-pager/lib/CMakeFiles/gnuradio-pager.dir/pager_flex_parse.cc.o
  2269. [ 62%] Building CXX object gr-blocks/lib/CMakeFiles/gnuradio-blocks.dir/and_ss_impl.cc.o
  2270. [ 62%] Building CXX object gr-atsc/src/lib/CMakeFiles/gnuradio-atsc.dir/atsc_bit_timing_loop.cc.o
  2271. [ 62%] Building CXX object gr-pager/lib/CMakeFiles/gnuradio-pager.dir/pageri_bch3221.cc.o
  2272. [ 62%] Building CXX object gr-blocks/lib/CMakeFiles/gnuradio-blocks.dir/and_ii_impl.cc.o
  2273. [ 62%] Building CXX object gr-pager/lib/CMakeFiles/gnuradio-pager.dir/pageri_flex_modes.cc.o
  2274. [ 62%] Building CXX object gr-atsc/src/lib/CMakeFiles/gnuradio-atsc.dir/atsc_fpll.cc.o
  2275. [ 62%] Building CXX object gr-pager/lib/CMakeFiles/gnuradio-pager.dir/pageri_util.cc.o
  2276. [ 62%] Building CXX object gr-atsc/src/lib/CMakeFiles/gnuradio-atsc.dir/atsc_depad.cc.o
  2277. Linking CXX shared library libgnuradio-pager.dylib
  2278. [ 62%] Built target gnuradio-pager
  2279. [ 62%] Building CXX object gr-blocks/lib/CMakeFiles/gnuradio-blocks.dir/and_const_bb_impl.cc.o
  2280. [ 62%] Building CXX object gr-atsc/src/lib/CMakeFiles/gnuradio-atsc.dir/atsc_pad.cc.o
  2281. [ 62%] Generating ui_spectrumdisplayform.h
  2282. [ 62%] Generating moc_spectrumdisplayform.cxx
  2283. [ 62%] Generating moc_timedisplayform.cxx
  2284. [ 62%] Generating moc_FrequencyDisplayPlot.cxx
  2285. [ 62%] Generating moc_TimeDomainDisplayPlot.cxx
  2286. [ 62%] Generating moc_WaterfallDisplayPlot.cxx
  2287. [ 62%] Generating moc_ConstellationDisplayPlot.cxx
  2288. Scanning dependencies of target gnuradio-qtgui
  2289. [ 62%] Building CXX object gr-blocks/lib/CMakeFiles/gnuradio-blocks.dir/and_const_ss_impl.cc.o
  2290. [ 62%] Building CXX object gr-blocks/lib/CMakeFiles/gnuradio-blocks.dir/and_const_ii_impl.cc.o
  2291. [ 62%] Building CXX object gr-qtgui/lib/CMakeFiles/gnuradio-qtgui.dir/moc_spectrumdisplayform.cxx.o
  2292. [ 62%] Building CXX object gr-atsc/src/lib/CMakeFiles/gnuradio-atsc.dir/atsci_basic_trellis_encoder.cc.o
  2293. [ 63%] Building CXX object gr-atsc/src/lib/CMakeFiles/gnuradio-atsc.dir/atsci_data_interleaver.cc.o
  2294. [ 63%] Building CXX object gr-atsc/src/lib/CMakeFiles/gnuradio-atsc.dir/atsci_equalizer.cc.o
  2295. [ 63%] Building CXX object gr-atsc/src/lib/CMakeFiles/gnuradio-atsc.dir/atsci_equalizer_lms.cc.o
  2296. [ 64%] Building CXX object gr-blocks/lib/CMakeFiles/gnuradio-blocks.dir/argmax_fs_impl.cc.o
  2297. [ 64%] Building CXX object gr-atsc/src/lib/CMakeFiles/gnuradio-atsc.dir/atsci_equalizer_lms2.cc.o
  2298. [ 64%] Building CXX object gr-qtgui/lib/CMakeFiles/gnuradio-qtgui.dir/moc_timedisplayform.cxx.o
  2299. [ 64%] Building CXX object gr-atsc/src/lib/CMakeFiles/gnuradio-atsc.dir/atsci_equalizer_nop.cc.o
  2300. [ 64%] Building CXX object gr-atsc/src/lib/CMakeFiles/gnuradio-atsc.dir/atsci_fake_single_viterbi.cc.o
  2301. [ 64%] Building CXX object gr-atsc/src/lib/CMakeFiles/gnuradio-atsc.dir/atsci_fs_checker.cc.o
  2302. [ 64%] Building CXX object gr-atsc/src/lib/CMakeFiles/gnuradio-atsc.dir/atsci_fs_checker_naive.cc.o
  2303. [ 64%] Building CXX object gr-atsc/src/lib/CMakeFiles/gnuradio-atsc.dir/atsci_fs_correlator.cc.o
  2304. [ 64%] Building CXX object gr-atsc/src/lib/CMakeFiles/gnuradio-atsc.dir/atsci_fs_correlator_naive.cc.o
  2305. [ 64%] Building CXX object gr-blocks/lib/CMakeFiles/gnuradio-blocks.dir/argmax_is_impl.cc.o
  2306. [ 64%] Building CXX object gr-atsc/src/lib/CMakeFiles/gnuradio-atsc.dir/atsci_single_viterbi.cc.o
  2307. [ 64%] Building CXX object gr-atsc/src/lib/CMakeFiles/gnuradio-atsc.dir/atsci_sssr.cc.o
  2308. [ 65%] Generating trellis_pccc_decoder_combined_fb.cc, trellis_pccc_decoder_combined_fs.cc, trellis_pccc_decoder_combined_fi.cc, trellis_pccc_decoder_combined_cb.cc, trellis_pccc_decoder_combined_cs.cc, trellis_pccc_decoder_combined_ci.cc
  2309. [ 65%] Generating trellis_encoder_bb.cc, trellis_encoder_bs.cc, trellis_encoder_bi.cc, trellis_encoder_ss.cc, trellis_encoder_si.cc, trellis_encoder_ii.cc
  2310. [ 65%] Generating trellis_sccc_encoder_bb.cc, trellis_sccc_encoder_bs.cc, trellis_sccc_encoder_bi.cc, trellis_sccc_encoder_ss.cc, trellis_sccc_encoder_si.cc, trellis_sccc_encoder_ii.cc
  2311. [ 65%] Generating trellis_pccc_encoder_bb.cc, trellis_pccc_encoder_bs.cc, trellis_pccc_encoder_bi.cc, trellis_pccc_encoder_ss.cc, trellis_pccc_encoder_si.cc, trellis_pccc_encoder_ii.cc
  2312. [ 65%] Generating trellis_metrics_s.cc, trellis_metrics_i.cc, trellis_metrics_f.cc, trellis_metrics_c.cc
  2313. [ 65%] Generating trellis_viterbi_b.cc, trellis_viterbi_s.cc, trellis_viterbi_i.cc
  2314. [ 65%] Generating trellis_viterbi_combined_sb.cc, trellis_viterbi_combined_ss.cc, trellis_viterbi_combined_si.cc, trellis_viterbi_combined_ib.cc, trellis_viterbi_combined_is.cc, trellis_viterbi_combined_ii.cc, trellis_viterbi_combined_fb.cc, trellis_viterbi_combined_fs.cc, trellis_viterbi_combined_fi.cc, trellis_viterbi_combined_cb.cc, trellis_viterbi_combined_cs.cc, trellis_viterbi_combined_ci.cc
  2315. [ 65%] Generating trellis_sccc_decoder_b.cc, trellis_sccc_decoder_s.cc, trellis_sccc_decoder_i.cc
  2316. [ 65%] Generating trellis_sccc_decoder_combined_fb.cc, trellis_sccc_decoder_combined_fs.cc, trellis_sccc_decoder_combined_fi.cc, trellis_sccc_decoder_combined_cb.cc, trellis_sccc_decoder_combined_cs.cc, trellis_sccc_decoder_combined_ci.cc
  2317. [ 65%] Generating trellis_pccc_decoder_b.cc, trellis_pccc_decoder_s.cc, trellis_pccc_decoder_i.cc
  2318. [ 66%] Building CXX object gr-qtgui/lib/CMakeFiles/gnuradio-qtgui.dir/moc_FrequencyDisplayPlot.cxx.o
  2319. Scanning dependencies of target gnuradio-trellis
  2320. [ 66%] Building CXX object gr-atsc/src/lib/CMakeFiles/gnuradio-atsc.dir/atsci_pnXXX.cc.o
  2321. [ 66%] Building CXX object gr-atsc/src/lib/CMakeFiles/gnuradio-atsc.dir/atsci_randomizer.cc.o
  2322. [ 66%] Building CXX object gr-atsc/src/lib/CMakeFiles/gnuradio-atsc.dir/atsci_reed_solomon.cc.o
  2323. [ 66%] Building CXX object gr-atsc/src/lib/CMakeFiles/gnuradio-atsc.dir/atsci_sliding_correlator.cc.o
  2324. [ 66%] Building CXX object gr-atsc/src/lib/CMakeFiles/gnuradio-atsc.dir/atsci_trellis_encoder.cc.o
  2325. [ 66%] Building CXX object gr-atsc/src/lib/CMakeFiles/gnuradio-atsc.dir/atsci_viterbi_decoder.cc.o
  2326. [ 66%] Building CXX object gr-atsc/src/lib/CMakeFiles/gnuradio-atsc.dir/create_atsci_equalizer.cc.o
  2327. [ 66%] Building CXX object gr-blocks/lib/CMakeFiles/gnuradio-blocks.dir/argmax_ss_impl.cc.o
  2328. [ 67%] Building CXX object gr-atsc/src/lib/CMakeFiles/gnuradio-atsc.dir/create_atsci_fs_checker.cc.o
  2329. [ 67%] Building CXX object gr-atsc/src/lib/CMakeFiles/gnuradio-atsc.dir/create_atsci_fs_correlator.cc.o
  2330. [ 67%] Building CXX object gr-atsc/src/lib/CMakeFiles/gnuradio-atsc.dir/plinfo.cc.o
  2331. Linking CXX shared library libgnuradio-atsc.dylib
  2332. [ 67%] Built target gnuradio-atsc
  2333. Scanning dependencies of target gnuradio-video-sdl
  2334. [ 67%] Building CXX object gr-video-sdl/src/CMakeFiles/gnuradio-video-sdl.dir/video_sdl_sink_uc.cc.o
  2335. [ 67%] Building CXX object gr-trellis/src/lib/CMakeFiles/gnuradio-trellis.dir/fsm.cc.o
  2336. [ 67%] Building CXX object gr-qtgui/lib/CMakeFiles/gnuradio-qtgui.dir/moc_TimeDomainDisplayPlot.cxx.o
  2337. [ 67%] Building CXX object gr-blocks/lib/CMakeFiles/gnuradio-blocks.dir/divide_ss_impl.cc.o
  2338. [ 67%] Building CXX object gr-trellis/src/lib/CMakeFiles/gnuradio-trellis.dir/quicksort_index.cc.o
  2339. [ 67%] Building CXX object gr-trellis/src/lib/CMakeFiles/gnuradio-trellis.dir/base.cc.o
  2340. [ 67%] Building CXX object gr-trellis/src/lib/CMakeFiles/gnuradio-trellis.dir/interleaver.cc.o
  2341. [ 67%] Building CXX object gr-video-sdl/src/CMakeFiles/gnuradio-video-sdl.dir/video_sdl_sink_s.cc.o
  2342. [ 67%] Building CXX object gr-trellis/src/lib/CMakeFiles/gnuradio-trellis.dir/calc_metric.cc.o
  2343. [ 67%] Building CXX object gr-qtgui/lib/CMakeFiles/gnuradio-qtgui.dir/moc_WaterfallDisplayPlot.cxx.o
  2344. [ 67%] Building CXX object gr-trellis/src/lib/CMakeFiles/gnuradio-trellis.dir/core_algorithms.cc.o
  2345. [ 67%] Building CXX object gr-blocks/lib/CMakeFiles/gnuradio-blocks.dir/divide_ii_impl.cc.o
  2346. [ 67%] Building CXX object gr-trellis/src/lib/CMakeFiles/gnuradio-trellis.dir/trellis_permutation.cc.o
  2347. Linking CXX shared library libgnuradio-video-sdl.dylib
  2348. [ 67%] Built target gnuradio-video-sdl
  2349. [ 67%] Building CXX object gr-qtgui/lib/CMakeFiles/gnuradio-qtgui.dir/moc_ConstellationDisplayPlot.cxx.o
  2350. In file included from /tmp/gnuradio-qTEC/gnuradio-3.6.5.1/build/gr-qtgui/lib/../../../gr-qtgui/lib/WaterfallDisplayPlot.h:32,
  2351. from /tmp/gnuradio-qTEC/gnuradio-3.6.5.1/build/gr-qtgui/lib/moc_WaterfallDisplayPlot.cxx:9:
  2352. /tmp/gnuradio-qTEC/gnuradio-3.6.5.1/gr-qtgui/include/qtgui_util.h:35: error: expected `)' before ‘*’ token
  2353. make[2]: *** [gr-qtgui/lib/CMakeFiles/gnuradio-qtgui.dir/moc_WaterfallDisplayPlot.cxx.o] Error 1
  2354. make[2]: *** Waiting for unfinished jobs....
  2355. [ 67%] Generating codec2/codebookdvq.c
  2356. [ 67%] Generating codec2/codebook.c
  2357. [ 67%] Generating codec2/codebookd.c
  2358. Scanning dependencies of target gnuradio-vocoder
  2359. [ 67%] Building CXX object gr-blocks/lib/CMakeFiles/gnuradio-blocks.dir/divide_ff_impl.cc.o
  2360. [ 67%] Building CXX object gr-trellis/src/lib/CMakeFiles/gnuradio-trellis.dir/trellis_siso_f.cc.o
  2361. [ 67%] Building CXX object gr-vocoder/lib/CMakeFiles/gnuradio-vocoder.dir/vocoder_alaw_decode_bs.cc.o
  2362. make[1]: *** [gr-qtgui/lib/CMakeFiles/gnuradio-qtgui.dir/all] Error 2
  2363. make[1]: *** Waiting for unfinished jobs....
  2364. [ 67%] Building CXX object gr-blocks/lib/CMakeFiles/gnuradio-blocks.dir/divide_cc_impl.cc.o
  2365. [ 67%] Building CXX object gr-blocks/lib/CMakeFiles/gnuradio-blocks.dir/integrate_ss_impl.cc.o
  2366. [ 67%] Building CXX object gr-trellis/src/lib/CMakeFiles/gnuradio-trellis.dir/trellis_siso_combined_f.cc.o
  2367. [ 67%] Building CXX object gr-vocoder/lib/CMakeFiles/gnuradio-vocoder.dir/vocoder_alaw_encode_sb.cc.o
  2368. [ 67%] Building CXX object gr-trellis/src/lib/CMakeFiles/gnuradio-trellis.dir/trellis_constellation_metrics_cf.cc.o
  2369. [ 67%] Building CXX object gr-blocks/lib/CMakeFiles/gnuradio-blocks.dir/integrate_ii_impl.cc.o
  2370. [ 67%] Building CXX object gr-vocoder/lib/CMakeFiles/gnuradio-vocoder.dir/vocoder_codec2_decode_ps.cc.o
  2371. [ 67%] Building CXX object gr-trellis/src/lib/CMakeFiles/gnuradio-trellis.dir/trellis_encoder_bb.cc.o
  2372. [ 67%] Building CXX object gr-blocks/lib/CMakeFiles/gnuradio-blocks.dir/integrate_ff_impl.cc.o
  2373. [ 67%] Building CXX object gr-trellis/src/lib/CMakeFiles/gnuradio-trellis.dir/trellis_encoder_bs.cc.o
  2374. [ 67%] Building CXX object gr-vocoder/lib/CMakeFiles/gnuradio-vocoder.dir/vocoder_codec2_encode_sp.cc.o
  2375. [ 67%] Building CXX object gr-trellis/src/lib/CMakeFiles/gnuradio-trellis.dir/trellis_encoder_bi.cc.o
  2376. [ 67%] Building CXX object gr-blocks/lib/CMakeFiles/gnuradio-blocks.dir/integrate_cc_impl.cc.o
  2377. [ 67%] Building CXX object gr-vocoder/lib/CMakeFiles/gnuradio-vocoder.dir/vocoder_cvsd_decode_bs.cc.o
  2378. [ 67%] Building CXX object gr-blocks/lib/CMakeFiles/gnuradio-blocks.dir/max_ff_impl.cc.o
  2379. [ 67%] Building CXX object gr-trellis/src/lib/CMakeFiles/gnuradio-trellis.dir/trellis_encoder_ss.cc.o
  2380. [ 68%] Building CXX object gr-vocoder/lib/CMakeFiles/gnuradio-vocoder.dir/vocoder_cvsd_encode_sb.cc.o
  2381. [ 68%] Building CXX object gr-blocks/lib/CMakeFiles/gnuradio-blocks.dir/max_ii_impl.cc.o
  2382. [ 68%] Building CXX object gr-blocks/lib/CMakeFiles/gnuradio-blocks.dir/max_ss_impl.cc.o
  2383. [ 68%] Building CXX object gr-trellis/src/lib/CMakeFiles/gnuradio-trellis.dir/trellis_encoder_si.cc.o
  2384. [ 68%] Building CXX object gr-vocoder/lib/CMakeFiles/gnuradio-vocoder.dir/vocoder_g721_decode_bs.cc.o
  2385. [ 68%] Building CXX object gr-blocks/lib/CMakeFiles/gnuradio-blocks.dir/moving_average_ss_impl.cc.o
  2386. [ 68%] Building CXX object gr-trellis/src/lib/CMakeFiles/gnuradio-trellis.dir/trellis_encoder_ii.cc.o
  2387. [ 68%] Building CXX object gr-blocks/lib/CMakeFiles/gnuradio-blocks.dir/moving_average_ii_impl.cc.o
  2388. [ 68%] Building CXX object gr-vocoder/lib/CMakeFiles/gnuradio-vocoder.dir/vocoder_g721_encode_sb.cc.o
  2389. [ 68%] Building CXX object gr-blocks/lib/CMakeFiles/gnuradio-blocks.dir/moving_average_ff_impl.cc.o
  2390. [ 68%] Building CXX object gr-trellis/src/lib/CMakeFiles/gnuradio-trellis.dir/trellis_sccc_encoder_bb.cc.o
  2391. [ 68%] Building CXX object gr-blocks/lib/CMakeFiles/gnuradio-blocks.dir/moving_average_cc_impl.cc.o
  2392. [ 68%] Building CXX object gr-vocoder/lib/CMakeFiles/gnuradio-vocoder.dir/vocoder_g723_24_decode_bs.cc.o
  2393. [ 68%] Building CXX object gr-trellis/src/lib/CMakeFiles/gnuradio-trellis.dir/trellis_sccc_encoder_bs.cc.o
  2394. [ 69%] Building CXX object gr-trellis/src/lib/CMakeFiles/gnuradio-trellis.dir/trellis_sccc_encoder_bi.cc.o
  2395. [ 69%] Building CXX object gr-blocks/lib/CMakeFiles/gnuradio-blocks.dir/multiply_ss_impl.cc.o
  2396. [ 69%] Building CXX object gr-vocoder/lib/CMakeFiles/gnuradio-vocoder.dir/vocoder_g723_24_encode_sb.cc.o
  2397. [ 69%] Building CXX object gr-trellis/src/lib/CMakeFiles/gnuradio-trellis.dir/trellis_sccc_encoder_ss.cc.o
  2398. [ 70%] Building CXX object gr-blocks/lib/CMakeFiles/gnuradio-blocks.dir/multiply_ii_impl.cc.o
  2399. [ 70%] Building CXX object gr-blocks/lib/CMakeFiles/gnuradio-blocks.dir/multiply_const_ss_impl.cc.o
  2400. [ 70%] Building CXX object gr-vocoder/lib/CMakeFiles/gnuradio-vocoder.dir/vocoder_g723_40_decode_bs.cc.o
  2401. [ 70%] Building CXX object gr-trellis/src/lib/CMakeFiles/gnuradio-trellis.dir/trellis_sccc_encoder_si.cc.o
  2402. [ 70%] Building CXX object gr-vocoder/lib/CMakeFiles/gnuradio-vocoder.dir/vocoder_g723_40_encode_sb.cc.o
  2403. [ 70%] Building CXX object gr-blocks/lib/CMakeFiles/gnuradio-blocks.dir/multiply_const_ii_impl.cc.o
  2404. [ 70%] Building CXX object gr-vocoder/lib/CMakeFiles/gnuradio-vocoder.dir/vocoder_gsm_fr_decode_ps.cc.o
  2405. [ 70%] Building CXX object gr-trellis/src/lib/CMakeFiles/gnuradio-trellis.dir/trellis_sccc_encoder_ii.cc.o
  2406. [ 70%] Building CXX object gr-blocks/lib/CMakeFiles/gnuradio-blocks.dir/multiply_const_vss_impl.cc.o
  2407. [ 70%] Building CXX object gr-vocoder/lib/CMakeFiles/gnuradio-vocoder.dir/vocoder_gsm_fr_encode_sp.cc.o
  2408. [ 70%] Building CXX object gr-blocks/lib/CMakeFiles/gnuradio-blocks.dir/multiply_const_vii_impl.cc.o
  2409. [ 70%] Building CXX object gr-trellis/src/lib/CMakeFiles/gnuradio-trellis.dir/trellis_pccc_encoder_bb.cc.o
  2410. [ 70%] Building CXX object gr-vocoder/lib/CMakeFiles/gnuradio-vocoder.dir/vocoder_ulaw_decode_bs.cc.o
  2411. [ 70%] Building CXX object gr-vocoder/lib/CMakeFiles/gnuradio-vocoder.dir/vocoder_ulaw_encode_sb.cc.o
  2412. [ 70%] Building CXX object gr-blocks/lib/CMakeFiles/gnuradio-blocks.dir/multiply_const_vff_impl.cc.o
  2413. [ 70%] Building CXX object gr-trellis/src/lib/CMakeFiles/gnuradio-trellis.dir/trellis_pccc_encoder_bs.cc.o
  2414. [ 70%] Building C object gr-vocoder/lib/CMakeFiles/gnuradio-vocoder.dir/codec2/codebook.c.o
  2415. [ 70%] Building C object gr-vocoder/lib/CMakeFiles/gnuradio-vocoder.dir/codec2/codebookd.c.o
  2416. [ 70%] Building C object gr-vocoder/lib/CMakeFiles/gnuradio-vocoder.dir/codec2/codebookdvq.c.o
  2417. [ 70%] Building CXX object gr-blocks/lib/CMakeFiles/gnuradio-blocks.dir/multiply_const_vcc_impl.cc.o
  2418. [ 70%] Building C object gr-vocoder/lib/CMakeFiles/gnuradio-vocoder.dir/codec2/dump.c.o
  2419. [ 70%] Building C object gr-vocoder/lib/CMakeFiles/gnuradio-vocoder.dir/codec2/lpc.c.o
  2420. [ 70%] Building C object gr-vocoder/lib/CMakeFiles/gnuradio-vocoder.dir/codec2/nlp.c.o
  2421. [ 70%] Building C object gr-vocoder/lib/CMakeFiles/gnuradio-vocoder.dir/codec2/postfilter.c.o
  2422. [ 70%] Building C object gr-vocoder/lib/CMakeFiles/gnuradio-vocoder.dir/codec2/sine.c.o
  2423. [ 71%] Building C object gr-vocoder/lib/CMakeFiles/gnuradio-vocoder.dir/codec2/codec2.c.o
  2424. [ 71%] Building C object gr-vocoder/lib/CMakeFiles/gnuradio-vocoder.dir/codec2/fft.c.o
  2425. [ 71%] Building C object gr-vocoder/lib/CMakeFiles/gnuradio-vocoder.dir/codec2/kiss_fft.c.o
  2426. [ 71%] Building C object gr-vocoder/lib/CMakeFiles/gnuradio-vocoder.dir/codec2/interp.c.o
  2427. [ 71%] Building C object gr-vocoder/lib/CMakeFiles/gnuradio-vocoder.dir/codec2/lsp.c.o
  2428. [ 71%] Building C object gr-vocoder/lib/CMakeFiles/gnuradio-vocoder.dir/codec2/phase.c.o
  2429. [ 71%] Building C object gr-vocoder/lib/CMakeFiles/gnuradio-vocoder.dir/codec2/quantise.c.o
  2430. [ 71%] Building C object gr-vocoder/lib/CMakeFiles/gnuradio-vocoder.dir/codec2/pack.c.o
  2431. [ 71%] Building C object gr-vocoder/lib/CMakeFiles/gnuradio-vocoder.dir/g7xx/g711.c.o
  2432. [ 71%] Building C object gr-vocoder/lib/CMakeFiles/gnuradio-vocoder.dir/g7xx/g72x.c.o
  2433. [ 71%] Building C object gr-vocoder/lib/CMakeFiles/gnuradio-vocoder.dir/g7xx/g721.c.o
  2434. [ 71%] Building C object gr-vocoder/lib/CMakeFiles/gnuradio-vocoder.dir/g7xx/g723_24.c.o
  2435. [ 71%] [ 71%] Building C object gr-vocoder/lib/CMakeFiles/gnuradio-vocoder.dir/g7xx/g723_40.c.o
  2436. Building CXX object gr-trellis/src/lib/CMakeFiles/gnuradio-trellis.dir/trellis_pccc_encoder_bi.cc.o
  2437. [ 71%] Building C object gr-vocoder/lib/CMakeFiles/gnuradio-vocoder.dir/gsm/add.c.o
  2438. [ 71%] Building C object gr-vocoder/lib/CMakeFiles/gnuradio-vocoder.dir/gsm/code.c.o
  2439. [ 71%] Building C object gr-vocoder/lib/CMakeFiles/gnuradio-vocoder.dir/gsm/debug.c.o
  2440. [ 71%] Building C object gr-vocoder/lib/CMakeFiles/gnuradio-vocoder.dir/gsm/decode.c.o
  2441. [ 71%] Building C object gr-vocoder/lib/CMakeFiles/gnuradio-vocoder.dir/gsm/gsm_create.c.o
  2442. [ 71%] Building C object gr-vocoder/lib/CMakeFiles/gnuradio-vocoder.dir/gsm/gsm_decode.c.o
  2443. [ 71%] Building C object gr-vocoder/lib/CMakeFiles/gnuradio-vocoder.dir/gsm/gsm_destroy.c.o
  2444. [ 72%] Building C object gr-vocoder/lib/CMakeFiles/gnuradio-vocoder.dir/gsm/gsm_encode.c.o
  2445. [ 72%] Building C object gr-vocoder/lib/CMakeFiles/gnuradio-vocoder.dir/gsm/gsm_explode.c.o
  2446. [ 72%] Building C object gr-vocoder/lib/CMakeFiles/gnuradio-vocoder.dir/gsm/gsm_implode.c.o
  2447. [ 72%] Building CXX object gr-trellis/src/lib/CMakeFiles/gnuradio-trellis.dir/trellis_pccc_encoder_ss.cc.o
  2448. [ 72%] Building C object gr-vocoder/lib/CMakeFiles/gnuradio-vocoder.dir/gsm/gsm_option.c.o
  2449. [ 72%] Building C object gr-vocoder/lib/CMakeFiles/gnuradio-vocoder.dir/gsm/gsm_print.c.o
  2450. [ 72%] Building C object gr-vocoder/lib/CMakeFiles/gnuradio-vocoder.dir/gsm/long_term.c.o
  2451. [ 72%] Building C object gr-vocoder/lib/CMakeFiles/gnuradio-vocoder.dir/gsm/lpc.c.o
  2452. [ 72%] Building CXX object gr-blocks/lib/CMakeFiles/gnuradio-blocks.dir/mute_ss_impl.cc.o
  2453. [ 72%] Building C object gr-vocoder/lib/CMakeFiles/gnuradio-vocoder.dir/gsm/preprocess.c.o
  2454. [ 72%] Building C object gr-vocoder/lib/CMakeFiles/gnuradio-vocoder.dir/gsm/rpe.c.o
  2455. [ 72%] Building C object gr-vocoder/lib/CMakeFiles/gnuradio-vocoder.dir/gsm/short_term.c.o
  2456. [ 72%] Building C object gr-vocoder/lib/CMakeFiles/gnuradio-vocoder.dir/gsm/table.c.o
  2457. Linking CXX shared library libgnuradio-vocoder.dylib
  2458. [ 72%] Built target gnuradio-vocoder
  2459. [ 72%] Building CXX object gr-trellis/src/lib/CMakeFiles/gnuradio-trellis.dir/trellis_pccc_encoder_si.cc.o
  2460. [ 72%] Building CXX object gr-trellis/src/lib/CMakeFiles/gnuradio-trellis.dir/trellis_pccc_encoder_ii.cc.o
  2461. [ 72%] Building CXX object gr-trellis/src/lib/CMakeFiles/gnuradio-trellis.dir/trellis_metrics_s.cc.o
  2462. [ 72%] Building CXX object gr-blocks/lib/CMakeFiles/gnuradio-blocks.dir/mute_ii_impl.cc.o
  2463. [ 72%] Building CXX object gr-blocks/lib/CMakeFiles/gnuradio-blocks.dir/mute_ff_impl.cc.o
  2464. [ 72%] Building CXX object gr-blocks/lib/CMakeFiles/gnuradio-blocks.dir/mute_cc_impl.cc.o
  2465. [ 72%] Building CXX object gr-trellis/src/lib/CMakeFiles/gnuradio-trellis.dir/trellis_metrics_i.cc.o
  2466. [ 72%] Building CXX object gr-trellis/src/lib/CMakeFiles/gnuradio-trellis.dir/trellis_metrics_f.cc.o
  2467. [ 72%] Building CXX object gr-blocks/lib/CMakeFiles/gnuradio-blocks.dir/not_bb_impl.cc.o
  2468. [ 72%] Building CXX object gr-blocks/lib/CMakeFiles/gnuradio-blocks.dir/not_ss_impl.cc.o
  2469. [ 72%] Building CXX object gr-trellis/src/lib/CMakeFiles/gnuradio-trellis.dir/trellis_metrics_c.cc.o
  2470. [ 72%] Building CXX object gr-trellis/src/lib/CMakeFiles/gnuradio-trellis.dir/trellis_viterbi_b.cc.o
  2471. [ 72%] Building CXX object gr-blocks/lib/CMakeFiles/gnuradio-blocks.dir/not_ii_impl.cc.o
  2472. [ 72%] Building CXX object gr-blocks/lib/CMakeFiles/gnuradio-blocks.dir/or_bb_impl.cc.o
  2473. [ 72%] Building CXX object gr-trellis/src/lib/CMakeFiles/gnuradio-trellis.dir/trellis_viterbi_s.cc.o
  2474. [ 72%] Building CXX object gr-blocks/lib/CMakeFiles/gnuradio-blocks.dir/or_ss_impl.cc.o
  2475. [ 72%] Building CXX object gr-blocks/lib/CMakeFiles/gnuradio-blocks.dir/or_ii_impl.cc.o
  2476. [ 72%] Building CXX object gr-trellis/src/lib/CMakeFiles/gnuradio-trellis.dir/trellis_viterbi_i.cc.o
  2477. [ 72%] Building CXX object gr-blocks/lib/CMakeFiles/gnuradio-blocks.dir/peak_detector_fb_impl.cc.o
  2478. [ 72%] Building CXX object gr-blocks/lib/CMakeFiles/gnuradio-blocks.dir/peak_detector_ib_impl.cc.o
  2479. [ 72%] Building CXX object gr-trellis/src/lib/CMakeFiles/gnuradio-trellis.dir/trellis_viterbi_combined_sb.cc.o
  2480. [ 72%] Building CXX object gr-trellis/src/lib/CMakeFiles/gnuradio-trellis.dir/trellis_viterbi_combined_ss.cc.o
  2481. [ 73%] Building CXX object gr-trellis/src/lib/CMakeFiles/gnuradio-trellis.dir/trellis_viterbi_combined_si.cc.o
  2482. [ 74%] Building CXX object gr-blocks/lib/CMakeFiles/gnuradio-blocks.dir/peak_detector_sb_impl.cc.o
  2483. [ 74%] Building CXX object gr-blocks/lib/CMakeFiles/gnuradio-blocks.dir/probe_signal_b_impl.cc.o
  2484. [ 74%] Building CXX object gr-trellis/src/lib/CMakeFiles/gnuradio-trellis.dir/trellis_viterbi_combined_ib.cc.o
  2485. [ 74%] Building CXX object gr-trellis/src/lib/CMakeFiles/gnuradio-trellis.dir/trellis_viterbi_combined_is.cc.o
  2486. [ 74%] Building CXX object gr-blocks/lib/CMakeFiles/gnuradio-blocks.dir/probe_signal_s_impl.cc.o
  2487. [ 74%] Building CXX object gr-blocks/lib/CMakeFiles/gnuradio-blocks.dir/probe_signal_i_impl.cc.o
  2488. [ 74%] Building CXX object gr-trellis/src/lib/CMakeFiles/gnuradio-trellis.dir/trellis_viterbi_combined_ii.cc.o
  2489. [ 74%] Building CXX object gr-trellis/src/lib/CMakeFiles/gnuradio-trellis.dir/trellis_viterbi_combined_fb.cc.o
  2490. [ 74%] Building CXX object gr-trellis/src/lib/CMakeFiles/gnuradio-trellis.dir/trellis_viterbi_combined_fs.cc.o
  2491. [ 74%] Building CXX object gr-blocks/lib/CMakeFiles/gnuradio-blocks.dir/probe_signal_f_impl.cc.o
  2492. [ 74%] Building CXX object gr-blocks/lib/CMakeFiles/gnuradio-blocks.dir/probe_signal_c_impl.cc.o
  2493. [ 74%] [ 74%] Building CXX object gr-trellis/src/lib/CMakeFiles/gnuradio-trellis.dir/trellis_viterbi_combined_fi.cc.o
  2494. Building CXX object gr-trellis/src/lib/CMakeFiles/gnuradio-trellis.dir/trellis_viterbi_combined_cb.cc.o
  2495. [ 74%] Building CXX object gr-trellis/src/lib/CMakeFiles/gnuradio-trellis.dir/trellis_viterbi_combined_cs.cc.o
  2496. [ 74%] Building CXX object gr-blocks/lib/CMakeFiles/gnuradio-blocks.dir/probe_signal_vb_impl.cc.o
  2497. [ 74%] Building CXX object gr-trellis/src/lib/CMakeFiles/gnuradio-trellis.dir/trellis_viterbi_combined_ci.cc.o
  2498. [ 74%] Building CXX object gr-trellis/src/lib/CMakeFiles/gnuradio-trellis.dir/trellis_sccc_decoder_b.cc.o
  2499. [ 74%] Building CXX object gr-trellis/src/lib/CMakeFiles/gnuradio-trellis.dir/trellis_sccc_decoder_s.cc.o
  2500. [ 74%] Building CXX object gr-blocks/lib/CMakeFiles/gnuradio-blocks.dir/probe_signal_vs_impl.cc.o
  2501. [ 74%] [ 74%] Building CXX object gr-blocks/lib/CMakeFiles/gnuradio-blocks.dir/probe_signal_vi_impl.cc.o
  2502. Building CXX object gr-trellis/src/lib/CMakeFiles/gnuradio-trellis.dir/trellis_sccc_decoder_i.cc.o
  2503. [ 74%] Building CXX object gr-trellis/src/lib/CMakeFiles/gnuradio-trellis.dir/trellis_sccc_decoder_combined_fb.cc.o
  2504. [ 74%] Building CXX object gr-blocks/lib/CMakeFiles/gnuradio-blocks.dir/probe_signal_vf_impl.cc.o
  2505. [ 74%] Building CXX object gr-blocks/lib/CMakeFiles/gnuradio-blocks.dir/probe_signal_vc_impl.cc.o
  2506. [ 74%] Building CXX object gr-trellis/src/lib/CMakeFiles/gnuradio-trellis.dir/trellis_sccc_decoder_combined_fs.cc.o
  2507. [ 74%] Building CXX object gr-blocks/lib/CMakeFiles/gnuradio-blocks.dir/sample_and_hold_bb_impl.cc.o
  2508. [ 74%] Building CXX object gr-blocks/lib/CMakeFiles/gnuradio-blocks.dir/sample_and_hold_ss_impl.cc.o
  2509. [ 74%] Building CXX object gr-trellis/src/lib/CMakeFiles/gnuradio-trellis.dir/trellis_sccc_decoder_combined_fi.cc.o
  2510. [ 74%] Building CXX object gr-trellis/src/lib/CMakeFiles/gnuradio-trellis.dir/trellis_sccc_decoder_combined_cb.cc.o
  2511. [ 74%] Building CXX object gr-blocks/lib/CMakeFiles/gnuradio-blocks.dir/sample_and_hold_ii_impl.cc.o
  2512. [ 74%] Building CXX object gr-blocks/lib/CMakeFiles/gnuradio-blocks.dir/sample_and_hold_ff_impl.cc.o
  2513. [ 74%] Building CXX object gr-trellis/src/lib/CMakeFiles/gnuradio-trellis.dir/trellis_sccc_decoder_combined_cs.cc.o
  2514. [ 74%] Building CXX object gr-trellis/src/lib/CMakeFiles/gnuradio-trellis.dir/trellis_sccc_decoder_combined_ci.cc.o
  2515. [ 74%] Building CXX object gr-blocks/lib/CMakeFiles/gnuradio-blocks.dir/sub_ss_impl.cc.o
  2516. [ 74%] Building CXX object gr-blocks/lib/CMakeFiles/gnuradio-blocks.dir/sub_ii_impl.cc.o
  2517. [ 74%] Building CXX object gr-blocks/lib/CMakeFiles/gnuradio-blocks.dir/sub_ff_impl.cc.o
  2518. [ 75%] Building CXX object gr-trellis/src/lib/CMakeFiles/gnuradio-trellis.dir/trellis_pccc_decoder_b.cc.o
  2519. [ 75%] Building CXX object gr-blocks/lib/CMakeFiles/gnuradio-blocks.dir/sub_cc_impl.cc.o
  2520. [ 76%] Building CXX object gr-blocks/lib/CMakeFiles/gnuradio-blocks.dir/xor_bb_impl.cc.o
  2521. [ 76%] Building CXX object gr-blocks/lib/CMakeFiles/gnuradio-blocks.dir/xor_ss_impl.cc.o
  2522. [ 76%] Building CXX object gr-trellis/src/lib/CMakeFiles/gnuradio-trellis.dir/trellis_pccc_decoder_s.cc.o
  2523. [ 76%] Building CXX object gr-blocks/lib/CMakeFiles/gnuradio-blocks.dir/xor_ii_impl.cc.o
  2524. [ 76%] Building CXX object gr-trellis/src/lib/CMakeFiles/gnuradio-trellis.dir/trellis_pccc_decoder_i.cc.o
  2525. [ 76%] Building CXX object gr-trellis/src/lib/CMakeFiles/gnuradio-trellis.dir/trellis_pccc_decoder_combined_fb.cc.o
  2526. [ 76%] Building CXX object gr-blocks/lib/CMakeFiles/gnuradio-blocks.dir/packed_to_unpacked_bb_impl.cc.o
  2527. [ 76%] Building CXX object gr-blocks/lib/CMakeFiles/gnuradio-blocks.dir/packed_to_unpacked_ss_impl.cc.o
  2528. [ 76%] Building CXX object gr-blocks/lib/CMakeFiles/gnuradio-blocks.dir/packed_to_unpacked_ii_impl.cc.o
  2529. [ 76%] Building CXX object gr-trellis/src/lib/CMakeFiles/gnuradio-trellis.dir/trellis_pccc_decoder_combined_fs.cc.o
  2530. [ 76%] Building CXX object gr-trellis/src/lib/CMakeFiles/gnuradio-trellis.dir/trellis_pccc_decoder_combined_fi.cc.o
  2531. [ 76%] Building CXX object gr-trellis/src/lib/CMakeFiles/gnuradio-trellis.dir/trellis_pccc_decoder_combined_cb.cc.o
  2532. [ 76%] Building CXX object gr-blocks/lib/CMakeFiles/gnuradio-blocks.dir/unpacked_to_packed_bb_impl.cc.o
  2533. [ 76%] Building CXX object gr-blocks/lib/CMakeFiles/gnuradio-blocks.dir/unpacked_to_packed_ss_impl.cc.o
  2534. [ 76%] Building CXX object gr-trellis/src/lib/CMakeFiles/gnuradio-trellis.dir/trellis_pccc_decoder_combined_cs.cc.o
  2535. [ 76%] Building CXX object gr-trellis/src/lib/CMakeFiles/gnuradio-trellis.dir/trellis_pccc_decoder_combined_ci.cc.o
  2536. [ 76%] Building CXX object gr-blocks/lib/CMakeFiles/gnuradio-blocks.dir/unpacked_to_packed_ii_impl.cc.o
  2537. [ 76%] Building CXX object gr-blocks/lib/CMakeFiles/gnuradio-blocks.dir/vector_insert_b_impl.cc.o
  2538. [ 76%] Building CXX object gr-blocks/lib/CMakeFiles/gnuradio-blocks.dir/vector_insert_s_impl.cc.o
  2539. Linking CXX shared library libgnuradio-trellis.dylib
  2540. [ 77%] Built target gnuradio-trellis
  2541. [ 77%] Building CXX object gr-blocks/lib/CMakeFiles/gnuradio-blocks.dir/vector_insert_i_impl.cc.o
  2542. [ 77%] Building CXX object gr-blocks/lib/CMakeFiles/gnuradio-blocks.dir/vector_insert_f_impl.cc.o
  2543. [ 77%] Building CXX object gr-blocks/lib/CMakeFiles/gnuradio-blocks.dir/vector_insert_c_impl.cc.o
  2544. [ 77%] Building CXX object gr-blocks/lib/CMakeFiles/gnuradio-blocks.dir/vector_sink_b_impl.cc.o
  2545. [ 77%] Building CXX object gr-blocks/lib/CMakeFiles/gnuradio-blocks.dir/vector_sink_s_impl.cc.o
  2546. [ 77%] Building CXX object gr-blocks/lib/CMakeFiles/gnuradio-blocks.dir/vector_sink_i_impl.cc.o
  2547. [ 77%] Building CXX object gr-blocks/lib/CMakeFiles/gnuradio-blocks.dir/vector_sink_f_impl.cc.o
  2548. [ 77%] Building CXX object gr-blocks/lib/CMakeFiles/gnuradio-blocks.dir/vector_sink_c_impl.cc.o
  2549. [ 78%] Building CXX object gr-blocks/lib/CMakeFiles/gnuradio-blocks.dir/vector_source_b_impl.cc.o
  2550. [ 78%] Building CXX object gr-blocks/lib/CMakeFiles/gnuradio-blocks.dir/vector_source_s_impl.cc.o
  2551. [ 78%] Building CXX object gr-blocks/lib/CMakeFiles/gnuradio-blocks.dir/vector_source_i_impl.cc.o
  2552. [ 78%] Building CXX object gr-blocks/lib/CMakeFiles/gnuradio-blocks.dir/vector_source_f_impl.cc.o
  2553. [ 78%] Building CXX object gr-blocks/lib/CMakeFiles/gnuradio-blocks.dir/vector_source_c_impl.cc.o
  2554. [ 78%] Building CXX object gr-blocks/lib/CMakeFiles/gnuradio-blocks.dir/control_loop.cc.o
  2555. [ 78%] Building CXX object gr-blocks/lib/CMakeFiles/gnuradio-blocks.dir/count_bits.cc.o
  2556. [ 78%] Building CXX object gr-blocks/lib/CMakeFiles/gnuradio-blocks.dir/file_sink_base.cc.o
  2557. [ 78%] Building CXX object gr-blocks/lib/CMakeFiles/gnuradio-blocks.dir/wavfile.cc.o
  2558. [ 78%] Building CXX object gr-blocks/lib/CMakeFiles/gnuradio-blocks.dir/add_ff_impl.cc.o
  2559. [ 78%] Building CXX object gr-blocks/lib/CMakeFiles/gnuradio-blocks.dir/annotator_1to1_impl.cc.o
  2560. [ 78%] Building CXX object gr-blocks/lib/CMakeFiles/gnuradio-blocks.dir/annotator_alltoall_impl.cc.o
  2561. [ 78%] Building CXX object gr-blocks/lib/CMakeFiles/gnuradio-blocks.dir/annotator_raw_impl.cc.o
  2562. [ 78%] Building CXX object gr-blocks/lib/CMakeFiles/gnuradio-blocks.dir/bin_statistics_f_impl.cc.o
  2563. [ 78%] Building CXX object gr-blocks/lib/CMakeFiles/gnuradio-blocks.dir/burst_tagger_impl.cc.o
  2564. [ 78%] Building CXX object gr-blocks/lib/CMakeFiles/gnuradio-blocks.dir/char_to_float_impl.cc.o
  2565. [ 78%] Building CXX object gr-blocks/lib/CMakeFiles/gnuradio-blocks.dir/char_to_short_impl.cc.o
  2566. [ 78%] Building CXX object gr-blocks/lib/CMakeFiles/gnuradio-blocks.dir/check_lfsr_32k_s_impl.cc.o
  2567. [ 78%] Building CXX object gr-blocks/lib/CMakeFiles/gnuradio-blocks.dir/complex_to_interleaved_short_impl.cc.o
  2568. [ 79%] Building CXX object gr-blocks/lib/CMakeFiles/gnuradio-blocks.dir/complex_to_float_impl.cc.o
  2569. [ 79%] Building CXX object gr-blocks/lib/CMakeFiles/gnuradio-blocks.dir/complex_to_real_impl.cc.o
  2570. [ 79%] Building CXX object gr-blocks/lib/CMakeFiles/gnuradio-blocks.dir/complex_to_imag_impl.cc.o
  2571. [ 79%] Building CXX object gr-blocks/lib/CMakeFiles/gnuradio-blocks.dir/complex_to_mag_impl.cc.o
  2572. [ 79%] Building CXX object gr-blocks/lib/CMakeFiles/gnuradio-blocks.dir/complex_to_mag_squared_impl.cc.o
  2573. [ 79%] Building CXX object gr-blocks/lib/CMakeFiles/gnuradio-blocks.dir/complex_to_arg_impl.cc.o
  2574. [ 79%] Building CXX object gr-blocks/lib/CMakeFiles/gnuradio-blocks.dir/conjugate_cc_impl.cc.o
  2575. [ 79%] Building CXX object gr-blocks/lib/CMakeFiles/gnuradio-blocks.dir/copy_impl.cc.o
  2576. [ 79%] Building CXX object gr-blocks/lib/CMakeFiles/gnuradio-blocks.dir/deinterleave_impl.cc.o
  2577. [ 79%] Building CXX object gr-blocks/lib/CMakeFiles/gnuradio-blocks.dir/delay_impl.cc.o
  2578. [ 79%] Building CXX object gr-blocks/lib/CMakeFiles/gnuradio-blocks.dir/endian_swap_impl.cc.o
  2579. [ 79%] Building CXX object gr-blocks/lib/CMakeFiles/gnuradio-blocks.dir/file_descriptor_sink_impl.cc.o
  2580. [ 79%] Building CXX object gr-blocks/lib/CMakeFiles/gnuradio-blocks.dir/file_descriptor_source_impl.cc.o
  2581. [ 79%] [ 79%] Building CXX object gr-blocks/lib/CMakeFiles/gnuradio-blocks.dir/file_sink_impl.cc.o
  2582. Building CXX object gr-blocks/lib/CMakeFiles/gnuradio-blocks.dir/file_source_impl.cc.o
  2583. [ 79%] Building CXX object gr-blocks/lib/CMakeFiles/gnuradio-blocks.dir/file_meta_sink_impl.cc.o
  2584. [ 79%] Building CXX object gr-blocks/lib/CMakeFiles/gnuradio-blocks.dir/file_meta_source_impl.cc.o
  2585. [ 79%] Building CXX object gr-blocks/lib/CMakeFiles/gnuradio-blocks.dir/float_to_char_impl.cc.o
  2586. [ 79%] Building CXX object gr-blocks/lib/CMakeFiles/gnuradio-blocks.dir/float_to_complex_impl.cc.o
  2587. [ 80%] Building CXX object gr-blocks/lib/CMakeFiles/gnuradio-blocks.dir/float_array_to_int.cc.o
  2588. [ 80%] Building CXX object gr-blocks/lib/CMakeFiles/gnuradio-blocks.dir/float_to_int_impl.cc.o
  2589. [ 80%] Building CXX object gr-blocks/lib/CMakeFiles/gnuradio-blocks.dir/float_to_short_impl.cc.o
  2590. [ 80%] Building CXX object gr-blocks/lib/CMakeFiles/gnuradio-blocks.dir/float_array_to_uchar.cc.o
  2591. [ 80%] Building CXX object gr-blocks/lib/CMakeFiles/gnuradio-blocks.dir/float_to_uchar_impl.cc.o
  2592. [ 80%] Building CXX object gr-blocks/lib/CMakeFiles/gnuradio-blocks.dir/head_impl.cc.o
  2593. [ 80%] Building CXX object gr-blocks/lib/CMakeFiles/gnuradio-blocks.dir/int_to_float_impl.cc.o
  2594. [ 80%] Building CXX object gr-blocks/lib/CMakeFiles/gnuradio-blocks.dir/interleave_impl.cc.o
  2595. [ 80%] Building CXX object gr-blocks/lib/CMakeFiles/gnuradio-blocks.dir/interleaved_short_array_to_complex.cc.o
  2596. [ 80%] Building CXX object gr-blocks/lib/CMakeFiles/gnuradio-blocks.dir/interleaved_short_to_complex_impl.cc.o
  2597. [ 80%] Building CXX object gr-blocks/lib/CMakeFiles/gnuradio-blocks.dir/keep_m_in_n_impl.cc.o
  2598. [ 80%] Building CXX object gr-blocks/lib/CMakeFiles/gnuradio-blocks.dir/keep_one_in_n_impl.cc.o
  2599. [ 80%] Building CXX object gr-blocks/lib/CMakeFiles/gnuradio-blocks.dir/lfsr_32k_source_s_impl.cc.o
  2600. [ 80%] Building CXX object gr-blocks/lib/CMakeFiles/gnuradio-blocks.dir/message_debug_impl.cc.o
  2601. [ 80%] Building CXX object gr-blocks/lib/CMakeFiles/gnuradio-blocks.dir/message_sink_impl.cc.o
  2602. [ 80%] Building CXX object gr-blocks/lib/CMakeFiles/gnuradio-blocks.dir/message_source_impl.cc.o
  2603. [ 80%] Building CXX object gr-blocks/lib/CMakeFiles/gnuradio-blocks.dir/message_strobe_impl.cc.o
  2604. [ 80%] Building CXX object gr-blocks/lib/CMakeFiles/gnuradio-blocks.dir/message_burst_source_impl.cc.o
  2605. [ 80%] Building CXX object gr-blocks/lib/CMakeFiles/gnuradio-blocks.dir/multiply_cc_impl.cc.o
  2606. [ 81%] Building CXX object gr-blocks/lib/CMakeFiles/gnuradio-blocks.dir/multiply_ff_impl.cc.o
  2607. [ 81%] Building CXX object gr-blocks/lib/CMakeFiles/gnuradio-blocks.dir/multiply_conjugate_cc_impl.cc.o
  2608. [ 81%] Building CXX object gr-blocks/lib/CMakeFiles/gnuradio-blocks.dir/multiply_const_cc_impl.cc.o
  2609. [ 81%] Building CXX object gr-blocks/lib/CMakeFiles/gnuradio-blocks.dir/multiply_const_ff_impl.cc.o
  2610. [ 81%] Building CXX object gr-blocks/lib/CMakeFiles/gnuradio-blocks.dir/nlog10_ff_impl.cc.o
  2611. [ 81%] Building CXX object gr-blocks/lib/CMakeFiles/gnuradio-blocks.dir/nop_impl.cc.o
  2612. [ 81%] Building CXX object gr-blocks/lib/CMakeFiles/gnuradio-blocks.dir/null_sink_impl.cc.o
  2613. [ 81%] Building CXX object gr-blocks/lib/CMakeFiles/gnuradio-blocks.dir/null_source_impl.cc.o
  2614. [ 81%] Building CXX object gr-blocks/lib/CMakeFiles/gnuradio-blocks.dir/pack_k_bits_bb_impl.cc.o
  2615. [ 81%] Building CXX object gr-blocks/lib/CMakeFiles/gnuradio-blocks.dir/patterned_interleaver_impl.cc.o
  2616. [ 81%] Building CXX object gr-blocks/lib/CMakeFiles/gnuradio-blocks.dir/pdu.cc.o
  2617. [ 81%] Building CXX object gr-blocks/lib/CMakeFiles/gnuradio-blocks.dir/tag_debug_impl.cc.o
  2618. [ 81%] Building CXX object gr-blocks/lib/CMakeFiles/gnuradio-blocks.dir/pdu_to_tagged_stream_impl.cc.o
  2619. [ 81%] Building CXX object gr-blocks/lib/CMakeFiles/gnuradio-blocks.dir/peak_detector2_fb_impl.cc.o
  2620. [ 81%] Building CXX object gr-blocks/lib/CMakeFiles/gnuradio-blocks.dir/plateau_detector_fb_impl.cc.o
  2621. [ 81%] Building CXX object gr-blocks/lib/CMakeFiles/gnuradio-blocks.dir/probe_rate_impl.cc.o
  2622. [ 81%] Building CXX object gr-blocks/lib/CMakeFiles/gnuradio-blocks.dir/regenerate_bb_impl.cc.o
  2623. [ 81%] Building CXX object gr-blocks/lib/CMakeFiles/gnuradio-blocks.dir/repack_bits_bb_impl.cc.o
  2624. [ 81%] Building CXX object gr-blocks/lib/CMakeFiles/gnuradio-blocks.dir/repeat_impl.cc.o
  2625. [ 81%] Building CXX object gr-blocks/lib/CMakeFiles/gnuradio-blocks.dir/rms_cf_impl.cc.o
  2626. [ 82%] Building CXX object gr-blocks/lib/CMakeFiles/gnuradio-blocks.dir/rms_ff_impl.cc.o
  2627. [ 82%] Building CXX object gr-blocks/lib/CMakeFiles/gnuradio-blocks.dir/short_to_char_impl.cc.o
  2628. [ 82%] Building CXX object gr-blocks/lib/CMakeFiles/gnuradio-blocks.dir/short_to_float_impl.cc.o
  2629. [ 82%] [ 82%] Building CXX object gr-blocks/lib/CMakeFiles/gnuradio-blocks.dir/skiphead_impl.cc.o
  2630. Building CXX object gr-blocks/lib/CMakeFiles/gnuradio-blocks.dir/socket_pdu_impl.cc.o
  2631. [ 82%] Building CXX object gr-blocks/lib/CMakeFiles/gnuradio-blocks.dir/stream_mux_impl.cc.o
  2632. [ 82%] Building CXX object gr-blocks/lib/CMakeFiles/gnuradio-blocks.dir/stream_pdu_base.cc.o
  2633. [ 82%] Building CXX object gr-blocks/lib/CMakeFiles/gnuradio-blocks.dir/stream_to_streams_impl.cc.o
  2634. [ 82%] Building CXX object gr-blocks/lib/CMakeFiles/gnuradio-blocks.dir/stream_to_vector_impl.cc.o
  2635. [ 82%] Building CXX object gr-blocks/lib/CMakeFiles/gnuradio-blocks.dir/streams_to_stream_impl.cc.o
  2636. [ 82%] Building CXX object gr-blocks/lib/CMakeFiles/gnuradio-blocks.dir/streams_to_vector_impl.cc.o
  2637. [ 82%] Building CXX object gr-blocks/lib/CMakeFiles/gnuradio-blocks.dir/stretch_ff_impl.cc.o
  2638. [ 82%] Building CXX object gr-blocks/lib/CMakeFiles/gnuradio-blocks.dir/tagged_file_sink_impl.cc.o
  2639. [ 82%] Building CXX object gr-blocks/lib/CMakeFiles/gnuradio-blocks.dir/tagged_stream_to_pdu_impl.cc.o
  2640. [ 82%] Building CXX object gr-blocks/lib/CMakeFiles/gnuradio-blocks.dir/threshold_ff_impl.cc.o
  2641. [ 82%] Building CXX object gr-blocks/lib/CMakeFiles/gnuradio-blocks.dir/throttle_impl.cc.o
  2642. [ 82%] Building CXX object gr-blocks/lib/CMakeFiles/gnuradio-blocks.dir/transcendental_impl.cc.o
  2643. [ 82%] Building CXX object gr-blocks/lib/CMakeFiles/gnuradio-blocks.dir/tcp_connection.cc.o
  2644. [ 82%] Building CXX object gr-blocks/lib/CMakeFiles/gnuradio-blocks.dir/tuntap_pdu_impl.cc.o
  2645. [ 83%] Building CXX object gr-blocks/lib/CMakeFiles/gnuradio-blocks.dir/tagged_stream_mux_impl.cc.o
  2646. [ 83%] Building CXX object gr-blocks/lib/CMakeFiles/gnuradio-blocks.dir/uchar_array_to_float.cc.o
  2647. [ 83%] Building CXX object gr-blocks/lib/CMakeFiles/gnuradio-blocks.dir/uchar_to_float_impl.cc.o
  2648. [ 83%] Building CXX object gr-blocks/lib/CMakeFiles/gnuradio-blocks.dir/udp_sink_impl.cc.o
  2649. [ 83%] Building CXX object gr-blocks/lib/CMakeFiles/gnuradio-blocks.dir/udp_source_impl.cc.o
  2650. [ 83%] Building CXX object gr-blocks/lib/CMakeFiles/gnuradio-blocks.dir/unpack_k_bits_bb_impl.cc.o
  2651. [ 83%] Building CXX object gr-blocks/lib/CMakeFiles/gnuradio-blocks.dir/vco_f_impl.cc.o
  2652. [ 83%] Building CXX object gr-blocks/lib/CMakeFiles/gnuradio-blocks.dir/vector_map_impl.cc.o
  2653. [ 83%] Building CXX object gr-blocks/lib/CMakeFiles/gnuradio-blocks.dir/vector_to_stream_impl.cc.o
  2654. [ 83%] Building CXX object gr-blocks/lib/CMakeFiles/gnuradio-blocks.dir/vector_to_streams_impl.cc.o
  2655. [ 83%] Building CXX object gr-blocks/lib/CMakeFiles/gnuradio-blocks.dir/wavfile_sink_impl.cc.o
  2656. [ 83%] Building CXX object gr-blocks/lib/CMakeFiles/gnuradio-blocks.dir/wavfile_source_impl.cc.o
  2657. [ 83%] Building CXX object gr-blocks/lib/CMakeFiles/gnuradio-blocks.dir/tag_gate_impl.cc.o
  2658. Linking CXX shared library libgnuradio-blocks.dylib
  2659. [ 83%] Built target gnuradio-blocks
  2660. make: *** [all] Error 2
  2661. ==> Formula
  2662. Tap: robotastic/hackrf
  2663. Path: /usr/local/Library/Taps/robotastic-hackrf/gnuradio.rb
  2664. ==> Configuration
  2665. HOMEBREW_VERSION: 0.9.4
  2666. HEAD: 26503dacdfa46a15a48d87e6b970e0551e900434
  2667. CPU: quad-core 64-bit sandybridge
  2668. OS X: 10.8.4-x86_64
  2669. Xcode: 4.6.3
  2670. CLT: 1.0.0.9000000000.1.1249367152
  2671. X11: 2.7.4 => /opt/X11
  2672. ==> ENV
  2673. LD: /usr/local/bin/gcc-4.2 => /usr/local/Cellar/apple-gcc42/4.2.1-5666.3/bin/gcc-4.2
  2674. HOMEBREW_CC: clang
  2675. MAKEFLAGS: -j4
  2676. CMAKE_PREFIX_PATH: /usr/local/opt/readline:/usr/local/opt/sqlite:/usr/local/opt/gettext:/usr/local/opt/libffi:/usr/local/opt/icu4c:/usr/local
  2677. CMAKE_INCLUDE_PATH: /opt/X11/include/freetype2:/usr/include/libxml2:/opt/X11/include:/usr/local/opt/python/Frameworks/Python.framework/Versions/2.7/Headers:/usr/local/opt/python/Frameworks/Python.framework/Versions/2.7/Headers:/usr/local/opt/python/Frameworks/Python.framework/Versions/2.7/Headers:/usr/local/opt/python/Frameworks/Python.framework/Versions/2.7/Headers:/usr/local/opt/python/Frameworks/Python.framework/Versions/2.7/Headers:/usr/local/opt/python/Frameworks/Python.framework/Versions/2.7/Headers
  2678. CMAKE_LIBRARY_PATH: /opt/X11/lib
  2679. CMAKE_FRAMEWORK_PATH: /usr/local/opt/python/Frameworks:/usr/local/opt/qt/Frameworks
  2680. PKG_CONFIG_PATH: /usr/local/opt/sqlite/lib/pkgconfig:/usr/local/opt/cppunit/lib/pkgconfig:/usr/local/opt/gsl/lib/pkgconfig:/usr/local/opt/fftw/lib/pkgconfig:/usr/local/opt/pcre/lib/pkgconfig:/usr/local/opt/libffi/lib/pkgconfig:/usr/local/opt/glib/lib/pkgconfig:/usr/local/opt/libtiff/lib/pkgconfig:/usr/local/opt/libpng/lib/pkgconfig:/usr/local/opt/gdk-pixbuf/lib/pkgconfig:/usr/local/opt/pixman/lib/pkgconfig:/usr/local/opt/cairo/lib/pkgconfig:/usr/local/opt/icu4c/lib/pkgconfig:/usr/local/opt/freetype/lib/pkgconfig:/usr/local/opt/fontconfig/lib/pkgconfig:/usr/local/opt/harfbuzz/lib/pkgconfig:/usr/local/opt/pango/lib/pkgconfig:/usr/local/opt/atk/lib/pkgconfig:/usr/local/opt/gtk+/lib/pkgconfig:/usr/local/opt/pygobject/lib/pkgconfig:/usr/local/opt/py2cairo/lib/pkgconfig:/usr/local/opt/pygtk/lib/pkgconfig:/usr/local/opt/sdl/lib/pkgconfig:/usr/local/opt/libusb/lib/pkgconfig:/usr/local/opt/orc/lib/pkgconfig:/usr/local/opt/qt/lib/pkgconfig:/usr/local/opt/python/Frameworks/Python.framework/Versions/2.7/lib/pkgconfig:/usr/local/opt/python/Frameworks/Python.framework/Versions/2.7/lib/pkgconfig:/usr/local/opt/python/Frameworks/Python.framework/Versions/2.7/lib/pkgconfig:/usr/local/opt/python/Frameworks/Python.framework/Versions/2.7/lib/pkgconfig:/usr/local/opt/python/Frameworks/Python.framework/Versions/2.7/lib/pkgconfig:/usr/local/opt/python/Frameworks/Python.framework/Versions/2.7/lib/pkgconfig
  2681. PKG_CONFIG_LIBDIR: /usr/lib/pkgconfig:/usr/local/Library/ENV/pkgconfig/10.8:/opt/X11/lib/pkgconfig:/opt/X11/share/pkgconfig
  2682. ACLOCAL_PATH: /usr/local/opt/gettext/share/aclocal:/usr/local/share/aclocal:/opt/X11/share/aclocal
  2683. OBJC: cc
  2684. PATH: /usr/local/opt/python/bin:/usr/local/opt/python/bin:/usr/local/opt/python/bin:/usr/local/opt/python/bin:/usr/local/opt/python/bin:/usr/local/opt/python/bin:/usr/local/Library/ENV/4.3:/usr/local/opt/apple-gcc42/bin:/usr/local/opt/cmake/bin:/usr/local/opt/sqlite/bin:/usr/local/opt/gdbm/bin:/usr/local/opt/python/bin:/usr/local/opt/cppunit/bin:/usr/local/opt/gsl/bin:/usr/local/opt/fftw/bin:/usr/local/opt/pcre/bin:/usr/local/opt/swig/bin:/usr/local/opt/gettext/bin:/usr/local/opt/glib/bin:/usr/local/opt/jpeg/bin:/usr/local/opt/libtiff/bin:/usr/local/opt/libpng/bin:/usr/local/opt/gdk-pixbuf/bin:/usr/local/opt/cairo/bin:/usr/local/opt/icu4c/bin:/usr/local/opt/freetype/bin:/usr/local/opt/fontconfig/bin:/usr/local/opt/harfbuzz/bin:/usr/local/opt/pango/bin:/usr/local/opt/gtk+/bin:/usr/local/opt/pygobject/bin:/usr/local/opt/pygtk/bin:/usr/local/opt/sdl/bin:/usr/local/opt/orc/bin:/usr/local/opt/qt/bin:/usr/local/opt/sip/bin:/usr/local/opt/pyqt/bin:/opt/X11/bin:/usr/bin:/bin:/usr/sbin:/sbin
  2685.  
  2686. Error: gnuradio did not build
  2687.  
  2688. McFu-2:~ linkxs$ brew install gnuradio --with-qt -v
Advertisement
Add Comment
Please, Sign In to add comment