SHARE
TWEET

Untitled

WorseDoughnut Oct 22nd, 2019 168 Never
Not a member of Pastebin yet? Sign Up, it unlocks many cool features!
  1. Cloning monodevelop-stable build files...
  2. Checking monodevelop-stable dependencies...
  3. Cloning fsharp build files...
  4. Checking fsharp dependencies...
  5. Preparing...
  6.  
  7. Building fsharp...
  8. ==> Making package: fsharp 4.5.0-3 (Tue 22 Oct 2019 05:37:53 PM EDT)
  9. ==> Checking runtime dependencies...
  10. ==> Checking buildtime dependencies...
  11. ==> Retrieving sources...
  12.   -> Found fsharp-4.5.0.tar.gz
  13. ==> Validating source files with sha256sums...
  14.     fsharp-4.5.0.tar.gz ... Passed
  15. ==> Removing existing $srcdir/ directory...
  16. ==> Extracting sources...
  17.   -> Extracting fsharp-4.5.0.tar.gz with bsdtar
  18. ==> Removing existing $pkgdir/ directory...
  19. ==> Starting build()...
  20. -----------
  21. prefix=/usr
  22. topdir=/var/tmp/pamac-build-ant/fsharp/src/fsharp-4.5.0/mono/../
  23. monodir=/usr/lib/mono
  24. monolibdir=/usr/lib/
  25. monobindir=/usr/bin/
  26. -----------
  27. make restore
  28. make[1]: Entering directory '/var/tmp/pamac-build-ant/fsharp/src/fsharp-4.5.0'
  29. MONO_ENV_OPTIONS= mono .nuget/NuGet.exe restore packages.config -PackagesDirectory packages -ConfigFile ./NuGet.Config
  30. Restoring NuGet package System.Reflection.Metadata.1.6.0.
  31. Restoring NuGet package MicroBuild.Core.0.2.0.
  32. Restoring NuGet package System.Collections.Immutable.1.5.0.
  33. Restoring NuGet package FsLexYacc.7.0.6.
  34. Adding package 'MicroBuild.Core.0.2.0' to folder '/var/tmp/pamac-build-ant/fsharp/src/fsharp-4.5.0/packages'
  35. Adding package 'System.Reflection.Metadata.1.6.0' to folder '/var/tmp/pamac-build-ant/fsharp/src/fsharp-4.5.0/packages'
  36. Adding package 'System.Collections.Immutable.1.5.0' to folder '/var/tmp/pamac-build-ant/fsharp/src/fsharp-4.5.0/packages'
  37. Adding package 'FsLexYacc.7.0.6' to folder '/var/tmp/pamac-build-ant/fsharp/src/fsharp-4.5.0/packages'
  38. Added package 'MicroBuild.Core.0.2.0' to folder '/var/tmp/pamac-build-ant/fsharp/src/fsharp-4.5.0/packages'
  39. Restoring NuGet package System.ValueTuple.4.4.0.
  40. Adding package 'System.ValueTuple.4.4.0' to folder '/var/tmp/pamac-build-ant/fsharp/src/fsharp-4.5.0/packages'
  41. Added package 'System.Reflection.Metadata.1.6.0' to folder '/var/tmp/pamac-build-ant/fsharp/src/fsharp-4.5.0/packages'
  42. Restoring NuGet package Microsoft.Build.14.3.0.
  43. Adding package 'Microsoft.Build.14.3.0' to folder '/var/tmp/pamac-build-ant/fsharp/src/fsharp-4.5.0/packages'
  44. Added package 'System.Collections.Immutable.1.5.0' to folder '/var/tmp/pamac-build-ant/fsharp/src/fsharp-4.5.0/packages'
  45. Restoring NuGet package Microsoft.Build.Framework.14.3.0.
  46. Adding package 'Microsoft.Build.Framework.14.3.0' to folder '/var/tmp/pamac-build-ant/fsharp/src/fsharp-4.5.0/packages'
  47. Added package 'FsLexYacc.7.0.6' to folder '/var/tmp/pamac-build-ant/fsharp/src/fsharp-4.5.0/packages'
  48. Restoring NuGet package Microsoft.Build.Utilities.Core.14.3.0.
  49. Adding package 'Microsoft.Build.Utilities.Core.14.3.0' to folder '/var/tmp/pamac-build-ant/fsharp/src/fsharp-4.5.0/packages'
  50. Added package 'Microsoft.Build.Framework.14.3.0' to folder '/var/tmp/pamac-build-ant/fsharp/src/fsharp-4.5.0/packages'
  51. Restoring NuGet package Microsoft.Build.Tasks.Core.14.3.0.
  52. Adding package 'Microsoft.Build.Tasks.Core.14.3.0' to folder '/var/tmp/pamac-build-ant/fsharp/src/fsharp-4.5.0/packages'
  53. Added package 'System.ValueTuple.4.4.0' to folder '/var/tmp/pamac-build-ant/fsharp/src/fsharp-4.5.0/packages'
  54. Restoring NuGet package Microsoft.Build.15.6.85.
  55. Added package 'Microsoft.Build.Utilities.Core.14.3.0' to folder '/var/tmp/pamac-build-ant/fsharp/src/fsharp-4.5.0/packages'
  56. Restoring NuGet package Microsoft.Build.Framework.15.6.85.
  57. Adding package 'Microsoft.Build.15.6.85' to folder '/var/tmp/pamac-build-ant/fsharp/src/fsharp-4.5.0/packages'
  58. Adding package 'Microsoft.Build.Framework.15.6.85' to folder '/var/tmp/pamac-build-ant/fsharp/src/fsharp-4.5.0/packages'
  59. Added package 'Microsoft.Build.14.3.0' to folder '/var/tmp/pamac-build-ant/fsharp/src/fsharp-4.5.0/packages'
  60. Restoring NuGet package Microsoft.Build.Utilities.Core.15.6.85.
  61. Adding package 'Microsoft.Build.Utilities.Core.15.6.85' to folder '/var/tmp/pamac-build-ant/fsharp/src/fsharp-4.5.0/packages'
  62. Added package 'Microsoft.Build.Framework.15.6.85' to folder '/var/tmp/pamac-build-ant/fsharp/src/fsharp-4.5.0/packages'
  63. Restoring NuGet package Microsoft.Build.Tasks.Core.15.6.85.
  64. Adding package 'Microsoft.Build.Tasks.Core.15.6.85' to folder '/var/tmp/pamac-build-ant/fsharp/src/fsharp-4.5.0/packages'
  65. Added package 'Microsoft.Build.Tasks.Core.14.3.0' to folder '/var/tmp/pamac-build-ant/fsharp/src/fsharp-4.5.0/packages'
  66. Restoring NuGet package System.IO.Compression.4.3.0.
  67. Adding package 'System.IO.Compression.4.3.0' to folder '/var/tmp/pamac-build-ant/fsharp/src/fsharp-4.5.0/packages'
  68. Added package 'Microsoft.Build.Utilities.Core.15.6.85' to folder '/var/tmp/pamac-build-ant/fsharp/src/fsharp-4.5.0/packages'
  69. Restoring NuGet package FsCheck.3.0.0-alpha3.
  70. Adding package 'FsCheck.3.0.0-alpha3' to folder '/var/tmp/pamac-build-ant/fsharp/src/fsharp-4.5.0/packages'
  71. Added package 'Microsoft.Build.Tasks.Core.15.6.85' to folder '/var/tmp/pamac-build-ant/fsharp/src/fsharp-4.5.0/packages'
  72. Restoring NuGet package NUnit.3.5.0.
  73. Adding package 'NUnit.3.5.0' to folder '/var/tmp/pamac-build-ant/fsharp/src/fsharp-4.5.0/packages'
  74. Added package 'FsCheck.3.0.0-alpha3' to folder '/var/tmp/pamac-build-ant/fsharp/src/fsharp-4.5.0/packages'
  75. Restoring NuGet package NUnit.Console.3.0.0.
  76. Adding package 'NUnit.Console.3.0.0' to folder '/var/tmp/pamac-build-ant/fsharp/src/fsharp-4.5.0/packages'
  77. Added package 'System.IO.Compression.4.3.0' to folder '/var/tmp/pamac-build-ant/fsharp/src/fsharp-4.5.0/packages'
  78. Restoring NuGet package NUnitLite.3.5.0.
  79. Adding package 'NUnitLite.3.5.0' to folder '/var/tmp/pamac-build-ant/fsharp/src/fsharp-4.5.0/packages'
  80. Added package 'NUnit.Console.3.0.0' to folder '/var/tmp/pamac-build-ant/fsharp/src/fsharp-4.5.0/packages'
  81. Restoring NuGet package NUnit3TestAdapter.3.0.8-ctp-8.
  82. Added package 'NUnitLite.3.5.0' to folder '/var/tmp/pamac-build-ant/fsharp/src/fsharp-4.5.0/packages'
  83. Adding package 'NUnit3TestAdapter.3.0.8-ctp-8' to folder '/var/tmp/pamac-build-ant/fsharp/src/fsharp-4.5.0/packages'
  84. Restoring NuGet package BenchmarkDotNet.0.9.8.
  85. Adding package 'BenchmarkDotNet.0.9.8' to folder '/var/tmp/pamac-build-ant/fsharp/src/fsharp-4.5.0/packages'
  86. Added package 'NUnit.3.5.0' to folder '/var/tmp/pamac-build-ant/fsharp/src/fsharp-4.5.0/packages'
  87. Restoring NuGet package BenchmarkDotNet.Diagnostics.Windows.0.9.8.
  88. Adding package 'BenchmarkDotNet.Diagnostics.Windows.0.9.8' to folder '/var/tmp/pamac-build-ant/fsharp/src/fsharp-4.5.0/packages'
  89. Added package 'BenchmarkDotNet.0.9.8' to folder '/var/tmp/pamac-build-ant/fsharp/src/fsharp-4.5.0/packages'
  90. Added package 'NUnit3TestAdapter.3.0.8-ctp-8' to folder '/var/tmp/pamac-build-ant/fsharp/src/fsharp-4.5.0/packages'
  91. Restoring NuGet package Microsoft.Portable.FSharp.Core.10.1.0.
  92. Adding package 'Microsoft.Portable.FSharp.Core.10.1.0' to folder '/var/tmp/pamac-build-ant/fsharp/src/fsharp-4.5.0/packages'
  93. Added package 'BenchmarkDotNet.Diagnostics.Windows.0.9.8' to folder '/var/tmp/pamac-build-ant/fsharp/src/fsharp-4.5.0/packages'
  94. Restoring NuGet package FSharp.Core.4.1.18.
  95. Adding package 'FSharp.Core.4.1.18' to folder '/var/tmp/pamac-build-ant/fsharp/src/fsharp-4.5.0/packages'
  96. Added package 'Microsoft.Build.15.6.85' to folder '/var/tmp/pamac-build-ant/fsharp/src/fsharp-4.5.0/packages'
  97. Restoring NuGet package FSharp.Compiler.Tools.4.1.27.
  98. Restoring NuGet package FSharp.Core.4.0.0.1.
  99. Adding package 'FSharp.Compiler.Tools.4.1.27' to folder '/var/tmp/pamac-build-ant/fsharp/src/fsharp-4.5.0/packages'
  100. Adding package 'FSharp.Core.4.0.0.1' to folder '/var/tmp/pamac-build-ant/fsharp/src/fsharp-4.5.0/packages'
  101. Added package 'FSharp.Core.4.0.0.1' to folder '/var/tmp/pamac-build-ant/fsharp/src/fsharp-4.5.0/packages'
  102. Restoring NuGet package FSharp.Core.3.1.2.5.
  103. Adding package 'FSharp.Core.3.1.2.5' to folder '/var/tmp/pamac-build-ant/fsharp/src/fsharp-4.5.0/packages'
  104. Restoring NuGet package FSharp.Core.3.0.2.
  105. Adding package 'FSharp.Core.3.0.2' to folder '/var/tmp/pamac-build-ant/fsharp/src/fsharp-4.5.0/packages'
  106. Added package 'FSharp.Core.4.1.18' to folder '/var/tmp/pamac-build-ant/fsharp/src/fsharp-4.5.0/packages'
  107. Restoring NuGet package FSharp.Data.2.2.5.
  108. Adding package 'FSharp.Data.2.2.5' to folder '/var/tmp/pamac-build-ant/fsharp/src/fsharp-4.5.0/packages'
  109. Added package 'FSharp.Core.3.0.2' to folder '/var/tmp/pamac-build-ant/fsharp/src/fsharp-4.5.0/packages'
  110. Restoring NuGet package FSharp.Configuration.1.3.0.
  111. Adding package 'FSharp.Configuration.1.3.0' to folder '/var/tmp/pamac-build-ant/fsharp/src/fsharp-4.5.0/packages'
  112. Added package 'FSharp.Configuration.1.3.0' to folder '/var/tmp/pamac-build-ant/fsharp/src/fsharp-4.5.0/packages'
  113. Added package 'FSharp.Compiler.Tools.4.1.27' to folder '/var/tmp/pamac-build-ant/fsharp/src/fsharp-4.5.0/packages'
  114. Added package 'FSharp.Data.2.2.5' to folder '/var/tmp/pamac-build-ant/fsharp/src/fsharp-4.5.0/packages'
  115. Added package 'FSharp.Core.3.1.2.5' to folder '/var/tmp/pamac-build-ant/fsharp/src/fsharp-4.5.0/packages'
  116. Added package 'Microsoft.Portable.FSharp.Core.10.1.0' to folder '/var/tmp/pamac-build-ant/fsharp/src/fsharp-4.5.0/packages'
  117.  
  118. NuGet Config files used:
  119.     /var/tmp/pamac-build-ant/fsharp/src/fsharp-4.5.0/NuGet.Config
  120.  
  121. Feeds used:
  122.     /home/ant/.nuget/packages/
  123.     https://api.nuget.org/v3/index.json
  124.  
  125. Installed:
  126.     29 package(s) to packages.config projects
  127. chmod u+x packages/FSharp.Compiler.Tools.4.1.27/tools/fsi.exe
  128. chmod u+x packages/FsLexYacc.7.0.6/build/fslex.exe
  129. chmod u+x packages/FsLexYacc.7.0.6/build/fsyacc.exe
  130. make[1]: Leaving directory '/var/tmp/pamac-build-ant/fsharp/src/fsharp-4.5.0'
  131. make build-proto
  132. make[1]: Entering directory '/var/tmp/pamac-build-ant/fsharp/src/fsharp-4.5.0'
  133. MONO_ENV_OPTIONS= msbuild /p:Configuration=Proto /p:TargetDotnetProfile=net40 src/fsharp/FSharp.Build-proto/FSharp.Build-proto.fsproj
  134. Microsoft (R) Build Engine version 16.0.0.0 for Mono
  135. Copyright (C) Microsoft Corporation. All rights reserved.
  136.  
  137. Build started 10/22/2019 5:37:58 PM.
  138. Project "/var/tmp/pamac-build-ant/fsharp/src/fsharp-4.5.0/src/fsharp/FSharp.Build-proto/FSharp.Build-proto.fsproj" on node 1 (default targets).
  139. CallFsSrGen:
  140.   Creating directory "obj/Proto/net40/".
  141.   mono /var/tmp/pamac-build-ant/fsharp/src/fsharp-4.5.0/packages/FSharp.Compiler.Tools.4.1.27/tools/fsi.exe --exec "/var/tmp/pamac-build-ant/fsharp/src/fsharp-4.5.0/src/scripts/fssrgen.fsx" "/var/tmp/pamac-build-ant/fsharp/src/fsharp-4.5.0/src/fsharp/FSharp.Build/FSBuild.txt" "obj/Proto/net40/FSBuild.fs"  "obj/Proto/net40/FSBuild.resx"
  142.   fssrgen: args = [|"/var/tmp/pamac-build-ant/fsharp/src/fsharp-4.5.0/src/scripts/fssrgen.fsx";
  143.     "/var/tmp/pamac-build-ant/fsharp/src/fsharp-4.5.0/src/fsharp/FSharp.Build/FSBuild.txt";
  144.     "obj/Proto/net40/FSBuild.fs"; "obj/Proto/net40/FSBuild.resx"|]
  145.   fssrgen.fsx: Reading /var/tmp/pamac-build-ant/fsharp/src/fsharp-4.5.0/src/fsharp/FSharp.Build/FSBuild.txt
  146.   fssrgen.fsx: Parsing /var/tmp/pamac-build-ant/fsharp/src/fsharp-4.5.0/src/fsharp/FSharp.Build/FSBuild.txt
  147.   fssrgen.fsx: Validating /var/tmp/pamac-build-ant/fsharp/src/fsharp-4.5.0/src/fsharp/FSharp.Build/FSBuild.txt
  148.   fssrgen.fsx: Validating uniqueness of /var/tmp/pamac-build-ant/fsharp/src/fsharp-4.5.0/src/fsharp/FSharp.Build/FSBuild.txt
  149.   fssrgen.fsx: Generating /var/tmp/pamac-build-ant/fsharp/src/fsharp-4.5.0/src/fsharp/FSharp.Build-proto/obj/Proto/net40/FSBuild.fs
  150.   fssrgen.fsx: Generating resource methods for /var/tmp/pamac-build-ant/fsharp/src/fsharp-4.5.0/src/fsharp/FSharp.Build-proto/obj/Proto/net40/FSBuild.fs
  151.   fssrgen.fsx: Generating .resx for /var/tmp/pamac-build-ant/fsharp/src/fsharp-4.5.0/src/fsharp/FSharp.Build-proto/obj/Proto/net40/FSBuild.fs
  152.   fssrgen.fsx: Done /var/tmp/pamac-build-ant/fsharp/src/fsharp-4.5.0/src/fsharp/FSharp.Build-proto/obj/Proto/net40/FSBuild.fs
  153. PrepareForBuild:
  154.   Creating directory "/var/tmp/pamac-build-ant/fsharp/src/fsharp-4.5.0/src/fsharp/FSharp.Build-proto/../../../Proto/net40/bin/".
  155. Project "/var/tmp/pamac-build-ant/fsharp/src/fsharp-4.5.0/src/fsharp/FSharp.Build-proto/FSharp.Build-proto.fsproj" (1) is building "/var/tmp/pamac-build-ant/fsharp/src/fsharp-4.5.0/src/fsharp/FSharp.Core/FSharp.Core.fsproj" (2:2) on node 1 (default targets).
  156. PrepareForBuild:
  157.   Creating directory "obj/Proto/net40/".
  158. ResolveAssemblyReferences:
  159.   Primary reference "mscorlib".
  160. /usr/lib/mono/msbuild/15.0/bin/Microsoft.Common.CurrentVersion.targets(2130,5): warning MSB3246: Resolved file has a bad image, no metadata, or is otherwise inaccessible. Could not load file or assembly 'System.Reflection.Metadata, Version=1.4.3.0, Culture=neutral, PublicKeyToken=b03f5f7f11d50a3a' or one of its dependencies. [/var/tmp/pamac-build-ant/fsharp/src/fsharp-4.5.0/src/fsharp/FSharp.Core/FSharp.Core.fsproj]
  161.       Resolved file path is "/usr/lib/mono/4.5-api/mscorlib.dll".
  162.       Reference found at search path location "{TargetFrameworkDirectory}".
  163.           For SearchPath "{TargetFrameworkDirectory}".
  164.           Considered "/usr/lib/mono/xbuild-frameworks/.NETFramework/v4.5/mscorlib.winmd", but it didn't exist.
  165.           Considered "/usr/lib/mono/xbuild-frameworks/.NETFramework/v4.5/mscorlib.dll", but it didn't exist.
  166.           Considered "/usr/lib/mono/xbuild-frameworks/.NETFramework/v4.5/mscorlib.exe", but it didn't exist.
  167.           Considered "/usr/lib/mono/4.5-api/mscorlib.winmd", but it didn't exist.
  168.   Primary reference "System".
  169. /usr/lib/mono/msbuild/15.0/bin/Microsoft.Common.CurrentVersion.targets(2130,5): warning MSB3246: Resolved file has a bad image, no metadata, or is otherwise inaccessible. Could not load file or assembly 'System.Reflection.Metadata, Version=1.4.3.0, Culture=neutral, PublicKeyToken=b03f5f7f11d50a3a' or one of its dependencies. [/var/tmp/pamac-build-ant/fsharp/src/fsharp-4.5.0/src/fsharp/FSharp.Core/FSharp.Core.fsproj]
  170.       Resolved file path is "/usr/lib/mono/4.5-api/System.dll".
  171.       Reference found at search path location "{TargetFrameworkDirectory}".
  172.           For SearchPath "{TargetFrameworkDirectory}".
  173.           Considered "/usr/lib/mono/xbuild-frameworks/.NETFramework/v4.5/System.winmd", but it didn't exist.
  174.           Considered "/usr/lib/mono/xbuild-frameworks/.NETFramework/v4.5/System.dll", but it didn't exist.
  175.           Considered "/usr/lib/mono/xbuild-frameworks/.NETFramework/v4.5/System.exe", but it didn't exist.
  176.           Considered "/usr/lib/mono/4.5-api/System.winmd", but it didn't exist.
  177.   Primary reference "System.Numerics".
  178. /usr/lib/mono/msbuild/15.0/bin/Microsoft.Common.CurrentVersion.targets(2130,5): warning MSB3246: Resolved file has a bad image, no metadata, or is otherwise inaccessible. Could not load file or assembly 'System.Reflection.Metadata, Version=1.4.3.0, Culture=neutral, PublicKeyToken=b03f5f7f11d50a3a' or one of its dependencies. [/var/tmp/pamac-build-ant/fsharp/src/fsharp-4.5.0/src/fsharp/FSharp.Core/FSharp.Core.fsproj]
  179.       Resolved file path is "/usr/lib/mono/4.5-api/System.Numerics.dll".
  180.       Reference found at search path location "{TargetFrameworkDirectory}".
  181.           For SearchPath "{TargetFrameworkDirectory}".
  182.           Considered "/usr/lib/mono/xbuild-frameworks/.NETFramework/v4.5/System.Numerics.winmd", but it didn't exist.
  183.           Considered "/usr/lib/mono/xbuild-frameworks/.NETFramework/v4.5/System.Numerics.dll", but it didn't exist.
  184.           Considered "/usr/lib/mono/xbuild-frameworks/.NETFramework/v4.5/System.Numerics.exe", but it didn't exist.
  185.           Considered "/usr/lib/mono/4.5-api/System.Numerics.winmd", but it didn't exist.
  186.   Primary reference "System.Core".
  187. /usr/lib/mono/msbuild/15.0/bin/Microsoft.Common.CurrentVersion.targets(2130,5): warning MSB3246: Resolved file has a bad image, no metadata, or is otherwise inaccessible. Could not load file or assembly 'System.Reflection.Metadata, Version=1.4.3.0, Culture=neutral, PublicKeyToken=b03f5f7f11d50a3a' or one of its dependencies. [/var/tmp/pamac-build-ant/fsharp/src/fsharp-4.5.0/src/fsharp/FSharp.Core/FSharp.Core.fsproj]
  188.       Resolved file path is "/usr/lib/mono/4.5-api/System.Core.dll".
  189.       Reference found at search path location "{TargetFrameworkDirectory}".
  190.           For SearchPath "{TargetFrameworkDirectory}".
  191.           Considered "/usr/lib/mono/xbuild-frameworks/.NETFramework/v4.5/System.Core.winmd", but it didn't exist.
  192.           Considered "/usr/lib/mono/xbuild-frameworks/.NETFramework/v4.5/System.Core.dll", but it didn't exist.
  193.           Considered "/usr/lib/mono/xbuild-frameworks/.NETFramework/v4.5/System.Core.exe", but it didn't exist.
  194.           Considered "/usr/lib/mono/4.5-api/System.Core.winmd", but it didn't exist.
  195. CoreResGen:
  196.   /usr/lib/mono/4.5/resgen.exe /useSourcePath /compile FSCore.resx,obj/Proto/net40/FSCore.resources
  197.   Processing resource file "FSCore.resx" into "obj/Proto/net40/FSCore.resources".
  198. GenerateTargetFrameworkMonikerAttribute:
  199. Skipping target "GenerateTargetFrameworkMonikerAttribute" because all output files are up-to-date with respect to the input files.
  200. CoreCompile:
  201.   /var/tmp/pamac-build-ant/fsharp/src/fsharp-4.5.0/packages/FSharp.Compiler.Tools.4.1.27/tools/fsc.exe -o:obj/Proto/net40/FSharp.Core.dll
  202.   -g
  203.   --debug:portable
  204.   --noframework
  205.   --baseaddress:0x05000000
  206.   --define:MSBUILD_AT_LEAST_14
  207.   --define:BUILDING_WITH_LKG
  208.   --define:FSHARP_CORE
  209.   --define:DEBUG
  210.   --define:NO_STRONG_NAMES
  211.   --define:CROSS_PLATFORM_COMPILER
  212.   --define:ENABLE_MONO_SUPPORT
  213.   --define:BE_SECURITY_TRANSPARENT
  214.   --define:FX_LCIDFROMCODEPAGE
  215.   --doc:/var/tmp/pamac-build-ant/fsharp/src/fsharp-4.5.0/src/fsharp/FSharp.Core/../../../Proto/net40/bin/FSharp.Core.xml
  216.   --keyfile:/var/tmp/pamac-build-ant/fsharp/src/fsharp-4.5.0/src/fsharp/FSharp.Core/../../fsharp/msft.pubkey
  217.   --delaysign+
  218.   --optimize+
  219.   --resource:obj/Proto/net40/FSCore.resources
  220.   --target:library
  221.   --nowarn:69,65,54,61,75,45,55,62,75,1204
  222.   --warn:3
  223.   --warnaserror
  224.   --warnaserror:76
  225.   --fullpaths
  226.   --flaterrors
  227.   --subsystemversion:6.00
  228.   --highentropyva+
  229.   --times
  230.   --warnon:1182
  231.   --compiling-fslib
  232.   --extraoptimizationloops:1
  233.   --warnon:3218
  234.   --maxerrors:20
  235.   --warnon:1182
  236.   --compiling-fslib
  237.   --maxerrors:20
  238.   --extraoptimizationloops:1
  239.   --compiling-fslib-40
  240.   --version:4.5.0.0
  241.   prim-types-prelude.fsi
  242.   prim-types-prelude.fs
  243.   SR.fs
  244.   prim-types.fsi
  245.   prim-types.fs
  246.   local.fsi
  247.   local.fs
  248.   array2.fsi
  249.   array2.fs
  250.   option.fsi
  251.   option.fs
  252.   result.fsi
  253.   result.fs
  254.   collections.fsi
  255.   collections.fs
  256.   seqcore.fsi
  257.   seqcore.fs
  258.   seq.fsi
  259.   seq.fs
  260.   string.fsi
  261.   string.fs
  262.   list.fsi
  263.   list.fs
  264.   array.fsi
  265.   array.fs
  266.   array3.fsi
  267.   array3.fs
  268.   map.fsi
  269.   map.fs
  270.   set.fsi
  271.   set.fs
  272.   ../../utils/reshapedreflection.fs
  273.   reflect.fsi
  274.   reflect.fs
  275.   math/n.fsi
  276.   math/n.fs
  277.   math/z.fsi
  278.   math/z.fs
  279.   ../../utils/sformat.fsi
  280.   ../../utils/sformat.fs
  281.   printf.fsi
  282.   printf.fs
  283.   quotations.fsi
  284.   quotations.fs
  285.   nativeptr.fsi
  286.   nativeptr.fs
  287.   event.fsi
  288.   event.fs
  289.   async.fsi
  290.   async.fs
  291.   eventmodule.fsi
  292.   eventmodule.fs
  293.   observable.fsi
  294.   observable.fs
  295.   mailbox.fsi
  296.   mailbox.fs
  297.   Linq.fsi
  298.   Linq.fs
  299.   MutableTuple.fs
  300.   QueryExtensions.fs
  301.   Query.fsi
  302.   Query.fs
  303.   SI.fs
  304.   fslib-extra-pervasives.fsi
  305.   fslib-extra-pervasives.fs
  306.   /tmp/.NETFramework,Version=v4.5.AssemblyAttributes.fs
  307.  
  308.  
  309. /var/tmp/pamac-build-ant/fsharp/src/fsharp-4.5.0/src/fsharp/FSharp.Core/local.fs(98,51): error FS0039: The type 'HashSet' is not defined. [/var/tmp/pamac-build-ant/fsharp/src/fsharp-4.5.0/src/fsharp/FSharp.Core/FSharp.Core.fsproj]
  310.  
  311. /var/tmp/pamac-build-ant/fsharp/src/fsharp-4.5.0/src/fsharp/FSharp.Core/local.fs(98,51): error FS0039: The type 'HashSet' is not defined. [/var/tmp/pamac-build-ant/fsharp/src/fsharp-4.5.0/src/fsharp/FSharp.Core/FSharp.Core.fsproj]
  312.  
  313. /var/tmp/pamac-build-ant/fsharp/src/fsharp-4.5.0/src/fsharp/FSharp.Core/local.fs(102,16): error FS0072: Lookup on object of indeterminate type based on information prior to this program point. A type annotation may be needed prior to this program point to constrain the type of the object. This may allow the lookup to be resolved. [/var/tmp/pamac-build-ant/fsharp/src/fsharp-4.5.0/src/fsharp/FSharp.Core/FSharp.Core.fsproj]
  314.  
  315. /var/tmp/pamac-build-ant/fsharp/src/fsharp-4.5.0/src/fsharp/FSharp.Core/local.fs(114,27): error FS0039: The value or constructor 'HashSet' is not defined. Maybe you want one of the following:   hash [/var/tmp/pamac-build-ant/fsharp/src/fsharp-4.5.0/src/fsharp/FSharp.Core/FSharp.Core.fsproj]
  316.  
  317. /var/tmp/pamac-build-ant/fsharp/src/fsharp-4.5.0/src/fsharp/FSharp.Core/local.fs(115,13): error FS0072: Lookup on object of indeterminate type based on information prior to this program point. A type annotation may be needed prior to this program point to constrain the type of the object. This may allow the lookup to be resolved. [/var/tmp/pamac-build-ant/fsharp/src/fsharp-4.5.0/src/fsharp/FSharp.Core/FSharp.Core.fsproj]
  318.  
  319. /var/tmp/pamac-build-ant/fsharp/src/fsharp-4.5.0/src/fsharp/FSharp.Core/local.fs(120,53): error FS0039: The type 'HashSet' is not defined. [/var/tmp/pamac-build-ant/fsharp/src/fsharp-4.5.0/src/fsharp/FSharp.Core/FSharp.Core.fsproj]
  320.  
  321. /var/tmp/pamac-build-ant/fsharp/src/fsharp-4.5.0/src/fsharp/FSharp.Core/local.fs(120,53): error FS0039: The type 'HashSet' is not defined. [/var/tmp/pamac-build-ant/fsharp/src/fsharp-4.5.0/src/fsharp/FSharp.Core/FSharp.Core.fsproj]
  322.  
  323. /var/tmp/pamac-build-ant/fsharp/src/fsharp-4.5.0/src/fsharp/FSharp.Core/local.fs(124,16): error FS0072: Lookup on object of indeterminate type based on information prior to this program point. A type annotation may be needed prior to this program point to constrain the type of the object. This may allow the lookup to be resolved. [/var/tmp/pamac-build-ant/fsharp/src/fsharp-4.5.0/src/fsharp/FSharp.Core/FSharp.Core.fsproj]
  324.  
  325. /var/tmp/pamac-build-ant/fsharp/src/fsharp-4.5.0/src/fsharp/FSharp.Core/local.fs(136,27): error FS0039: The value or constructor 'HashSet' is not defined. Maybe you want one of the following:   hash [/var/tmp/pamac-build-ant/fsharp/src/fsharp-4.5.0/src/fsharp/FSharp.Core/FSharp.Core.fsproj]
  326.  
  327. /var/tmp/pamac-build-ant/fsharp/src/fsharp-4.5.0/src/fsharp/FSharp.Core/local.fs(137,13): error FS0072: Lookup on object of indeterminate type based on information prior to this program point. A type annotation may be needed prior to this program point to constrain the type of the object. This may allow the lookup to be resolved. [/var/tmp/pamac-build-ant/fsharp/src/fsharp-4.5.0/src/fsharp/FSharp.Core/FSharp.Core.fsproj]
  328.  
  329. /var/tmp/pamac-build-ant/fsharp/src/fsharp-4.5.0/src/fsharp/FSharp.Core/seq.fs(758,20): error FS0039: The value, constructor, namespace or type 'Linq' is not defined. [/var/tmp/pamac-build-ant/fsharp/src/fsharp-4.5.0/src/fsharp/FSharp.Core/FSharp.Core.fsproj]
  330.  
  331. /var/tmp/pamac-build-ant/fsharp/src/fsharp-4.5.0/src/fsharp/FSharp.Core/seq.fs(1091,33): error FS0039: The value or constructor 'HashSet' is not defined. Maybe you want one of the following:   hash   Hashtable   HashIdentity   HashCode [/var/tmp/pamac-build-ant/fsharp/src/fsharp-4.5.0/src/fsharp/FSharp.Core/FSharp.Core.fsproj]
  332.  
  333. /var/tmp/pamac-build-ant/fsharp/src/fsharp-4.5.0/src/fsharp/FSharp.Core/seq.fs(1093,26): error FS0072: Lookup on object of indeterminate type based on information prior to this program point. A type annotation may be needed prior to this program point to constrain the type of the object. This may allow the lookup to be resolved. [/var/tmp/pamac-build-ant/fsharp/src/fsharp-4.5.0/src/fsharp/FSharp.Core/FSharp.Core.fsproj]
  334.  
  335. /var/tmp/pamac-build-ant/fsharp/src/fsharp-4.5.0/src/fsharp/FSharp.Core/seq.fs(1100,33): error FS0039: The value or constructor 'HashSet' is not defined. Maybe you want one of the following:   hash   Hashtable   HashIdentity   HashCode [/var/tmp/pamac-build-ant/fsharp/src/fsharp-4.5.0/src/fsharp/FSharp.Core/FSharp.Core.fsproj]
  336.  
  337. /var/tmp/pamac-build-ant/fsharp/src/fsharp-4.5.0/src/fsharp/FSharp.Core/seq.fs(1102,24): error FS0072: Lookup on object of indeterminate type based on information prior to this program point. A type annotation may be needed prior to this program point to constrain the type of the object. This may allow the lookup to be resolved. [/var/tmp/pamac-build-ant/fsharp/src/fsharp-4.5.0/src/fsharp/FSharp.Core/FSharp.Core.fsproj]
  338.  
  339. /var/tmp/pamac-build-ant/fsharp/src/fsharp-4.5.0/src/fsharp/FSharp.Core/seq.fs(1459,34): error FS0039: The value or constructor 'HashSet' is not defined. Maybe you want one of the following:   hash   Hashtable   HashIdentity   HashCode [/var/tmp/pamac-build-ant/fsharp/src/fsharp-4.5.0/src/fsharp/FSharp.Core/FSharp.Core.fsproj]
  340.  
  341. /var/tmp/pamac-build-ant/fsharp/src/fsharp-4.5.0/src/fsharp/FSharp.Core/seq.fs(1461,25): error FS0072: Lookup on object of indeterminate type based on information prior to this program point. A type annotation may be needed prior to this program point to constrain the type of the object. This may allow the lookup to be resolved. [/var/tmp/pamac-build-ant/fsharp/src/fsharp-4.5.0/src/fsharp/FSharp.Core/FSharp.Core.fsproj]
  342.  
  343. /var/tmp/pamac-build-ant/fsharp/src/fsharp-4.5.0/src/fsharp/FSharp.Core/seq.fs(1464,29): error FS0072: Lookup on object of indeterminate type based on information prior to this program point. A type annotation may be needed prior to this program point to constrain the type of the object. This may allow the lookup to be resolved. [/var/tmp/pamac-build-ant/fsharp/src/fsharp-4.5.0/src/fsharp/FSharp.Core/FSharp.Core.fsproj]
  344.  
  345. /var/tmp/pamac-build-ant/fsharp/src/fsharp-4.5.0/src/fsharp/FSharp.Core/list.fs(427,30): error FS0039: The value or constructor 'HashSet' is not defined. Maybe you want one of the following:   hash   HashIdentity [/var/tmp/pamac-build-ant/fsharp/src/fsharp-4.5.0/src/fsharp/FSharp.Core/FSharp.Core.fsproj]
  346.  
  347. /var/tmp/pamac-build-ant/fsharp/src/fsharp-4.5.0/src/fsharp/FSharp.Core/list.fs(428,32): error FS0072: Lookup on object of indeterminate type based on information prior to this program point. A type annotation may be needed prior to this program point to constrain the type of the object. This may allow the lookup to be resolved. [/var/tmp/pamac-build-ant/fsharp/src/fsharp-4.5.0/src/fsharp/FSharp.Core/FSharp.Core.fsproj]
  348.   Exiting - too many errors
  349. Done Building Project "/var/tmp/pamac-build-ant/fsharp/src/fsharp-4.5.0/src/fsharp/FSharp.Core/FSharp.Core.fsproj" (default targets) -- FAILED.
  350. Done Building Project "/var/tmp/pamac-build-ant/fsharp/src/fsharp-4.5.0/src/fsharp/FSharp.Build-proto/FSharp.Build-proto.fsproj" (default targets) -- FAILED.
  351.  
  352. Build FAILED.
  353.  
  354. "/var/tmp/pamac-build-ant/fsharp/src/fsharp-4.5.0/src/fsharp/FSharp.Build-proto/FSharp.Build-proto.fsproj" (default target) (1) ->
  355. "/var/tmp/pamac-build-ant/fsharp/src/fsharp-4.5.0/src/fsharp/FSharp.Core/FSharp.Core.fsproj" (default target) (2:2) ->
  356. (ResolveAssemblyReferences target) ->
  357.   /usr/lib/mono/msbuild/15.0/bin/Microsoft.Common.CurrentVersion.targets(2130,5): warning MSB3246: Resolved file has a bad image, no metadata, or is otherwise inaccessible. Could not load file or assembly 'System.Reflection.Metadata, Version=1.4.3.0, Culture=neutral, PublicKeyToken=b03f5f7f11d50a3a' or one of its dependencies. [/var/tmp/pamac-build-ant/fsharp/src/fsharp-4.5.0/src/fsharp/FSharp.Core/FSharp.Core.fsproj]
  358.   /usr/lib/mono/msbuild/15.0/bin/Microsoft.Common.CurrentVersion.targets(2130,5): warning MSB3246: Resolved file has a bad image, no metadata, or is otherwise inaccessible. Could not load file or assembly 'System.Reflection.Metadata, Version=1.4.3.0, Culture=neutral, PublicKeyToken=b03f5f7f11d50a3a' or one of its dependencies. [/var/tmp/pamac-build-ant/fsharp/src/fsharp-4.5.0/src/fsharp/FSharp.Core/FSharp.Core.fsproj]
  359.   /usr/lib/mono/msbuild/15.0/bin/Microsoft.Common.CurrentVersion.targets(2130,5): warning MSB3246: Resolved file has a bad image, no metadata, or is otherwise inaccessible. Could not load file or assembly 'System.Reflection.Metadata, Version=1.4.3.0, Culture=neutral, PublicKeyToken=b03f5f7f11d50a3a' or one of its dependencies. [/var/tmp/pamac-build-ant/fsharp/src/fsharp-4.5.0/src/fsharp/FSharp.Core/FSharp.Core.fsproj]
  360.   /usr/lib/mono/msbuild/15.0/bin/Microsoft.Common.CurrentVersion.targets(2130,5): warning MSB3246: Resolved file has a bad image, no metadata, or is otherwise inaccessible. Could not load file or assembly 'System.Reflection.Metadata, Version=1.4.3.0, Culture=neutral, PublicKeyToken=b03f5f7f11d50a3a' or one of its dependencies. [/var/tmp/pamac-build-ant/fsharp/src/fsharp-4.5.0/src/fsharp/FSharp.Core/FSharp.Core.fsproj]
  361.  
  362.  
  363. "/var/tmp/pamac-build-ant/fsharp/src/fsharp-4.5.0/src/fsharp/FSharp.Build-proto/FSharp.Build-proto.fsproj" (default target) (1) ->
  364. "/var/tmp/pamac-build-ant/fsharp/src/fsharp-4.5.0/src/fsharp/FSharp.Core/FSharp.Core.fsproj" (default target) (2:2) ->
  365. (CoreCompile target) ->
  366.   /var/tmp/pamac-build-ant/fsharp/src/fsharp-4.5.0/src/fsharp/FSharp.Core/local.fs(98,51): error FS0039: The type 'HashSet' is not defined. [/var/tmp/pamac-build-ant/fsharp/src/fsharp-4.5.0/src/fsharp/FSharp.Core/FSharp.Core.fsproj]
  367.   /var/tmp/pamac-build-ant/fsharp/src/fsharp-4.5.0/src/fsharp/FSharp.Core/local.fs(98,51): error FS0039: The type 'HashSet' is not defined. [/var/tmp/pamac-build-ant/fsharp/src/fsharp-4.5.0/src/fsharp/FSharp.Core/FSharp.Core.fsproj]
  368.   /var/tmp/pamac-build-ant/fsharp/src/fsharp-4.5.0/src/fsharp/FSharp.Core/local.fs(102,16): error FS0072: Lookup on object of indeterminate type based on information prior to this program point. A type annotation may be needed prior to this program point to constrain the type of the object. This may allow the lookup to be resolved. [/var/tmp/pamac-build-ant/fsharp/src/fsharp-4.5.0/src/fsharp/FSharp.Core/FSharp.Core.fsproj]
  369.   /var/tmp/pamac-build-ant/fsharp/src/fsharp-4.5.0/src/fsharp/FSharp.Core/local.fs(114,27): error FS0039: The value or constructor 'HashSet' is not defined. Maybe you want one of the following:   hash [/var/tmp/pamac-build-ant/fsharp/src/fsharp-4.5.0/src/fsharp/FSharp.Core/FSharp.Core.fsproj]
  370.   /var/tmp/pamac-build-ant/fsharp/src/fsharp-4.5.0/src/fsharp/FSharp.Core/local.fs(115,13): error FS0072: Lookup on object of indeterminate type based on information prior to this program point. A type annotation may be needed prior to this program point to constrain the type of the object. This may allow the lookup to be resolved. [/var/tmp/pamac-build-ant/fsharp/src/fsharp-4.5.0/src/fsharp/FSharp.Core/FSharp.Core.fsproj]
  371.   /var/tmp/pamac-build-ant/fsharp/src/fsharp-4.5.0/src/fsharp/FSharp.Core/local.fs(120,53): error FS0039: The type 'HashSet' is not defined. [/var/tmp/pamac-build-ant/fsharp/src/fsharp-4.5.0/src/fsharp/FSharp.Core/FSharp.Core.fsproj]
  372.   /var/tmp/pamac-build-ant/fsharp/src/fsharp-4.5.0/src/fsharp/FSharp.Core/local.fs(120,53): error FS0039: The type 'HashSet' is not defined. [/var/tmp/pamac-build-ant/fsharp/src/fsharp-4.5.0/src/fsharp/FSharp.Core/FSharp.Core.fsproj]
  373.   /var/tmp/pamac-build-ant/fsharp/src/fsharp-4.5.0/src/fsharp/FSharp.Core/local.fs(124,16): error FS0072: Lookup on object of indeterminate type based on information prior to this program point. A type annotation may be needed prior to this program point to constrain the type of the object. This may allow the lookup to be resolved. [/var/tmp/pamac-build-ant/fsharp/src/fsharp-4.5.0/src/fsharp/FSharp.Core/FSharp.Core.fsproj]
  374.   /var/tmp/pamac-build-ant/fsharp/src/fsharp-4.5.0/src/fsharp/FSharp.Core/local.fs(136,27): error FS0039: The value or constructor 'HashSet' is not defined. Maybe you want one of the following:   hash [/var/tmp/pamac-build-ant/fsharp/src/fsharp-4.5.0/src/fsharp/FSharp.Core/FSharp.Core.fsproj]
  375.   /var/tmp/pamac-build-ant/fsharp/src/fsharp-4.5.0/src/fsharp/FSharp.Core/local.fs(137,13): error FS0072: Lookup on object of indeterminate type based on information prior to this program point. A type annotation may be needed prior to this program point to constrain the type of the object. This may allow the lookup to be resolved. [/var/tmp/pamac-build-ant/fsharp/src/fsharp-4.5.0/src/fsharp/FSharp.Core/FSharp.Core.fsproj]
  376.   /var/tmp/pamac-build-ant/fsharp/src/fsharp-4.5.0/src/fsharp/FSharp.Core/seq.fs(758,20): error FS0039: The value, constructor, namespace or type 'Linq' is not defined. [/var/tmp/pamac-build-ant/fsharp/src/fsharp-4.5.0/src/fsharp/FSharp.Core/FSharp.Core.fsproj]
  377.   /var/tmp/pamac-build-ant/fsharp/src/fsharp-4.5.0/src/fsharp/FSharp.Core/seq.fs(1091,33): error FS0039: The value or constructor 'HashSet' is not defined. Maybe you want one of the following:   hash   Hashtable   HashIdentity   HashCode [/var/tmp/pamac-build-ant/fsharp/src/fsharp-4.5.0/src/fsharp/FSharp.Core/FSharp.Core.fsproj]
  378.   /var/tmp/pamac-build-ant/fsharp/src/fsharp-4.5.0/src/fsharp/FSharp.Core/seq.fs(1093,26): error FS0072: Lookup on object of indeterminate type based on information prior to this program point. A type annotation may be needed prior to this program point to constrain the type of the object. This may allow the lookup to be resolved. [/var/tmp/pamac-build-ant/fsharp/src/fsharp-4.5.0/src/fsharp/FSharp.Core/FSharp.Core.fsproj]
  379.   /var/tmp/pamac-build-ant/fsharp/src/fsharp-4.5.0/src/fsharp/FSharp.Core/seq.fs(1100,33): error FS0039: The value or constructor 'HashSet' is not defined. Maybe you want one of the following:   hash   Hashtable   HashIdentity   HashCode [/var/tmp/pamac-build-ant/fsharp/src/fsharp-4.5.0/src/fsharp/FSharp.Core/FSharp.Core.fsproj]
  380.   /var/tmp/pamac-build-ant/fsharp/src/fsharp-4.5.0/src/fsharp/FSharp.Core/seq.fs(1102,24): error FS0072: Lookup on object of indeterminate type based on information prior to this program point. A type annotation may be needed prior to this program point to constrain the type of the object. This may allow the lookup to be resolved. [/var/tmp/pamac-build-ant/fsharp/src/fsharp-4.5.0/src/fsharp/FSharp.Core/FSharp.Core.fsproj]
  381.   /var/tmp/pamac-build-ant/fsharp/src/fsharp-4.5.0/src/fsharp/FSharp.Core/seq.fs(1459,34): error FS0039: The value or constructor 'HashSet' is not defined. Maybe you want one of the following:   hash   Hashtable   HashIdentity   HashCode [/var/tmp/pamac-build-ant/fsharp/src/fsharp-4.5.0/src/fsharp/FSharp.Core/FSharp.Core.fsproj]
  382.   /var/tmp/pamac-build-ant/fsharp/src/fsharp-4.5.0/src/fsharp/FSharp.Core/seq.fs(1461,25): error FS0072: Lookup on object of indeterminate type based on information prior to this program point. A type annotation may be needed prior to this program point to constrain the type of the object. This may allow the lookup to be resolved. [/var/tmp/pamac-build-ant/fsharp/src/fsharp-4.5.0/src/fsharp/FSharp.Core/FSharp.Core.fsproj]
  383.   /var/tmp/pamac-build-ant/fsharp/src/fsharp-4.5.0/src/fsharp/FSharp.Core/seq.fs(1464,29): error FS0072: Lookup on object of indeterminate type based on information prior to this program point. A type annotation may be needed prior to this program point to constrain the type of the object. This may allow the lookup to be resolved. [/var/tmp/pamac-build-ant/fsharp/src/fsharp-4.5.0/src/fsharp/FSharp.Core/FSharp.Core.fsproj]
  384.   /var/tmp/pamac-build-ant/fsharp/src/fsharp-4.5.0/src/fsharp/FSharp.Core/list.fs(427,30): error FS0039: The value or constructor 'HashSet' is not defined. Maybe you want one of the following:   hash   HashIdentity [/var/tmp/pamac-build-ant/fsharp/src/fsharp-4.5.0/src/fsharp/FSharp.Core/FSharp.Core.fsproj]
  385.   /var/tmp/pamac-build-ant/fsharp/src/fsharp-4.5.0/src/fsharp/FSharp.Core/list.fs(428,32): error FS0072: Lookup on object of indeterminate type based on information prior to this program point. A type annotation may be needed prior to this program point to constrain the type of the object. This may allow the lookup to be resolved. [/var/tmp/pamac-build-ant/fsharp/src/fsharp-4.5.0/src/fsharp/FSharp.Core/FSharp.Core.fsproj]
  386.  
  387.     4 Warning(s)
  388.     20 Error(s)
  389.  
  390. Time Elapsed 00:00:13.06
  391. make[1]: *** [Makefile:28: build-proto] Error 1
  392. make[1]: Leaving directory '/var/tmp/pamac-build-ant/fsharp/src/fsharp-4.5.0'
  393. make: *** [Makefile:24: all] Error 2
  394. ==> ERROR: A failure occurred in build().
  395.     Aborting...
RAW Paste Data
We use cookies for various purposes including analytics. By continuing to use Pastebin, you agree to our use of cookies as described in the Cookies Policy. OK, I Understand
Top