Advertisement
Guest User

Untitled

a guest
Dec 15th, 2021
33
Never
Not a member of Pastebin yet? Sign Up, it unlocks many cool features!
  1. ~ $ pip install matplotlib Collecting matplotlib Using cached matplotlib-3.5.1.tar.gz (35.3 MB)
  2. Preparing metadata (setup.py) ... done Requirement already satisfied: cycler>=0.10 in /data/data/com.termux/files/usr/lib/python3.10/site-packages (from matplotlib) (0.11.0) Requirement already satisfied: fonttools>=4.22.0 in /data/data/com.termux/files/usr/lib/python3.10/site-packages (from matplotlib) (4.28.3) Requirement already satisfied: kiwisolver>=1.0.1 in /data/data/com.termux/files/usr/lib/python3.10/site-packages (from matplotlib) (1.3.2) Requirement already satisfied: numpy>=1.17 in /data/data/com.termux/files/usr/lib/python3.10/site-packages (from matplotlib) (1.21.4) Requirement already satisfied: packaging>=20.0 in /data/data/com.termux/files/usr/lib/python3.10/site-packages (from matplotlib) (21.3) Requirement already satisfied: pillow>=6.2.0 in /data/data/com.termux/files/usr/lib/python3.10/site-packages (from matplotlib) (8.4.0) Requirement already satisfied: pyparsing>=2.2.1 in /data/data/com.termux/files/usr/lib/python3.10/site-packages (from matplotlib) (2.4.7) Requirement already satisfied: python-dateutil>=2.7 in /data/data/com.termux/files/usr/lib/python3.10/site-packages (from matplotlib) (2.8.2) Requirement already satisfied: six>=1.5 in /data/data/com.termux/files/usr/lib/python3.10/site-packages (from python-dateutil>=2.7->matplotlib) (1.16.0)Building wheels for collected packages: matplotlib Building wheel for matplotlib (setup.py) ... error ERROR: Command errored out with exit status 1:
  3. command: /data/data/com.termux/files/usr/bin/python3 -u -c 'import io, os, sys, setuptools, tokenize; sys.argv[0] = '"'"'/data/data/com.termux/files/usr/tmp/pip-install-v9vamfce/matplotlib_00978329e7354e43b59ba28bb85d8ec3/setup.py'"'"'; __file__='"'"'/data/data/com.termux/files/usr/tmp/pip-install-v9vamfce/matplotlib_00978329e7354e43b59ba28bb85d8ec3/setup.py'"'"';f = getattr(tokenize, '"'"'open'"'"', open)(__file__) if os.path.exists(__file__) else io.StringIO('"'"'from setuptools import setup; setup()'"'"');code = f.read().replace('"'"'\r\n'"'"', '"'"'\n'"'"');f.close();exec(compile(code, __file__, '"'"'exec'"'"'))' bdist_wheel -d /data/data/com.termux/files/usr/tmp/pip-wheel-2ew80enn cwd: /data/data/com.termux/files/usr/tmp/pip-install-v9vamfce/matplotlib_00978329e7354e43b59ba28bb85d8ec3/ Complete output (658 lines):
  4. Edit mplsetup.cfg to change the build options; suppress output with --quiet.
  5.  
  6. BUILDING MATPLOTLIB
  7. python: yes [3.10.1 (main, Dec 9 2021, 15:28:13) [Clang 12.0.8
  8. (https://android.googlesource.com/toolchain/llvm-project
  9. c935d99d7]
  10. platform: yes [linux]
  11. tests: no [skipping due to configuration]
  12. macosx: no [Mac OS-X only]
  13.  
  14. running bdist_wheel
  15. running build
  16. running build_py
  17. creating build
  18. creating build/lib.linux-aarch64-3.10
  19. copying lib/pylab.py -> build/lib.linux-aarch64-3.10
  20. creating build/lib.linux-aarch64-3.10/matplotlib
  21. copying lib/matplotlib/__init__.py -> build/lib.linux-aarch64-3.10/matplotlib
  22. copying lib/matplotlib/_animation_data.py -> build/lib.linux-aarch64-3.10/matplotlib
  23. copying lib/matplotlib/_blocking_input.py -> build/lib.linux-aarch64-3.10/matplotlib
  24. copying lib/matplotlib/_cm.py -> build/lib.linux-aarch64-3.10/matplotlib
  25. copying lib/matplotlib/_cm_listed.py -> build/lib.linux-aarch64-3.10/matplotlib
  26. copying lib/matplotlib/_color_data.py -> build/lib.linux-aarch64-3.10/matplotlib
  27. copying lib/matplotlib/_constrained_layout.py -> build/lib.linux-aarch64-3.10/matplotlib
  28. copying lib/matplotlib/_enums.py -> build/lib.linux-aarch64-3.10/matplotlib
  29. copying lib/matplotlib/_internal_utils.py -> build/lib.linux-aarch64-3.10/matplotlib
  30. copying lib/matplotlib/_layoutgrid.py -> build/lib.linux-aarch64-3.10/matplotlib
  31. copying lib/matplotlib/_mathtext.py -> build/lib.linux-aarch64-3.10/matplotlib
  32. copying lib/matplotlib/_mathtext_data.py -> build/lib.linux-aarch64-3.10/matplotlib
  33. copying lib/matplotlib/_pylab_helpers.py -> build/lib.linux-aarch64-3.10/matplotlib
  34. copying lib/matplotlib/_text_helpers.py -> build/lib.linux-aarch64-3.10/matplotlib
  35. copying lib/matplotlib/_version.py -> build/lib.linux-aarch64-3.10/matplotlib
  36. copying lib/matplotlib/afm.py -> build/lib.linux-aarch64-3.10/matplotlib
  37. copying lib/matplotlib/animation.py -> build/lib.linux-aarch64-3.10/matplotlib
  38. copying lib/matplotlib/artist.py -> build/lib.linux-aarch64-3.10/matplotlib
  39. copying lib/matplotlib/axis.py -> build/lib.linux-aarch64-3.10/matplotlib
  40. copying lib/matplotlib/backend_bases.py -> build/lib.linux-aarch64-3.10/matplotlib
  41. copying lib/matplotlib/backend_managers.py -> build/lib.linux-aarch64-3.10/matplotlib
  42. copying lib/matplotlib/backend_tools.py -> build/lib.linux-aarch64-3.10/matplotlib
  43. copying lib/matplotlib/bezier.py -> build/lib.linux-aarch64-3.10/matplotlib
  44. copying lib/matplotlib/blocking_input.py -> build/lib.linux-aarch64-3.10/matplotlib
  45. copying lib/matplotlib/category.py -> build/lib.linux-aarch64-3.10/matplotlib
  46. copying lib/matplotlib/cm.py -> build/lib.linux-aarch64-3.10/matplotlib
  47. copying lib/matplotlib/collections.py -> build/lib.linux-aarch64-3.10/matplotlib
  48. copying lib/matplotlib/colorbar.py -> build/lib.linux-aarch64-3.10/matplotlib
  49. copying lib/matplotlib/colors.py -> build/lib.linux-aarch64-3.10/matplotlib
  50. copying lib/matplotlib/container.py -> build/lib.linux-aarch64-3.10/matplotlib
  51. copying lib/matplotlib/contour.py -> build/lib.linux-aarch64-3.10/matplotlib
  52. copying lib/matplotlib/dates.py -> build/lib.linux-aarch64-3.10/matplotlib
  53. copying lib/matplotlib/docstring.py -> build/lib.linux-aarch64-3.10/matplotlib
  54. copying lib/matplotlib/dviread.py -> build/lib.linux-aarch64-3.10/matplotlib
  55. copying lib/matplotlib/figure.py -> build/lib.linux-aarch64-3.10/matplotlib
  56. copying lib/matplotlib/font_manager.py -> build/lib.linux-aarch64-3.10/matplotlib
  57. copying lib/matplotlib/fontconfig_pattern.py -> build/lib.linux-aarch64-3.10/matplotlib
  58. copying lib/matplotlib/gridspec.py -> build/lib.linux-aarch64-3.10/matplotlib
  59. copying lib/matplotlib/hatch.py -> build/lib.linux-aarch64-3.10/matplotlib
  60. copying lib/matplotlib/image.py -> build/lib.linux-aarch64-3.10/matplotlib
  61. copying lib/matplotlib/legend.py -> build/lib.linux-aarch64-3.10/matplotlib
  62. copying lib/matplotlib/legend_handler.py -> build/lib.linux-aarch64-3.10/matplotlib
  63. copying lib/matplotlib/lines.py -> build/lib.linux-aarch64-3.10/matplotlib
  64. copying lib/matplotlib/markers.py -> build/lib.linux-aarch64-3.10/matplotlib
  65. copying lib/matplotlib/mathtext.py -> build/lib.linux-aarch64-3.10/matplotlib
  66. copying lib/matplotlib/mlab.py -> build/lib.linux-aarch64-3.10/matplotlib
  67. copying lib/matplotlib/offsetbox.py -> build/lib.linux-aarch64-3.10/matplotlib
  68. copying lib/matplotlib/patches.py -> build/lib.linux-aarch64-3.10/matplotlib
  69. copying lib/matplotlib/path.py -> build/lib.linux-aarch64-3.10/matplotlib
  70. copying lib/matplotlib/patheffects.py -> build/lib.linux-aarch64-3.10/matplotlib
  71. copying lib/matplotlib/pylab.py -> build/lib.linux-aarch64-3.10/matplotlib
  72. copying lib/matplotlib/pyplot.py -> build/lib.linux-aarch64-3.10/matplotlib
  73. copying lib/matplotlib/quiver.py -> build/lib.linux-aarch64-3.10/matplotlib
  74. copying lib/matplotlib/rcsetup.py -> build/lib.linux-aarch64-3.10/matplotlib
  75. copying lib/matplotlib/sankey.py -> build/lib.linux-aarch64-3.10/matplotlib
  76. copying lib/matplotlib/scale.py -> build/lib.linux-aarch64-3.10/matplotlib
  77. copying lib/matplotlib/spines.py -> build/lib.linux-aarch64-3.10/matplotlib
  78. copying lib/matplotlib/stackplot.py -> build/lib.linux-aarch64-3.10/matplotlib
  79. copying lib/matplotlib/streamplot.py -> build/lib.linux-aarch64-3.10/matplotlib
  80. copying lib/matplotlib/table.py -> build/lib.linux-aarch64-3.10/matplotlib
  81. copying lib/matplotlib/texmanager.py -> build/lib.linux-aarch64-3.10/matplotlib
  82. copying lib/matplotlib/text.py -> build/lib.linux-aarch64-3.10/matplotlib
  83. copying lib/matplotlib/textpath.py -> build/lib.linux-aarch64-3.10/matplotlib
  84. copying lib/matplotlib/ticker.py -> build/lib.linux-aarch64-3.10/matplotlib
  85. copying lib/matplotlib/tight_bbox.py -> build/lib.linux-aarch64-3.10/matplotlib
  86. copying lib/matplotlib/tight_layout.py -> build/lib.linux-aarch64-3.10/matplotlib
  87. copying lib/matplotlib/transforms.py -> build/lib.linux-aarch64-3.10/matplotlib
  88. copying lib/matplotlib/type1font.py -> build/lib.linux-aarch64-3.10/matplotlib
  89. copying lib/matplotlib/units.py -> build/lib.linux-aarch64-3.10/matplotlib
  90. copying lib/matplotlib/widgets.py -> build/lib.linux-aarch64-3.10/matplotlib
  91. creating build/lib.linux-aarch64-3.10/mpl_toolkits
  92. copying lib/mpl_toolkits/__init__.py -> build/lib.linux-aarch64-3.10/mpl_toolkits
  93. creating build/lib.linux-aarch64-3.10/matplotlib/_api
  94. copying lib/matplotlib/_api/__init__.py -> build/lib.linux-aarch64-3.10/matplotlib/_api
  95. copying lib/matplotlib/_api/deprecation.py -> build/lib.linux-aarch64-3.10/matplotlib/_api
  96. creating build/lib.linux-aarch64-3.10/matplotlib/axes
  97. copying lib/matplotlib/axes/__init__.py -> build/lib.linux-aarch64-3.10/matplotlib/axes
  98. copying lib/matplotlib/axes/_axes.py -> build/lib.linux-aarch64-3.10/matplotlib/axes
  99. copying lib/matplotlib/axes/_base.py -> build/lib.linux-aarch64-3.10/matplotlib/axes
  100. copying lib/matplotlib/axes/_secondary_axes.py -> build/lib.linux-aarch64-3.10/matplotlib/axes
  101. copying lib/matplotlib/axes/_subplots.py -> build/lib.linux-aarch64-3.10/matplotlib/axes
  102. creating build/lib.linux-aarch64-3.10/matplotlib/backends
  103. copying lib/matplotlib/backends/__init__.py -> build/lib.linux-aarch64-3.10/matplotlib/backends
  104. copying lib/matplotlib/backends/_backend_gtk.py -> build/lib.linux-aarch64-3.10/matplotlib/backends
  105. copying lib/matplotlib/backends/_backend_pdf_ps.py -> build/lib.linux-aarch64-3.10/matplotlib/backends
  106. copying lib/matplotlib/backends/_backend_tk.py -> build/lib.linux-aarch64-3.10/matplotlib/backends
  107. copying lib/matplotlib/backends/backend_agg.py -> build/lib.linux-aarch64-3.10/matplotlib/backends
  108. copying lib/matplotlib/backends/backend_cairo.py -> build/lib.linux-aarch64-3.10/matplotlib/backends
  109. copying lib/matplotlib/backends/backend_gtk3.py -> build/lib.linux-aarch64-3.10/matplotlib/backends
  110. copying lib/matplotlib/backends/backend_gtk3agg.py -> build/lib.linux-aarch64-3.10/matplotlib/backends
  111. copying lib/matplotlib/backends/backend_gtk3cairo.py -> build/lib.linux-aarch64-3.10/matplotlib/backends
  112. copying lib/matplotlib/backends/backend_gtk4.py -> build/lib.linux-aarch64-3.10/matplotlib/backends
  113. copying lib/matplotlib/backends/backend_gtk4agg.py -> build/lib.linux-aarch64-3.10/matplotlib/backends
  114. copying lib/matplotlib/backends/backend_gtk4cairo.py -> build/lib.linux-aarch64-3.10/matplotlib/backends
  115. copying lib/matplotlib/backends/backend_macosx.py -> build/lib.linux-aarch64-3.10/matplotlib/backends
  116. copying lib/matplotlib/backends/backend_mixed.py -> build/lib.linux-aarch64-3.10/matplotlib/backends
  117. copying lib/matplotlib/backends/backend_nbagg.py -> build/lib.linux-aarch64-3.10/matplotlib/backends
  118. copying lib/matplotlib/backends/backend_pdf.py -> build/lib.linux-aarch64-3.10/matplotlib/backends
  119. copying lib/matplotlib/backends/backend_pgf.py -> build/lib.linux-aarch64-3.10/matplotlib/backends
  120. copying lib/matplotlib/backends/backend_ps.py -> build/lib.linux-aarch64-3.10/matplotlib/backends
  121. copying lib/matplotlib/backends/backend_qt.py -> build/lib.linux-aarch64-3.10/matplotlib/backends
  122. copying lib/matplotlib/backends/backend_qt5.py -> build/lib.linux-aarch64-3.10/matplotlib/backends
  123. copying lib/matplotlib/backends/backend_qt5agg.py -> build/lib.linux-aarch64-3.10/matplotlib/backends
  124. copying lib/matplotlib/backends/backend_qt5cairo.py -> build/lib.linux-aarch64-3.10/matplotlib/backends
  125. copying lib/matplotlib/backends/backend_qtagg.py -> build/lib.linux-aarch64-3.10/matplotlib/backends
  126. copying lib/matplotlib/backends/backend_qtcairo.py -> build/lib.linux-aarch64-3.10/matplotlib/backends
  127. copying lib/matplotlib/backends/backend_svg.py -> build/lib.linux-aarch64-3.10/matplotlib/backends
  128. copying lib/matplotlib/backends/backend_template.py -> build/lib.linux-aarch64-3.10/matplotlib/backends
  129. copying lib/matplotlib/backends/backend_tkagg.py -> build/lib.linux-aarch64-3.10/matplotlib/backends
  130. copying lib/matplotlib/backends/backend_tkcairo.py -> build/lib.linux-aarch64-3.10/matplotlib/backends
  131. copying lib/matplotlib/backends/backend_webagg.py -> build/lib.linux-aarch64-3.10/matplotlib/backends
  132. copying lib/matplotlib/backends/backend_webagg_core.py -> build/lib.linux-aarch64-3.10/matplotlib/backends
  133. copying lib/matplotlib/backends/backend_wx.py -> build/lib.linux-aarch64-3.10/matplotlib/backends
  134. copying lib/matplotlib/backends/backend_wxagg.py -> build/lib.linux-aarch64-3.10/matplotlib/backends
  135. copying lib/matplotlib/backends/backend_wxcairo.py -> build/lib.linux-aarch64-3.10/matplotlib/backends
  136. copying lib/matplotlib/backends/qt_compat.py -> build/lib.linux-aarch64-3.10/matplotlib/backends
  137. creating build/lib.linux-aarch64-3.10/matplotlib/cbook
  138. copying lib/matplotlib/cbook/__init__.py -> build/lib.linux-aarch64-3.10/matplotlib/cbook
  139. copying lib/matplotlib/cbook/deprecation.py -> build/lib.linux-aarch64-3.10/matplotlib/cbook
  140. creating build/lib.linux-aarch64-3.10/matplotlib/projections
  141. copying lib/matplotlib/projections/__init__.py -> build/lib.linux-aarch64-3.10/matplotlib/projections
  142. copying lib/matplotlib/projections/geo.py -> build/lib.linux-aarch64-3.10/matplotlib/projections
  143. copying lib/matplotlib/projections/polar.py -> build/lib.linux-aarch64-3.10/matplotlib/projections
  144. creating build/lib.linux-aarch64-3.10/matplotlib/sphinxext
  145. copying lib/matplotlib/sphinxext/__init__.py -> build/lib.linux-aarch64-3.10/matplotlib/sphinxext
  146. copying lib/matplotlib/sphinxext/mathmpl.py -> build/lib.linux-aarch64-3.10/matplotlib/sphinxext
  147. copying lib/matplotlib/sphinxext/plot_directive.py -> build/lib.linux-aarch64-3.10/matplotlib/sphinxext
  148. creating build/lib.linux-aarch64-3.10/matplotlib/style
  149. copying lib/matplotlib/style/__init__.py -> build/lib.linux-aarch64-3.10/matplotlib/style
  150. copying lib/matplotlib/style/core.py -> build/lib.linux-aarch64-3.10/matplotlib/style
  151. creating build/lib.linux-aarch64-3.10/matplotlib/testing
  152. copying lib/matplotlib/testing/__init__.py -> build/lib.linux-aarch64-3.10/matplotlib/testing
  153. copying lib/matplotlib/testing/compare.py -> build/lib.linux-aarch64-3.10/matplotlib/testing
  154. copying lib/matplotlib/testing/conftest.py -> build/lib.linux-aarch64-3.10/matplotlib/testing
  155. copying lib/matplotlib/testing/decorators.py -> build/lib.linux-aarch64-3.10/matplotlib/testing
  156. copying lib/matplotlib/testing/exceptions.py -> build/lib.linux-aarch64-3.10/matplotlib/testing
  157. copying lib/matplotlib/testing/widgets.py -> build/lib.linux-aarch64-3.10/matplotlib/testing
  158. creating build/lib.linux-aarch64-3.10/matplotlib/tests
  159. copying lib/matplotlib/tests/__init__.py -> build/lib.linux-aarch64-3.10/matplotlib/tests
  160. copying lib/matplotlib/tests/conftest.py -> build/lib.linux-aarch64-3.10/matplotlib/tests
  161. copying lib/matplotlib/tests/test_afm.py -> build/lib.linux-aarch64-3.10/matplotlib/tests
  162. copying lib/matplotlib/tests/test_agg.py -> build/lib.linux-aarch64-3.10/matplotlib/tests
  163. copying lib/matplotlib/tests/test_agg_filter.py -> build/lib.linux-aarch64-3.10/matplotlib/tests
  164. copying lib/matplotlib/tests/test_animation.py -> build/lib.linux-aarch64-3.10/matplotlib/tests
  165. copying lib/matplotlib/tests/test_api.py -> build/lib.linux-aarch64-3.10/matplotlib/tests
  166. copying lib/matplotlib/tests/test_arrow_patches.py -> build/lib.linux-aarch64-3.10/matplotlib/tests
  167. copying lib/matplotlib/tests/test_artist.py -> build/lib.linux-aarch64-3.10/matplotlib/tests
  168. copying lib/matplotlib/tests/test_axes.py -> build/lib.linux-aarch64-3.10/matplotlib/tests
  169. copying lib/matplotlib/tests/test_backend_bases.py -> build/lib.linux-aarch64-3.10/matplotlib/tests
  170. copying lib/matplotlib/tests/test_backend_cairo.py -> build/lib.linux-aarch64-3.10/matplotlib/tests
  171. copying lib/matplotlib/tests/test_backend_gtk3.py -> build/lib.linux-aarch64-3.10/matplotlib/tests
  172. copying lib/matplotlib/tests/test_backend_macosx.py -> build/lib.linux-aarch64-3.10/matplotlib/tests
  173. copying lib/matplotlib/tests/test_backend_nbagg.py -> build/lib.linux-aarch64-3.10/matplotlib/tests
  174. copying lib/matplotlib/tests/test_backend_pdf.py -> build/lib.linux-aarch64-3.10/matplotlib/tests
  175. copying lib/matplotlib/tests/test_backend_pgf.py -> build/lib.linux-aarch64-3.10/matplotlib/tests
  176. copying lib/matplotlib/tests/test_backend_ps.py -> build/lib.linux-aarch64-3.10/matplotlib/tests
  177. copying lib/matplotlib/tests/test_backend_qt.py -> build/lib.linux-aarch64-3.10/matplotlib/tests
  178. copying lib/matplotlib/tests/test_backend_svg.py -> build/lib.linux-aarch64-3.10/matplotlib/tests
  179. copying lib/matplotlib/tests/test_backend_tk.py -> build/lib.linux-aarch64-3.10/matplotlib/tests
  180. copying lib/matplotlib/tests/test_backend_tools.py -> build/lib.linux-aarch64-3.10/matplotlib/tests
  181. copying lib/matplotlib/tests/test_backend_webagg.py -> build/lib.linux-aarch64-3.10/matplotlib/tests
  182. copying lib/matplotlib/tests/test_backends_interactive.py -> build/lib.linux-aarch64-3.10/matplotlib/tests
  183. copying lib/matplotlib/tests/test_basic.py -> build/lib.linux-aarch64-3.10/matplotlib/tests
  184. copying lib/matplotlib/tests/test_bbox_tight.py -> build/lib.linux-aarch64-3.10/matplotlib/tests
  185. copying lib/matplotlib/tests/test_category.py -> build/lib.linux-aarch64-3.10/matplotlib/tests
  186. copying lib/matplotlib/tests/test_cbook.py -> build/lib.linux-aarch64-3.10/matplotlib/tests
  187. copying lib/matplotlib/tests/test_collections.py -> build/lib.linux-aarch64-3.10/matplotlib/tests
  188. copying lib/matplotlib/tests/test_colorbar.py -> build/lib.linux-aarch64-3.10/matplotlib/tests
  189. copying lib/matplotlib/tests/test_colors.py -> build/lib.linux-aarch64-3.10/matplotlib/tests
  190. copying lib/matplotlib/tests/test_compare_images.py -> build/lib.linux-aarch64-3.10/matplotlib/tests
  191. copying lib/matplotlib/tests/test_constrainedlayout.py -> build/lib.linux-aarch64-3.10/matplotlib/tests
  192. copying lib/matplotlib/tests/test_container.py -> build/lib.linux-aarch64-3.10/matplotlib/tests
  193. copying lib/matplotlib/tests/test_contour.py -> build/lib.linux-aarch64-3.10/matplotlib/tests
  194. copying lib/matplotlib/tests/test_cycles.py -> build/lib.linux-aarch64-3.10/matplotlib/tests
  195. copying lib/matplotlib/tests/test_dates.py -> build/lib.linux-aarch64-3.10/matplotlib/tests
  196. copying lib/matplotlib/tests/test_determinism.py -> build/lib.linux-aarch64-3.10/matplotlib/tests
  197. copying lib/matplotlib/tests/test_dviread.py -> build/lib.linux-aarch64-3.10/matplotlib/tests
  198. copying lib/matplotlib/tests/test_figure.py -> build/lib.linux-aarch64-3.10/matplotlib/tests
  199. copying lib/matplotlib/tests/test_font_manager.py -> build/lib.linux-aarch64-3.10/matplotlib/tests
  200. copying lib/matplotlib/tests/test_fontconfig_pattern.py -> build/lib.linux-aarch64-3.10/matplotlib/tests
  201. copying lib/matplotlib/tests/test_getattr.py -> build/lib.linux-aarch64-3.10/matplotlib/tests
  202. copying lib/matplotlib/tests/test_gridspec.py -> build/lib.linux-aarch64-3.10/matplotlib/tests
  203. copying lib/matplotlib/tests/test_image.py -> build/lib.linux-aarch64-3.10/matplotlib/tests
  204. copying lib/matplotlib/tests/test_legend.py -> build/lib.linux-aarch64-3.10/matplotlib/tests
  205. copying lib/matplotlib/tests/test_lines.py -> build/lib.linux-aarch64-3.10/matplotlib/tests
  206. copying lib/matplotlib/tests/test_marker.py -> build/lib.linux-aarch64-3.10/matplotlib/tests
  207. copying lib/matplotlib/tests/test_mathtext.py -> build/lib.linux-aarch64-3.10/matplotlib/tests
  208. copying lib/matplotlib/tests/test_matplotlib.py -> build/lib.linux-aarch64-3.10/matplotlib/tests
  209. copying lib/matplotlib/tests/test_mlab.py -> build/lib.linux-aarch64-3.10/matplotlib/tests
  210. copying lib/matplotlib/tests/test_offsetbox.py -> build/lib.linux-aarch64-3.10/matplotlib/tests
  211. copying lib/matplotlib/tests/test_patches.py -> build/lib.linux-aarch64-3.10/matplotlib/tests
  212. copying lib/matplotlib/tests/test_path.py -> build/lib.linux-aarch64-3.10/matplotlib/tests
  213. copying lib/matplotlib/tests/test_patheffects.py -> build/lib.linux-aarch64-3.10/matplotlib/tests
  214. copying lib/matplotlib/tests/test_pickle.py -> build/lib.linux-aarch64-3.10/matplotlib/tests
  215. copying lib/matplotlib/tests/test_png.py -> build/lib.linux-aarch64-3.10/matplotlib/tests
  216. copying lib/matplotlib/tests/test_polar.py -> build/lib.linux-aarch64-3.10/matplotlib/tests
  217. copying lib/matplotlib/tests/test_preprocess_data.py -> build/lib.linux-aarch64-3.10/matplotlib/tests
  218. copying lib/matplotlib/tests/test_pyplot.py -> build/lib.linux-aarch64-3.10/matplotlib/tests
  219. copying lib/matplotlib/tests/test_quiver.py -> build/lib.linux-aarch64-3.10/matplotlib/tests
  220. copying lib/matplotlib/tests/test_rcparams.py -> build/lib.linux-aarch64-3.10/matplotlib/tests
  221. copying lib/matplotlib/tests/test_sankey.py -> build/lib.linux-aarch64-3.10/matplotlib/tests
  222. copying lib/matplotlib/tests/test_scale.py -> build/lib.linux-aarch64-3.10/matplotlib/tests
  223. copying lib/matplotlib/tests/test_simplification.py -> build/lib.linux-aarch64-3.10/matplotlib/tests
  224. copying lib/matplotlib/tests/test_skew.py -> build/lib.linux-aarch64-3.10/matplotlib/tests
  225. copying lib/matplotlib/tests/test_sphinxext.py -> build/lib.linux-aarch64-3.10/matplotlib/tests
  226. copying lib/matplotlib/tests/test_spines.py -> build/lib.linux-aarch64-3.10/matplotlib/tests
  227. copying lib/matplotlib/tests/test_streamplot.py -> build/lib.linux-aarch64-3.10/matplotlib/tests
  228. copying lib/matplotlib/tests/test_style.py -> build/lib.linux-aarch64-3.10/matplotlib/tests
  229. copying lib/matplotlib/tests/test_subplots.py -> build/lib.linux-aarch64-3.10/matplotlib/tests
  230. copying lib/matplotlib/tests/test_table.py -> build/lib.linux-aarch64-3.10/matplotlib/tests
  231. copying lib/matplotlib/tests/test_testing.py -> build/lib.linux-aarch64-3.10/matplotlib/tests
  232. copying lib/matplotlib/tests/test_texmanager.py -> build/lib.linux-aarch64-3.10/matplotlib/tests
  233. copying lib/matplotlib/tests/test_text.py -> build/lib.linux-aarch64-3.10/matplotlib/tests
  234. copying lib/matplotlib/tests/test_ticker.py -> build/lib.linux-aarch64-3.10/matplotlib/tests
  235. copying lib/matplotlib/tests/test_tightlayout.py -> build/lib.linux-aarch64-3.10/matplotlib/tests
  236. copying lib/matplotlib/tests/test_transforms.py -> build/lib.linux-aarch64-3.10/matplotlib/tests
  237. copying lib/matplotlib/tests/test_triangulation.py -> build/lib.linux-aarch64-3.10/matplotlib/tests
  238. copying lib/matplotlib/tests/test_ttconv.py -> build/lib.linux-aarch64-3.10/matplotlib/tests
  239. copying lib/matplotlib/tests/test_type1font.py -> build/lib.linux-aarch64-3.10/matplotlib/tests
  240. copying lib/matplotlib/tests/test_units.py -> build/lib.linux-aarch64-3.10/matplotlib/tests
  241. copying lib/matplotlib/tests/test_usetex.py -> build/lib.linux-aarch64-3.10/matplotlib/tests
  242. copying lib/matplotlib/tests/test_widgets.py -> build/lib.linux-aarch64-3.10/matplotlib/tests
  243. creating build/lib.linux-aarch64-3.10/matplotlib/tri
  244. copying lib/matplotlib/tri/__init__.py -> build/lib.linux-aarch64-3.10/matplotlib/tri
  245. copying lib/matplotlib/tri/triangulation.py -> build/lib.linux-aarch64-3.10/matplotlib/tri
  246. copying lib/matplotlib/tri/tricontour.py -> build/lib.linux-aarch64-3.10/matplotlib/tri
  247. copying lib/matplotlib/tri/trifinder.py -> build/lib.linux-aarch64-3.10/matplotlib/tri
  248. copying lib/matplotlib/tri/triinterpolate.py -> build/lib.linux-aarch64-3.10/matplotlib/tri
  249. copying lib/matplotlib/tri/tripcolor.py -> build/lib.linux-aarch64-3.10/matplotlib/tri
  250. copying lib/matplotlib/tri/triplot.py -> build/lib.linux-aarch64-3.10/matplotlib/tri
  251. copying lib/matplotlib/tri/trirefine.py -> build/lib.linux-aarch64-3.10/matplotlib/tri
  252. copying lib/matplotlib/tri/tritools.py -> build/lib.linux-aarch64-3.10/matplotlib/tri
  253. creating build/lib.linux-aarch64-3.10/matplotlib/backends/qt_editor
  254. copying lib/matplotlib/backends/qt_editor/__init__.py -> build/lib.linux-aarch64-3.10/matplotlib/backends/qt_editor
  255. copying lib/matplotlib/backends/qt_editor/_formlayout.py -> build/lib.linux-aarch64-3.10/matplotlib/backends/qt_editor
  256. copying lib/matplotlib/backends/qt_editor/figureoptions.py -> build/lib.linux-aarch64-3.10/matplotlib/backends/qt_editor
  257. creating build/lib.linux-aarch64-3.10/matplotlib/testing/jpl_units
  258. copying lib/matplotlib/testing/jpl_units/Duration.py -> build/lib.linux-aarch64-3.10/matplotlib/testing/jpl_units
  259. copying lib/matplotlib/testing/jpl_units/Epoch.py -> build/lib.linux-aarch64-3.10/matplotlib/testing/jpl_units
  260. copying lib/matplotlib/testing/jpl_units/EpochConverter.py -> build/lib.linux-aarch64-3.10/matplotlib/testing/jpl_units
  261. copying lib/matplotlib/testing/jpl_units/StrConverter.py -> build/lib.linux-aarch64-3.10/matplotlib/testing/jpl_units
  262. copying lib/matplotlib/testing/jpl_units/UnitDbl.py -> build/lib.linux-aarch64-3.10/matplotlib/testing/jpl_units
  263. copying lib/matplotlib/testing/jpl_units/UnitDblConverter.py -> build/lib.linux-aarch64-3.10/matplotlib/testing/jpl_units
  264. copying lib/matplotlib/testing/jpl_units/UnitDblFormatter.py -> build/lib.linux-aarch64-3.10/matplotlib/testing/jpl_units
  265. copying lib/matplotlib/testing/jpl_units/__init__.py -> build/lib.linux-aarch64-3.10/matplotlib/testing/jpl_units
  266. creating build/lib.linux-aarch64-3.10/mpl_toolkits/axes_grid
  267. copying lib/mpl_toolkits/axes_grid/__init__.py -> build/lib.linux-aarch64-3.10/mpl_toolkits/axes_grid
  268. copying lib/mpl_toolkits/axes_grid/anchored_artists.py -> build/lib.linux-aarch64-3.10/mpl_toolkits/axes_grid
  269. copying lib/mpl_toolkits/axes_grid/angle_helper.py -> build/lib.linux-aarch64-3.10/mpl_toolkits/axes_grid
  270. copying lib/mpl_toolkits/axes_grid/axes_divider.py -> build/lib.linux-aarch64-3.10/mpl_toolkits/axes_grid
  271. copying lib/mpl_toolkits/axes_grid/axes_grid.py -> build/lib.linux-aarch64-3.10/mpl_toolkits/axes_grid
  272. copying lib/mpl_toolkits/axes_grid/axes_rgb.py -> build/lib.linux-aarch64-3.10/mpl_toolkits/axes_grid
  273. copying lib/mpl_toolkits/axes_grid/axes_size.py -> build/lib.linux-aarch64-3.10/mpl_toolkits/axes_grid
  274. copying lib/mpl_toolkits/axes_grid/axis_artist.py -> build/lib.linux-aarch64-3.10/mpl_toolkits/axes_grid
  275. copying lib/mpl_toolkits/axes_grid/axisline_style.py -> build/lib.linux-aarch64-3.10/mpl_toolkits/axes_grid
  276. copying lib/mpl_toolkits/axes_grid/axislines.py -> build/lib.linux-aarch64-3.10/mpl_toolkits/axes_grid
  277. copying lib/mpl_toolkits/axes_grid/clip_path.py -> build/lib.linux-aarch64-3.10/mpl_toolkits/axes_grid
  278. copying lib/mpl_toolkits/axes_grid/floating_axes.py -> build/lib.linux-aarch64-3.10/mpl_toolkits/axes_grid
  279. copying lib/mpl_toolkits/axes_grid/grid_finder.py -> build/lib.linux-aarch64-3.10/mpl_toolkits/axes_grid
  280. copying lib/mpl_toolkits/axes_grid/grid_helper_curvelinear.py -> build/lib.linux-aarch64-3.10/mpl_toolkits/axes_grid
  281. copying lib/mpl_toolkits/axes_grid/inset_locator.py -> build/lib.linux-aarch64-3.10/mpl_toolkits/axes_grid
  282. copying lib/mpl_toolkits/axes_grid/parasite_axes.py -> build/lib.linux-aarch64-3.10/mpl_toolkits/axes_grid
  283. creating build/lib.linux-aarch64-3.10/mpl_toolkits/axes_grid1
  284. copying lib/mpl_toolkits/axes_grid1/__init__.py -> build/lib.linux-aarch64-3.10/mpl_toolkits/axes_grid1
  285. copying lib/mpl_toolkits/axes_grid1/anchored_artists.py -> build/lib.linux-aarch64-3.10/mpl_toolkits/axes_grid1
  286. copying lib/mpl_toolkits/axes_grid1/axes_divider.py -> build/lib.linux-aarch64-3.10/mpl_toolkits/axes_grid1
  287. copying lib/mpl_toolkits/axes_grid1/axes_grid.py -> build/lib.linux-aarch64-3.10/mpl_toolkits/axes_grid1
  288. copying lib/mpl_toolkits/axes_grid1/axes_rgb.py -> build/lib.linux-aarch64-3.10/mpl_toolkits/axes_grid1
  289. copying lib/mpl_toolkits/axes_grid1/axes_size.py -> build/lib.linux-aarch64-3.10/mpl_toolkits/axes_grid1
  290. copying lib/mpl_toolkits/axes_grid1/inset_locator.py -> build/lib.linux-aarch64-3.10/mpl_toolkits/axes_grid1
  291. copying lib/mpl_toolkits/axes_grid1/mpl_axes.py -> build/lib.linux-aarch64-3.10/mpl_toolkits/axes_grid1
  292. copying lib/mpl_toolkits/axes_grid1/parasite_axes.py -> build/lib.linux-aarch64-3.10/mpl_toolkits/axes_grid1
  293. creating build/lib.linux-aarch64-3.10/mpl_toolkits/axisartist
  294. copying lib/mpl_toolkits/axisartist/__init__.py -> build/lib.linux-aarch64-3.10/mpl_toolkits/axisartist
  295. copying lib/mpl_toolkits/axisartist/angle_helper.py -> build/lib.linux-aarch64-3.10/mpl_toolkits/axisartist
  296. copying lib/mpl_toolkits/axisartist/axes_divider.py -> build/lib.linux-aarch64-3.10/mpl_toolkits/axisartist
  297. copying lib/mpl_toolkits/axisartist/axes_grid.py -> build/lib.linux-aarch64-3.10/mpl_toolkits/axisartist
  298. copying lib/mpl_toolkits/axisartist/axes_rgb.py -> build/lib.linux-aarch64-3.10/mpl_toolkits/axisartist
  299. copying lib/mpl_toolkits/axisartist/axis_artist.py -> build/lib.linux-aarch64-3.10/mpl_toolkits/axisartist
  300. copying lib/mpl_toolkits/axisartist/axisline_style.py -> build/lib.linux-aarch64-3.10/mpl_toolkits/axisartist
  301. copying lib/mpl_toolkits/axisartist/axislines.py -> build/lib.linux-aarch64-3.10/mpl_toolkits/axisartist
  302. copying lib/mpl_toolkits/axisartist/clip_path.py -> build/lib.linux-aarch64-3.10/mpl_toolkits/axisartist
  303. copying lib/mpl_toolkits/axisartist/floating_axes.py -> build/lib.linux-aarch64-3.10/mpl_toolkits/axisartist
  304. copying lib/mpl_toolkits/axisartist/grid_finder.py -> build/lib.linux-aarch64-3.10/mpl_toolkits/axisartist
  305. copying lib/mpl_toolkits/axisartist/grid_helper_curvelinear.py -> build/lib.linux-aarch64-3.10/mpl_toolkits/axisartist
  306. copying lib/mpl_toolkits/axisartist/parasite_axes.py -> build/lib.linux-aarch64-3.10/mpl_toolkits/axisartist
  307. creating build/lib.linux-aarch64-3.10/mpl_toolkits/mplot3d
  308. copying lib/mpl_toolkits/mplot3d/__init__.py -> build/lib.linux-aarch64-3.10/mpl_toolkits/mplot3d
  309. copying lib/mpl_toolkits/mplot3d/art3d.py -> build/lib.linux-aarch64-3.10/mpl_toolkits/mplot3d
  310. copying lib/mpl_toolkits/mplot3d/axes3d.py -> build/lib.linux-aarch64-3.10/mpl_toolkits/mplot3d
  311. copying lib/mpl_toolkits/mplot3d/axis3d.py -> build/lib.linux-aarch64-3.10/mpl_toolkits/mplot3d
  312. copying lib/mpl_toolkits/mplot3d/proj3d.py -> build/lib.linux-aarch64-3.10/mpl_toolkits/mplot3d
  313. creating build/lib.linux-aarch64-3.10/mpl_toolkits/tests
  314. copying lib/mpl_toolkits/tests/__init__.py -> build/lib.linux-aarch64-3.10/mpl_toolkits/tests
  315. copying lib/mpl_toolkits/tests/conftest.py -> build/lib.linux-aarch64-3.10/mpl_toolkits/tests
  316. copying lib/mpl_toolkits/tests/test_axes_grid.py -> build/lib.linux-aarch64-3.10/mpl_toolkits/tests
  317. copying lib/mpl_toolkits/tests/test_axes_grid1.py -> build/lib.linux-aarch64-3.10/mpl_toolkits/tests
  318. copying lib/mpl_toolkits/tests/test_axisartist_angle_helper.py -> build/lib.linux-aarch64-3.10/mpl_toolkits/tests
  319. copying lib/mpl_toolkits/tests/test_axisartist_axis_artist.py -> build/lib.linux-aarch64-3.10/mpl_toolkits/tests
  320. copying lib/mpl_toolkits/tests/test_axisartist_axislines.py -> build/lib.linux-aarch64-3.10/mpl_toolkits/tests
  321. copying lib/mpl_toolkits/tests/test_axisartist_clip_path.py -> build/lib.linux-aarch64-3.10/mpl_toolkits/tests
  322. copying lib/mpl_toolkits/tests/test_axisartist_floating_axes.py -> build/lib.linux-aarch64-3.10/mpl_toolkits/tests
  323. copying lib/mpl_toolkits/tests/test_axisartist_grid_finder.py -> build/lib.linux-aarch64-3.10/mpl_toolkits/tests
  324. copying lib/mpl_toolkits/tests/test_axisartist_grid_helper_curvelinear.py -> build/lib.linux-aarch64-3.10/mpl_toolkits/tests
  325. copying lib/mpl_toolkits/tests/test_mplot3d.py -> build/lib.linux-aarch64-3.10/mpl_toolkits/tests
  326. creating build/lib.linux-aarch64-3.10/matplotlib/mpl-data
  327. creating build/lib.linux-aarch64-3.10/matplotlib/mpl-data/stylelib
  328. copying lib/matplotlib/mpl-data/stylelib/seaborn-bright.mplstyle -> build/lib.linux-aarch64-3.10/matplotlib/mpl-data/stylelib
  329. copying lib/matplotlib/mpl-data/stylelib/seaborn-pastel.mplstyle -> build/lib.linux-aarch64-3.10/matplotlib/mpl-data/stylelib
  330. copying lib/matplotlib/mpl-data/stylelib/seaborn-poster.mplstyle -> build/lib.linux-aarch64-3.10/matplotlib/mpl-data/stylelib
  331. creating build/lib.linux-aarch64-3.10/matplotlib/mpl-data/sample_data
  332. copying lib/matplotlib/mpl-data/sample_data/embedding_in_wx3.xrc -> build/lib.linux-aarch64-3.10/matplotlib/mpl-data/sample_data
  333. copying lib/matplotlib/mpl-data/sample_data/membrane.dat -> build/lib.linux-aarch64-3.10/matplotlib/mpl-data/sample_data
  334. creating build/lib.linux-aarch64-3.10/matplotlib/mpl-data/fonts
  335. creating build/lib.linux-aarch64-3.10/matplotlib/mpl-data/fonts/ttf
  336. copying lib/matplotlib/mpl-data/fonts/ttf/DejaVuSerifDisplay.ttf -> build/lib.linux-aarch64-3.10/matplotlib/mpl-data/fonts/ttf
  337. copying lib/matplotlib/mpl-data/fonts/ttf/STIXNonUniBol.ttf -> build/lib.linux-aarch64-3.10/matplotlib/mpl-data/fonts/ttf
  338. copying lib/matplotlib/mpl-data/fonts/ttf/STIXNonUniIta.ttf -> build/lib.linux-aarch64-3.10/matplotlib/mpl-data/fonts/ttf
  339. creating build/lib.linux-aarch64-3.10/matplotlib/mpl-data/images
  340. copying lib/matplotlib/mpl-data/images/filesave.png -> build/lib.linux-aarch64-3.10/matplotlib/mpl-data/images
  341. copying lib/matplotlib/mpl-data/images/matplotlib.svg -> build/lib.linux-aarch64-3.10/matplotlib/mpl-data/images
  342. copying lib/matplotlib/mpl-data/fonts/ttf/DejaVuSansMono.ttf -> build/lib.linux-aarch64-3.10/matplotlib/mpl-data/fonts/ttf
  343. copying lib/matplotlib/mpl-data/images/back.png -> build/lib.linux-aarch64-3.10/matplotlib/mpl-data/images
  344. copying lib/matplotlib/mpl-data/images/forward.svg -> build/lib.linux-aarch64-3.10/matplotlib/mpl-data/images
  345. creating build/lib.linux-aarch64-3.10/matplotlib/backends/web_backend
  346. creating build/lib.linux-aarch64-3.10/matplotlib/backends/web_backend/js
  347. copying lib/matplotlib/backends/web_backend/js/mpl_tornado.js -> build/lib.linux-aarch64-3.10/matplotlib/backends/web_backend/js
  348. copying lib/matplotlib/mpl-data/stylelib/seaborn-notebook.mplstyle -> build/lib.linux-aarch64-3.10/matplotlib/mpl-data/stylelib
  349. copying lib/matplotlib/mpl-data/fonts/ttf/STIXNonUniBolIta.ttf -> build/lib.linux-aarch64-3.10/matplotlib/mpl-data/fonts/ttf
  350. copying lib/matplotlib/mpl-data/images/hand.pdf -> build/lib.linux-aarch64-3.10/matplotlib/mpl-data/images
  351. copying lib/matplotlib/mpl-data/images/subplots_large.png -> build/lib.linux-aarch64-3.10/matplotlib/mpl-data/images
  352. copying lib/matplotlib/mpl-data/images/zoom_to_rect.pdf -> build/lib.linux-aarch64-3.10/matplotlib/mpl-data/images
  353. creating build/lib.linux-aarch64-3.10/matplotlib/mpl-data/fonts/pdfcorefonts
  354. copying lib/matplotlib/mpl-data/fonts/pdfcorefonts/Helvetica-BoldOblique.afm -> build/lib.linux-aarch64-3.10/matplotlib/mpl-data/fonts/pdfcorefonts
  355. copying lib/matplotlib/mpl-data/images/subplots-symbolic.svg -> build/lib.linux-aarch64-3.10/matplotlib/mpl-data/images
  356. copying lib/matplotlib/mpl-data/stylelib/Solarize_Light2.mplstyle -> build/lib.linux-aarch64-3.10/matplotlib/mpl-data/stylelib
  357. copying lib/matplotlib/mpl-data/fonts/pdfcorefonts/ZapfDingbats.afm -> build/lib.linux-aarch64-3.10/matplotlib/mpl-data/fonts/pdfcorefonts
  358. creating build/lib.linux-aarch64-3.10/matplotlib/mpl-data/fonts/afm
  359. copying lib/matplotlib/mpl-data/fonts/afm/cmex10.afm -> build/lib.linux-aarch64-3.10/matplotlib/mpl-data/fonts/afm
  360. copying lib/matplotlib/mpl-data/fonts/afm/cmmi10.afm -> build/lib.linux-aarch64-3.10/matplotlib/mpl-data/fonts/afm
  361. copying lib/matplotlib/mpl-data/fonts/afm/cmsy10.afm -> build/lib.linux-aarch64-3.10/matplotlib/mpl-data/fonts/afm
  362. copying lib/matplotlib/mpl-data/fonts/afm/cmtt10.afm -> build/lib.linux-aarch64-3.10/matplotlib/mpl-data/fonts/afm
  363. copying lib/matplotlib/mpl-data/images/matplotlib_large.png -> build/lib.linux-aarch64-3.10/matplotlib/mpl-data/images
  364. copying lib/matplotlib/mpl-data/stylelib/seaborn-dark-palette.mplstyle -> build/lib.linux-aarch64-3.10/matplotlib/mpl-data/stylelib
  365. copying lib/matplotlib/mpl-data/fonts/ttf/STIXSizOneSymBol.ttf -> build/lib.linux-aarch64-3.10/matplotlib/mpl-data/fonts/ttf
  366. copying lib/matplotlib/mpl-data/fonts/ttf/STIXSizTwoSymBol.ttf -> build/lib.linux-aarch64-3.10/matplotlib/mpl-data/fonts/ttf
  367. copying lib/matplotlib/mpl-data/fonts/afm/putri8a.afm -> build/lib.linux-aarch64-3.10/matplotlib/mpl-data/fonts/afm
  368. copying lib/matplotlib/mpl-data/fonts/afm/pzcmi8a.afm -> build/lib.linux-aarch64-3.10/matplotlib/mpl-data/fonts/afm
  369. copying lib/matplotlib/mpl-data/fonts/afm/phvro8a.afm -> build/lib.linux-aarch64-3.10/matplotlib/mpl-data/fonts/afm
  370. copying lib/matplotlib/mpl-data/fonts/afm/pncbi8a.afm -> build/lib.linux-aarch64-3.10/matplotlib/mpl-data/fonts/afm
  371. copying lib/matplotlib/mpl-data/fonts/afm/pncri8a.afm -> build/lib.linux-aarch64-3.10/matplotlib/mpl-data/fonts/afm
  372. copying lib/matplotlib/mpl-data/fonts/afm/pplbi8a.afm -> build/lib.linux-aarch64-3.10/matplotlib/mpl-data/fonts/afm
  373. copying lib/matplotlib/mpl-data/fonts/afm/pplri8a.afm -> build/lib.linux-aarch64-3.10/matplotlib/mpl-data/fonts/afm
  374. copying lib/matplotlib/mpl-data/fonts/afm/ptmbi8a.afm -> build/lib.linux-aarch64-3.10/matplotlib/mpl-data/fonts/afm
  375. copying lib/matplotlib/mpl-data/fonts/afm/ptmri8a.afm -> build/lib.linux-aarch64-3.10/matplotlib/mpl-data/fonts/afm
  376. copying lib/matplotlib/mpl-data/fonts/afm/putbi8a.afm -> build/lib.linux-aarch64-3.10/matplotlib/mpl-data/fonts/afm
  377. copying lib/matplotlib/mpl-data/fonts/ttf/DejaVuSerif.ttf -> build/lib.linux-aarch64-3.10/matplotlib/mpl-data/fonts/ttf
  378. copying lib/matplotlib/mpl-data/fonts/ttf/STIXSizFiveSymReg.ttf -> build/lib.linux-aarch64-3.10/matplotlib/mpl-data/fonts/ttf
  379. copying lib/matplotlib/mpl-data/fonts/ttf/STIXSizFourSymReg.ttf -> build/lib.linux-aarch64-3.10/matplotlib/mpl-data/fonts/ttf
  380. copying lib/matplotlib/mpl-data/images/help.pdf -> build/lib.linux-aarch64-3.10/matplotlib/mpl-data/images
  381. copying lib/matplotlib/mpl-data/images/home.pdf -> build/lib.linux-aarch64-3.10/matplotlib/mpl-data/images
  382. copying lib/matplotlib/mpl-data/images/zoom_to_rect-symbolic.svg -> build/lib.linux-aarch64-3.10/matplotlib/mpl-data/images
  383. copying lib/matplotlib/mpl-data/stylelib/dark_background.mplstyle -> build/lib.linux-aarch64-3.10/matplotlib/mpl-data/stylelib
  384. copying lib/matplotlib/mpl-data/stylelib/seaborn-dark.mplstyle -> build/lib.linux-aarch64-3.10/matplotlib/mpl-data/stylelib
  385. copying lib/matplotlib/mpl-data/stylelib/seaborn-deep.mplstyle -> build/lib.linux-aarch64-3.10/matplotlib/mpl-data/stylelib
  386. copying lib/matplotlib/backends/web_backend/.prettierrc -> build/lib.linux-aarch64-3.10/matplotlib/backends/web_backend
  387. copying lib/matplotlib/mpl-data/fonts/ttf/STIXGeneralItalic.ttf -> build/lib.linux-aarch64-3.10/matplotlib/mpl-data/fonts/ttf
  388. copying lib/matplotlib/backends/web_backend/.eslintrc.js -> build/lib.linux-aarch64-3.10/matplotlib/backends/web_backend
  389. creating build/lib.linux-aarch64-3.10/matplotlib/backends/web_backend/css
  390. copying lib/matplotlib/backends/web_backend/css/page.css -> build/lib.linux-aarch64-3.10/matplotlib/backends/web_backend/css
  391. copying lib/matplotlib/mpl-data/images/filesave.svg -> build/lib.linux-aarch64-3.10/matplotlib/mpl-data/images
  392. copying lib/matplotlib/backends/web_backend/css/mpl.css -> build/lib.linux-aarch64-3.10/matplotlib/backends/web_backend/css
  393. copying lib/matplotlib/mpl-data/stylelib/seaborn-colorblind.mplstyle -> build/lib.linux-aarch64-3.10/matplotlib/mpl-data/stylelib
  394. copying lib/matplotlib/mpl-data/images/back-symbolic.svg -> build/lib.linux-aarch64-3.10/matplotlib/mpl-data/images
  395. copying lib/matplotlib/backends/web_backend/js/nbagg_mpl.js -> build/lib.linux-aarch64-3.10/matplotlib/backends/web_backend/js
  396. copying lib/matplotlib/backends/web_backend/package.json -> build/lib.linux-aarch64-3.10/matplotlib/backends/web_backend
  397. copying lib/matplotlib/mpl-data/images/help_large.png -> build/lib.linux-aarch64-3.10/matplotlib/mpl-data/images
  398. copying lib/matplotlib/mpl-data/images/home_large.png -> build/lib.linux-aarch64-3.10/matplotlib/mpl-data/images
  399. copying lib/matplotlib/mpl-data/images/qt4_editor_options_large.png -> build/lib.linux-aarch64-3.10/matplotlib/mpl-data/images
  400. copying lib/matplotlib/mpl-data/fonts/afm/phvb8an.afm -> build/lib.linux-aarch64-3.10/matplotlib/mpl-data/fonts/afm
  401. copying lib/matplotlib/mpl-data/fonts/afm/phvr8an.afm -> build/lib.linux-aarch64-3.10/matplotlib/mpl-data/fonts/afm
  402. copying lib/matplotlib/mpl-data/images/filesave.pdf -> build/lib.linux-aarch64-3.10/matplotlib/mpl-data/images
  403. copying lib/matplotlib/mpl-data/images/zoom_to_rect.png -> build/lib.linux-aarch64-3.10/matplotlib/mpl-data/images
  404. copying lib/matplotlib/backends/web_backend/css/fbm.css -> build/lib.linux-aarch64-3.10/matplotlib/backends/web_backend/css
  405. copying lib/matplotlib/mpl-data/images/qt4_editor_options.pdf -> build/lib.linux-aarch64-3.10/matplotlib/mpl-data/images
  406. copying lib/matplotlib/mpl-data/stylelib/seaborn-talk.mplstyle -> build/lib.linux-aarch64-3.10/matplotlib/mpl-data/stylelib
  407. copying lib/matplotlib/mpl-data/sample_data/msft.csv -> build/lib.linux-aarch64-3.10/matplotlib/mpl-data/sample_data
  408. copying lib/matplotlib/mpl-data/fonts/ttf/DejaVuSerif-Bold.ttf -> build/lib.linux-aarch64-3.10/matplotlib/mpl-data/fonts/ttf
  409. copying lib/matplotlib/mpl-data/sample_data/percent_bachelors_degrees_women_usa.csv -> build/lib.linux-aarch64-3.10/matplotlib/mpl-data/sample_data
  410. copying lib/matplotlib/mpl-data/sample_data/jacksboro_fault_dem.npz -> build/lib.linux-aarch64-3.10/matplotlib/mpl-data/sample_data
  411. copying lib/matplotlib/mpl-data/sample_data/Minduka_Present_Blue_Pack.png -> build/lib.linux-aarch64-3.10/matplotlib/mpl-data/sample_data
  412. copying lib/matplotlib/mpl-data/images/filesave-symbolic.svg -> build/lib.linux-aarch64-3.10/matplotlib/mpl-data/images
  413. copying lib/matplotlib/mpl-data/fonts/pdfcorefonts/Courier-Bold.afm -> build/lib.linux-aarch64-3.10/matplotlib/mpl-data/fonts/pdfcorefonts
  414. copying lib/matplotlib/mpl-data/images/subplots.svg -> build/lib.linux-aarch64-3.10/matplotlib/mpl-data/images
  415. copying lib/matplotlib/mpl-data/fonts/pdfcorefonts/Helvetica.afm -> build/lib.linux-aarch64-3.10/matplotlib/mpl-data/fonts/pdfcorefonts
  416. copying lib/matplotlib/mpl-data/stylelib/tableau-colorblind10.mplstyle -> build/lib.linux-aarch64-3.10/matplotlib/mpl-data/stylelib
  417. copying lib/matplotlib/mpl-data/images/forward.png -> build/lib.linux-aarch64-3.10/matplotlib/mpl-data/images
  418. copying lib/matplotlib/mpl-data/fonts/ttf/DejaVuSansDisplay.ttf -> build/lib.linux-aarch64-3.10/matplotlib/mpl-data/fonts/ttf
  419. copying lib/matplotlib/mpl-data/sample_data/grace_hopper.jpg -> build/lib.linux-aarch64-3.10/matplotlib/mpl-data/sample_data
  420. copying lib/matplotlib/mpl-data/fonts/ttf/LICENSE_STIX -> build/lib.linux-aarch64-3.10/matplotlib/mpl-data/fonts/ttf
  421. copying lib/matplotlib/backends/web_backend/ipython_inline_figure.html -> build/lib.linux-aarch64-3.10/matplotlib/backends/web_backend
  422. copying lib/matplotlib/mpl-data/fonts/afm/cmr10.afm -> build/lib.linux-aarch64-3.10/matplotlib/mpl-data/fonts/afm
  423. copying lib/matplotlib/mpl-data/fonts/pdfcorefonts/Times-Roman.afm -> build/lib.linux-aarch64-3.10/matplotlib/mpl-data/fonts/pdfcorefonts
  424. copying lib/matplotlib/mpl-data/stylelib/fast.mplstyle -> build/lib.linux-aarch64-3.10/matplotlib/mpl-data/stylelib
  425. copying lib/matplotlib/mpl-data/fonts/ttf/cmb10.ttf -> build/lib.linux-aarch64-3.10/matplotlib/mpl-data/fonts/ttf
  426. copying lib/matplotlib/mpl-data/fonts/ttf/cmex10.ttf -> build/lib.linux-aarch64-3.10/matplotlib/mpl-data/fonts/ttf
  427. copying lib/matplotlib/mpl-data/fonts/ttf/cmmi10.ttf -> build/lib.linux-aarch64-3.10/matplotlib/mpl-data/fonts/ttf
  428. copying lib/matplotlib/mpl-data/fonts/ttf/cmr10.ttf -> build/lib.linux-aarch64-3.10/matplotlib/mpl-data/fonts/ttf
  429. copying lib/matplotlib/mpl-data/fonts/ttf/cmss10.ttf -> build/lib.linux-aarch64-3.10/matplotlib/mpl-data/fonts/ttf
  430. copying lib/matplotlib/mpl-data/fonts/ttf/STIXSizFourSymBol.ttf -> build/lib.linux-aarch64-3.10/matplotlib/mpl-data/fonts/ttf
  431. copying lib/matplotlib/mpl-data/fonts/ttf/cmsy10.ttf -> build/lib.linux-aarch64-3.10/matplotlib/mpl-data/fonts/ttf
  432. copying lib/matplotlib/mpl-data/fonts/ttf/cmtt10.ttf -> build/lib.linux-aarch64-3.10/matplotlib/mpl-data/fonts/ttf
  433. copying lib/matplotlib/mpl-data/stylelib/ggplot.mplstyle -> build/lib.linux-aarch64-3.10/matplotlib/mpl-data/stylelib
  434. copying lib/matplotlib/mpl-data/fonts/ttf/DejaVuSerif-BoldItalic.ttf -> build/lib.linux-aarch64-3.10/matplotlib/mpl-data/fonts/ttf
  435. copying lib/matplotlib/mpl-data/images/help.png -> build/lib.linux-aarch64-3.10/matplotlib/mpl-data/images
  436. copying lib/matplotlib/mpl-data/images/home.png -> build/lib.linux-aarch64-3.10/matplotlib/mpl-data/images
  437. copying lib/matplotlib/backends/web_backend/.prettierignore -> build/lib.linux-aarch64-3.10/matplotlib/backends/web_backend
  438. copying lib/matplotlib/mpl-data/fonts/ttf/DejaVuSans.ttf -> build/lib.linux-aarch64-3.10/matplotlib/mpl-data/fonts/ttf
  439. copying lib/matplotlib/mpl-data/images/subplots.pdf -> build/lib.linux-aarch64-3.10/matplotlib/mpl-data/images
  440. copying lib/matplotlib/mpl-data/images/back_large.png -> build/lib.linux-aarch64-3.10/matplotlib/mpl-data/images
  441. creating build/lib.linux-aarch64-3.10/matplotlib/mpl-data/sample_data/axes_grid
  442. copying lib/matplotlib/mpl-data/sample_data/axes_grid/bivariate_normal.npy -> build/lib.linux-aarch64-3.10/matplotlib/mpl-data/sample_data/axes_grid
  443. copying lib/matplotlib/mpl-data/stylelib/_mpl-gallery-nogrid.mplstyle -> build/lib.linux-aarch64-3.10/matplotlib/mpl-data/stylelib
  444. copying lib/matplotlib/mpl-data/images/qt4_editor_options.png -> build/lib.linux-aarch64-3.10/matplotlib/mpl-data/images
  445. copying lib/matplotlib/mpl-data/fonts/ttf/DejaVuSansMono-Oblique.ttf -> build/lib.linux-aarch64-3.10/matplotlib/mpl-data/fonts/ttf
  446. copying lib/matplotlib/backends/web_backend/all_figures.html -> build/lib.linux-aarch64-3.10/matplotlib/backends/web_backend
  447. copying lib/matplotlib/mpl-data/stylelib/seaborn-muted.mplstyle -> build/lib.linux-aarch64-3.10/matplotlib/mpl-data/stylelib
  448. copying lib/matplotlib/mpl-data/stylelib/seaborn-paper.mplstyle -> build/lib.linux-aarch64-3.10/matplotlib/mpl-data/stylelib
  449. copying lib/matplotlib/mpl-data/stylelib/seaborn-ticks.mplstyle -> build/lib.linux-aarch64-3.10/matplotlib/mpl-data/stylelib
  450. copying lib/matplotlib/mpl-data/images/zoom_to_rect_large.png -> build/lib.linux-aarch64-3.10/matplotlib/mpl-data/images
  451. copying lib/matplotlib/mpl-data/stylelib/seaborn-white.mplstyle -> build/lib.linux-aarch64-3.10/matplotlib/mpl-data/stylelib
  452. copying lib/matplotlib/mpl-data/images/forward_large.png -> build/lib.linux-aarch64-3.10/matplotlib/mpl-data/images
  453. copying lib/matplotlib/mpl-data/sample_data/eeg.dat -> build/lib.linux-aarch64-3.10/matplotlib/mpl-data/sample_data
  454. copying lib/matplotlib/mpl-data/fonts/afm/pagd8a.afm -> build/lib.linux-aarch64-3.10/matplotlib/mpl-data/fonts/afm
  455. copying lib/matplotlib/mpl-data/fonts/afm/pagk8a.afm -> build/lib.linux-aarch64-3.10/matplotlib/mpl-data/fonts/afm
  456. copying lib/matplotlib/mpl-data/fonts/afm/pbkd8a.afm -> build/lib.linux-aarch64-3.10/matplotlib/mpl-data/fonts/afm
  457. copying lib/matplotlib/mpl-data/fonts/afm/pbkl8a.afm -> build/lib.linux-aarch64-3.10/matplotlib/mpl-data/fonts/afm
  458. copying lib/matplotlib/mpl-data/fonts/afm/pcrb8a.afm -> build/lib.linux-aarch64-3.10/matplotlib/mpl-data/fonts/afm
  459. copying lib/matplotlib/mpl-data/fonts/afm/pcrr8a.afm -> build/lib.linux-aarch64-3.10/matplotlib/mpl-data/fonts/afm
  460. copying lib/matplotlib/mpl-data/fonts/afm/phvb8a.afm -> build/lib.linux-aarch64-3.10/matplotlib/mpl-data/fonts/afm
  461. copying lib/matplotlib/mpl-data/fonts/afm/phvl8a.afm -> build/lib.linux-aarch64-3.10/matplotlib/mpl-data/fonts/afm
  462. copying lib/matplotlib/mpl-data/fonts/afm/phvr8a.afm -> build/lib.linux-aarch64-3.10/matplotlib/mpl-data/fonts/afm
  463. copying lib/matplotlib/mpl-data/images/help.svg -> build/lib.linux-aarch64-3.10/matplotlib/mpl-data/images
  464. copying lib/matplotlib/mpl-data/images/home.svg -> build/lib.linux-aarch64-3.10/matplotlib/mpl-data/images
  465. copying lib/matplotlib/mpl-data/fonts/pdfcorefonts/Times-Bold.afm -> build/lib.linux-aarch64-3.10/matplotlib/mpl-data/fonts/pdfcorefonts
  466. copying lib/matplotlib/mpl-data/images/back.svg -> build/lib.linux-aarch64-3.10/matplotlib/mpl-data/images
  467. creating build/lib.linux-aarch64-3.10/matplotlib/mpl-data/plot_directive
  468. copying lib/matplotlib/mpl-data/plot_directive/plot_directive.css -> build/lib.linux-aarch64-3.10/matplotlib/mpl-data/plot_directive
  469. copying lib/matplotlib/mpl-data/images/qt4_editor_options.svg -> build/lib.linux-aarch64-3.10/matplotlib/mpl-data/images
  470. copying lib/matplotlib/mpl-data/sample_data/logo2.png -> build/lib.linux-aarch64-3.10/matplotlib/mpl-data/sample_data
  471. copying lib/matplotlib/mpl-data/stylelib/_mpl-gallery.mplstyle -> build/lib.linux-aarch64-3.10/matplotlib/mpl-data/stylelib
  472. copying lib/matplotlib/mpl-data/fonts/ttf/STIXSizOneSymReg.ttf -> build/lib.linux-aarch64-3.10/matplotlib/mpl-data/fonts/ttf
  473. copying lib/matplotlib/mpl-data/fonts/ttf/STIXSizTwoSymReg.ttf -> build/lib.linux-aarch64-3.10/matplotlib/mpl-data/fonts/ttf
  474. copying lib/matplotlib/mpl-data/images/help-symbolic.svg -> build/lib.linux-aarch64-3.10/matplotlib/mpl-data/images
  475. copying lib/matplotlib/mpl-data/images/home-symbolic.svg -> build/lib.linux-aarch64-3.10/matplotlib/mpl-data/images
  476. copying lib/matplotlib/mpl-data/images/forward.pdf -> build/lib.linux-aarch64-3.10/matplotlib/mpl-data/images
  477. copying lib/matplotlib/mpl-data/fonts/pdfcorefonts/Symbol.afm -> build/lib.linux-aarch64-3.10/matplotlib/mpl-data/fonts/pdfcorefonts
  478. copying lib/matplotlib/mpl-data/images/move-symbolic.svg -> build/lib.linux-aarch64-3.10/matplotlib/mpl-data/images
  479. copying lib/matplotlib/mpl-data/fonts/ttf/DejaVuSans-Oblique.ttf -> build/lib.linux-aarch64-3.10/matplotlib/mpl-data/fonts/ttf
  480. copying lib/matplotlib/mpl-data/stylelib/seaborn.mplstyle -> build/lib.linux-aarch64-3.10/matplotlib/mpl-data/stylelib
  481. copying lib/matplotlib/mpl-data/fonts/ttf/DejaVuSerif-Italic.ttf -> build/lib.linux-aarch64-3.10/matplotlib/mpl-data/fonts/ttf
  482. copying lib/matplotlib/mpl-data/sample_data/README.txt -> build/lib.linux-aarch64-3.10/matplotlib/mpl-data/sample_data
  483. copying lib/matplotlib/mpl-data/images/move.svg -> build/lib.linux-aarch64-3.10/matplotlib/mpl-data/images
  484. copying lib/matplotlib/mpl-data/fonts/ttf/DejaVuSans-BoldOblique.ttf -> build/lib.linux-aarch64-3.10/matplotlib/mpl-data/fonts/ttf
  485. copying lib/matplotlib/mpl-data/fonts/ttf/STIXGeneralBol.ttf -> build/lib.linux-aarch64-3.10/matplotlib/mpl-data/fonts/ttf
  486. copying lib/matplotlib/mpl-data/fonts/ttf/DejaVuSansMono-BoldOblique.ttf -> build/lib.linux-aarch64-3.10/matplotlib/mpl-data/fonts/ttf
  487. copying lib/matplotlib/mpl-data/fonts/afm/pncb8a.afm -> build/lib.linux-aarch64-3.10/matplotlib/mpl-data/fonts/afm
  488. copying lib/matplotlib/mpl-data/fonts/afm/pncr8a.afm -> build/lib.linux-aarch64-3.10/matplotlib/mpl-data/fonts/afm
  489. copying lib/matplotlib/mpl-data/fonts/afm/pplb8a.afm -> build/lib.linux-aarch64-3.10/matplotlib/mpl-data/fonts/afm
  490. copying lib/matplotlib/mpl-data/fonts/afm/pplr8a.afm -> build/lib.linux-aarch64-3.10/matplotlib/mpl-data/fonts/afm
  491. copying lib/matplotlib/mpl-data/fonts/pdfcorefonts/readme.txt -> build/lib.linux-aarch64-3.10/matplotlib/mpl-data/fonts/pdfcorefonts
  492. copying lib/matplotlib/mpl-data/fonts/afm/ptmb8a.afm -> build/lib.linux-aarch64-3.10/matplotlib/mpl-data/fonts/afm
  493. copying lib/matplotlib/mpl-data/fonts/afm/ptmr8a.afm -> build/lib.linux-aarch64-3.10/matplotlib/mpl-data/fonts/afm
  494. copying lib/matplotlib/mpl-data/fonts/afm/putb8a.afm -> build/lib.linux-aarch64-3.10/matplotlib/mpl-data/fonts/afm
  495. copying lib/matplotlib/mpl-data/fonts/afm/putr8a.afm -> build/lib.linux-aarch64-3.10/matplotlib/mpl-data/fonts/afm
  496. copying lib/matplotlib/mpl-data/images/matplotlib.pdf -> build/lib.linux-aarch64-3.10/matplotlib/mpl-data/images
  497. copying lib/matplotlib/mpl-data/images/zoom_to_rect.svg -> build/lib.linux-aarch64-3.10/matplotlib/mpl-data/images
  498. copying lib/matplotlib/mpl-data/images/filesave_large.png -> build/lib.linux-aarch64-3.10/matplotlib/mpl-data/images
  499. copying lib/matplotlib/mpl-data/fonts/ttf/DejaVuSans-Bold.ttf -> build/lib.linux-aarch64-3.10/matplotlib/mpl-data/fonts/ttf
  500. copying lib/matplotlib/mpl-data/images/move.png -> build/lib.linux-aarch64-3.10/matplotlib/mpl-data/images
  501. copying lib/matplotlib/mpl-data/fonts/pdfcorefonts/Times-Italic.afm -> build/lib.linux-aarch64-3.10/matplotlib/mpl-data/fonts/pdfcorefonts
  502. copying lib/matplotlib/mpl-data/stylelib/seaborn-whitegrid.mplstyle -> build/lib.linux-aarch64-3.10/matplotlib/mpl-data/stylelib
  503. copying lib/matplotlib/mpl-data/sample_data/topobathy.npz -> build/lib.linux-aarch64-3.10/matplotlib/mpl-data/sample_data
  504. copying lib/matplotlib/mpl-data/stylelib/grayscale.mplstyle -> build/lib.linux-aarch64-3.10/matplotlib/mpl-data/stylelib
  505. copying lib/matplotlib/mpl-data/images/subplots.png -> build/lib.linux-aarch64-3.10/matplotlib/mpl-data/images
  506. copying lib/matplotlib/mpl-data/fonts/pdfcorefonts/Courier-Oblique.afm -> build/lib.linux-aarch64-3.10/matplotlib/mpl-data/fonts/pdfcorefonts
  507. copying lib/matplotlib/mpl-data/fonts/ttf/DejaVuSansMono-Bold.ttf -> build/lib.linux-aarch64-3.10/matplotlib/mpl-data/fonts/ttf
  508. copying lib/matplotlib/mpl-data/images/hand.png -> build/lib.linux-aarch64-3.10/matplotlib/mpl-data/images
  509. copying lib/matplotlib/mpl-data/fonts/ttf/STIXGeneralBolIta.ttf -> build/lib.linux-aarch64-3.10/matplotlib/mpl-data/fonts/ttf
  510. copying lib/matplotlib/mpl-data/fonts/pdfcorefonts/Courier.afm -> build/lib.linux-aarch64-3.10/matplotlib/mpl-data/fonts/pdfcorefonts
  511. copying lib/matplotlib/mpl-data/stylelib/bmh.mplstyle -> build/lib.linux-aarch64-3.10/matplotlib/mpl-data/stylelib
  512. copying lib/matplotlib/mpl-data/stylelib/classic.mplstyle -> build/lib.linux-aarch64-3.10/matplotlib/mpl-data/stylelib
  513. copying lib/matplotlib/mpl-data/images/forward-symbolic.svg -> build/lib.linux-aarch64-3.10/matplotlib/mpl-data/images
  514. copying lib/matplotlib/mpl-data/images/move.pdf -> build/lib.linux-aarch64-3.10/matplotlib/mpl-data/images
  515. copying lib/matplotlib/mpl-data/images/back.pdf -> build/lib.linux-aarch64-3.10/matplotlib/mpl-data/images
  516. copying lib/matplotlib/backends/web_backend/js/mpl.js -> build/lib.linux-aarch64-3.10/matplotlib/backends/web_backend/js
  517. copying lib/matplotlib/mpl-data/fonts/afm/pagko8a.afm -> build/lib.linux-aarch64-3.10/matplotlib/mpl-data/fonts/afm
  518. copying lib/matplotlib/mpl-data/fonts/afm/pagdo8a.afm -> build/lib.linux-aarch64-3.10/matplotlib/mpl-data/fonts/afm
  519. copying lib/matplotlib/mpl-data/fonts/afm/pbkdi8a.afm -> build/lib.linux-aarch64-3.10/matplotlib/mpl-data/fonts/afm
  520. copying lib/matplotlib/mpl-data/fonts/afm/pbkli8a.afm -> build/lib.linux-aarch64-3.10/matplotlib/mpl-data/fonts/afm
  521. copying lib/matplotlib/mpl-data/fonts/afm/pcrbo8a.afm -> build/lib.linux-aarch64-3.10/matplotlib/mpl-data/fonts/afm
  522. copying lib/matplotlib/mpl-data/fonts/afm/pcrro8a.afm -> build/lib.linux-aarch64-3.10/matplotlib/mpl-data/fonts/afm
  523. copying lib/matplotlib/mpl-data/fonts/afm/phvbo8a.afm -> build/lib.linux-aarch64-3.10/matplotlib/mpl-data/fonts/afm
  524. copying lib/matplotlib/mpl-data/fonts/pdfcorefonts/Courier-BoldOblique.afm -> build/lib.linux-aarch64-3.10/matplotlib/mpl-data/fonts/pdfcorefonts
  525. copying lib/matplotlib/mpl-data/fonts/afm/phvlo8a.afm -> build/lib.linux-aarch64-3.10/matplotlib/mpl-data/fonts/afm
  526. copying lib/matplotlib/mpl-data/matplotlibrc -> build/lib.linux-aarch64-3.10/matplotlib/mpl-data
  527. copying lib/matplotlib/mpl-data/fonts/ttf/LICENSE_DEJAVU -> build/lib.linux-aarch64-3.10/matplotlib/mpl-data/fonts/ttf
  528. copying lib/matplotlib/mpl-data/stylelib/seaborn-darkgrid.mplstyle -> build/lib.linux-aarch64-3.10/matplotlib/mpl-data/stylelib
  529. copying lib/matplotlib/mpl-data/images/move_large.png -> build/lib.linux-aarch64-3.10/matplotlib/mpl-data/images
  530. copying lib/matplotlib/mpl-data/fonts/ttf/STIXGeneral.ttf -> build/lib.linux-aarch64-3.10/matplotlib/mpl-data/fonts/ttf
  531. copying lib/matplotlib/mpl-data/fonts/ttf/STIXNonUni.ttf -> build/lib.linux-aarch64-3.10/matplotlib/mpl-data/fonts/ttf
  532. copying lib/matplotlib/mpl-data/fonts/ttf/STIXSizThreeSymBol.ttf -> build/lib.linux-aarch64-3.10/matplotlib/mpl-data/fonts/ttf
  533. copying lib/matplotlib/mpl-data/fonts/ttf/STIXSizThreeSymReg.ttf -> build/lib.linux-aarch64-3.10/matplotlib/mpl-data/fonts/ttf
  534. copying lib/matplotlib/mpl-data/images/matplotlib_128.ppm -> build/lib.linux-aarch64-3.10/matplotlib/mpl-data/images
  535. copying lib/matplotlib/backends/web_backend/nbagg_uat.ipynb -> build/lib.linux-aarch64-3.10/matplotlib/backends/web_backend
  536. copying lib/matplotlib/backends/web_backend/css/boilerplate.css -> build/lib.linux-aarch64-3.10/matplotlib/backends/web_backend/css
  537. copying lib/matplotlib/mpl-data/kpsewhich.lua -> build/lib.linux-aarch64-3.10/matplotlib/mpl-data
  538. copying lib/matplotlib/mpl-data/fonts/pdfcorefonts/Helvetica-Bold.afm -> build/lib.linux-aarch64-3.10/matplotlib/mpl-data/fonts/pdfcorefonts
  539. copying lib/matplotlib/mpl-data/sample_data/data_x_x2_x3.csv -> build/lib.linux-aarch64-3.10/matplotlib/mpl-data/sample_data
  540. copying lib/matplotlib/mpl-data/fonts/afm/phvbo8an.afm -> build/lib.linux-aarch64-3.10/matplotlib/mpl-data/fonts/afm
  541. copying lib/matplotlib/mpl-data/fonts/afm/phvro8an.afm -> build/lib.linux-aarch64-3.10/matplotlib/mpl-data/fonts/afm
  542. copying lib/matplotlib/mpl-data/fonts/afm/psyr.afm -> build/lib.linux-aarch64-3.10/matplotlib/mpl-data/fonts/afm
  543. copying lib/matplotlib/mpl-data/fonts/afm/pzdr.afm -> build/lib.linux-aarch64-3.10/matplotlib/mpl-data/fonts/afm
  544. copying lib/matplotlib/mpl-data/images/matplotlib.png -> build/lib.linux-aarch64-3.10/matplotlib/mpl-data/images
  545. copying lib/matplotlib/mpl-data/images/hand.svg -> build/lib.linux-aarch64-3.10/matplotlib/mpl-data/images
  546. copying lib/matplotlib/mpl-data/fonts/pdfcorefonts/Times-BoldItalic.afm -> build/lib.linux-aarch64-3.10/matplotlib/mpl-data/fonts/pdfcorefonts
  547. copying lib/matplotlib/mpl-data/sample_data/s1045.ima.gz -> build/lib.linux-aarch64-3.10/matplotlib/mpl-data/sample_data
  548. copying lib/matplotlib/mpl-data/stylelib/fivethirtyeight.mplstyle -> build/lib.linux-aarch64-3.10/matplotlib/mpl-data/stylelib
  549. copying lib/matplotlib/mpl-data/stylelib/_classic_test_patch.mplstyle -> build/lib.linux-aarch64-3.10/matplotlib/mpl-data/stylelib
  550. copying lib/matplotlib/mpl-data/sample_data/goog.npz -> build/lib.linux-aarch64-3.10/matplotlib/mpl-data/sample_data
  551. copying lib/matplotlib/mpl-data/fonts/pdfcorefonts/Helvetica-Oblique.afm -> build/lib.linux-aarch64-3.10/matplotlib/mpl-data/fonts/pdfcorefonts
  552. copying lib/matplotlib/backends/web_backend/single_figure.html -> build/lib.linux-aarch64-3.10/matplotlib/backends/web_backend
  553. running build_ext
  554. creating data
  555. creating data/data
  556. creating data/data/com.termux
  557. creating data/data/com.termux/files
  558. creating data/data/com.termux/files/usr
  559. creating data/data/com.termux/files/usr/tmp
  560. aarch64-linux-android-clang -Wno-unused-result -Wsign-compare -Wunreachable-code -DNDEBUG -g -fwrapv -O3 -Wall -fstack-protector-strong -O3 -fstack-protector-strong -O3 -fPIC -I/data/data/com.termux/files/usr/include/python3.10 -c /data/data/com.termux/files/usr/tmp/tmp15m20htg.cpp -o data/data/com.termux/files/usr/tmp/tmp15m20htg.o -fvisibility=hidden
  561. aarch64-linux-android-clang -Wno-unused-result -Wsign-compare -Wunreachable-code -DNDEBUG -g -fwrapv -O3 -Wall -fstack-protector-strong -O3 -fstack-protector-strong -O3 -fPIC -I/data/data/com.termux/files/usr/include/python3.10 -c /data/data/com.termux/files/usr/tmp/tmpwwi_eudh.cpp -o data/data/com.termux/files/usr/tmp/tmpwwi_eudh.o -fvisibility-inlines-hidden
  562. aarch64-linux-android-clang -Wno-unused-result -Wsign-compare -Wunreachable-code -DNDEBUG -g -fwrapv -O3 -Wall -fstack-protector-strong -O3 -fstack-protector-strong -O3 -fPIC -I/data/data/com.termux/files/usr/include/python3.10 -c /data/data/com.termux/files/usr/tmp/tmp7innii37.cpp -o data/data/com.termux/files/usr/tmp/tmp7innii37.o -flto
  563. Extracting /project/freetype/freetype2/2.6.1/freetype-2.6.1.tar.gz
  564. Building freetype in build/freetype-2.6.1
  565.  
  566. FreeType build system -- automatic system detection
  567.  
  568. The following settings are used:
  569.  
  570. platform unix
  571. compiler aarch64-linux-android-clang
  572. configuration directory ./builds/unix
  573. configuration rules ./builds/unix/unix.mk
  574.  
  575. If this does not correspond to your system or settings please remove the file
  576. `config.mk' from this directory then read the INSTALL file for help.
  577.  
  578. Otherwise, simply type `make' again to build the library,
  579. or `make refdoc' to build the API reference (this needs python >= 2.6).
  580.  
  581. Generating modules list in ./objs/ftmodule.h...
  582. * module: truetype (Windows/Mac font files with extension *.ttf or *.ttc)
  583. * module: type1 (Postscript font files with extension *.pfa or *.pfb)
  584. * module: cff (OpenType fonts with extension *.otf)
  585. * module: cid (Postscript CID-keyed fonts, no known extension)
  586. * module: pfr (PFR/TrueDoc font files with extension *.pfr)
  587. * module: type42 (Type 42 font files with no known extension)
  588. * module: winfnt (Windows bitmap fonts with extension *.fnt or *.fon)
  589. * module: pcf (pcf bitmap fonts)
  590. * module: bdf (bdf bitmap fonts)
  591. * module: sfnt (helper module for TrueType & OpenType formats)
  592. * module: autofit (automatic hinting module)
  593. * module: pshinter (Postscript hinter module)
  594. * module: raster (monochrome bitmap renderer)
  595. * module: smooth (anti-aliased bitmap renderer)
  596. * module: smooth (anti-aliased bitmap renderer for LCDs)
  597. * module: smooth (anti-aliased bitmap renderer for vertical LCDs)
  598. * module: psaux (Postscript Type 1 & Type 2 helper module)
  599. * module: psnames (Postscript & Unicode Glyph name handling)
  600. done.
  601. cd builds/unix; \
  602. ./configure '--with-zlib=no' '--with-bzip2=no' '--with-png=no' '--with-harfbuzz=no' '--enable-static' '--disable-shared' '--host=x86_64-pc-linux-gnu'
  603. checking build system type... aarch64-unknown-linux-gnu
  604. checking host system type... x86_64-pc-linux-gnu
  605. checking for x86_64-pc-linux-gnu-gcc... aarch64-linux-android-clang
  606. checking whether the C compiler works... yes
  607. checking for C compiler default output file name... a.out
  608. checking for suffix of executables...
  609. checking whether we are cross compiling... no
  610. checking for suffix of object files... o
  611. checking whether we are using the GNU C compiler... yes
  612. checking whether aarch64-linux-android-clang accepts -g... yes
  613. checking for aarch64-linux-android-clang option to accept ISO C89... none needed
  614. checking how to run the C preprocessor... aarch64-linux-android-clang -E
  615. checking for x86_64-pc-linux-gnu-pkg-config... no
  616. checking for pkg-config... /data/data/com.termux/files/usr/bin/pkg-config
  617. checking pkg-config is at least version 0.24... yes
  618. checking how to print strings... printf
  619. checking for a sed that does not truncate output... /data/data/com.termux/files/usr/bin/sed
  620. checking for grep that handles long lines and -e... /data/data/com.termux/files/usr/bin/grep
  621. checking for egrep... /data/data/com.termux/files/usr/bin/grep -E
  622. checking for fgrep... /data/data/com.termux/files/usr/bin/grep -F
  623. checking for ld used by aarch64-linux-android-clang... no
  624. configure: error: no acceptable ld found in $PATH
  625. make: *** [builds/unix/detect.mk:85: setup] Error 1
  626. Traceback (most recent call last):
  627. File "<string>", line 1, in <module>
  628. File "/data/data/com.termux/files/usr/tmp/pip-install-v9vamfce/matplotlib_00978329e7354e43b59ba28bb85d8ec3/setup.py", line 273, in <module>
  629. setup( # Finally, pass this all along to setuptools to do the heavy lifting.
  630. File "/data/data/com.termux/files/usr/lib/python3.10/site-packages/setuptools/__init__.py", line 153, in setup
  631. return distutils.core.setup(**attrs)
  632. File "/data/data/com.termux/files/usr/lib/python3.10/distutils/core.py", line 148, in setup
  633. dist.run_commands()
  634. File "/data/data/com.termux/files/usr/lib/python3.10/distutils/dist.py", line 966, in run_commands
  635. self.run_command(cmd)
  636. File "/data/data/com.termux/files/usr/lib/python3.10/distutils/dist.py", line 985, in run_command
  637. cmd_obj.run()
  638. File "/data/data/com.termux/files/usr/lib/python3.10/site-packages/wheel/bdist_wheel.py", line 299, in run
  639. self.run_command('build')
  640. File "/data/data/com.termux/files/usr/lib/python3.10/distutils/cmd.py", line 313, in run_command
  641. self.distribution.run_command(command)
  642. File "/data/data/com.termux/files/usr/lib/python3.10/distutils/dist.py", line 985, in run_command
  643. cmd_obj.run()
  644. File "/data/data/com.termux/files/usr/lib/python3.10/distutils/command/build.py", line 135, in run
  645. self.run_command(cmd_name)
  646. File "/data/data/com.termux/files/usr/lib/python3.10/distutils/cmd.py", line 313, in run_command
  647. self.distribution.run_command(command)
  648. File "/data/data/com.termux/files/usr/lib/python3.10/distutils/dist.py", line 985, in run_command
  649. cmd_obj.run()
  650. File "/data/data/com.termux/files/usr/lib/python3.10/site-packages/setuptools/command/build_ext.py", line 79, in run
  651. _build_ext.run(self)
  652. File "/data/data/com.termux/files/usr/lib/python3.10/distutils/command/build_ext.py", line 340, in run
  653. self.build_extensions()
  654. File "/data/data/com.termux/files/usr/tmp/pip-install-v9vamfce/matplotlib_00978329e7354e43b59ba28bb85d8ec3/setup.py", line 187, in build_extensions
  655. package.do_custom_build(env)
  656. File "/data/data/com.termux/files/usr/tmp/pip-install-v9vamfce/matplotlib_00978329e7354e43b59ba28bb85d8ec3/setupext.py", line 631, in do_custom_build
  657. subprocess.check_call(configure, env=env, cwd=src_path)
  658. File "/data/data/com.termux/files/usr/lib/python3.10/subprocess.py", line 369, in check_call
  659. raise CalledProcessError(retcode, cmd)
  660. subprocess.CalledProcessError: Command '['./configure', '--with-zlib=no', '--with-bzip2=no', '--with-png=no', '--with-harfbuzz=no', '--enable-static', '--disable-shared', '--host=x86_64-pc-linux-gnu']' returned non-zero exit status 2.
  661. ----------------------------------------
  662. ERROR: Failed building wheel for matplotlib
  663. Running setup.py clean for matplotlib
  664. Failed to build matplotlib
  665. Installing collected packages: matplotlib
  666. Running setup.py install for matplotlib ... error
  667. ERROR: Command errored out with exit status 1:
  668. command: /data/data/com.termux/files/usr/bin/python3 -u -c 'import io, os, sys, setuptools, tokenize; sys.argv[0] = '"'"'/data/data/com.termux/files/usr/tmp/pip-install-6blmn66o/matplotlib_7913b26a186a4b01aa892bdc340c4faa/setup.py'"'"'; __file__='"'"'/data/data/com.termux/files/usr/tmp/pip-install-6blmn66o/matplotlib_7913b26a186a4b01aa892bdc340c4faa/setup.py'"'"';f = getattr(tokenize, '"'"'open'"'"', open)(__file__) if os.path.exists(__file__) else io.StringIO('"'"'from setuptools import setup; setup()'"'"');code = f.read().replace('"'"'\r\n'"'"', '"'"'\n'"'"');f.close();exec(compile(code, __file__, '"'"'exec'"'"'))' install --record /data/data/com.termux/files/usr/tmp/pip-record-083a3bxb/install-record.txt --single-version-externally-managed --compile --install-headers /data/data/com.termux/files/usr/include/python3.10/matplotlib
  669. cwd: /data/data/com.termux/files/usr/tmp/pip-install-6blmn66o/matplotlib_7913b26a186a4b01aa892bdc340c4faa/
  670. Complete output (632 lines):
  671.  
  672. Edit mplsetup.cfg to change the build options; suppress output with --quiet.
  673.  
  674. BUILDING MATPLOTLIB
  675. python: yes [3.10.1 (main, Dec 9 2021, 15:28:13) [Clang 12.0.8
  676. (https://android.googlesource.com/toolchain/llvm-project
  677. c935d99d7]
  678. platform: yes [linux]
  679. tests: no [skipping due to configuration]
  680. macosx: no [Mac OS-X only]
  681.  
  682. running install
  683. running build
  684. running build_py
  685. creating build/lib.linux-aarch64-3.10
  686. copying lib/pylab.py -> build/lib.linux-aarch64-3.10
  687. creating build/lib.linux-aarch64-3.10/matplotlib
  688. copying lib/matplotlib/__init__.py -> build/lib.linux-aarch64-3.10/matplotlib
  689. copying lib/matplotlib/_animation_data.py -> build/lib.linux-aarch64-3.10/matplotlib
  690. copying lib/matplotlib/_blocking_input.py -> build/lib.linux-aarch64-3.10/matplotlib
  691. copying lib/matplotlib/_cm.py -> build/lib.linux-aarch64-3.10/matplotlib
  692. copying lib/matplotlib/_cm_listed.py -> build/lib.linux-aarch64-3.10/matplotlib
  693. copying lib/matplotlib/_color_data.py -> build/lib.linux-aarch64-3.10/matplotlib
  694. copying lib/matplotlib/_constrained_layout.py -> build/lib.linux-aarch64-3.10/matplotlib
  695. copying lib/matplotlib/_enums.py -> build/lib.linux-aarch64-3.10/matplotlib
  696. copying lib/matplotlib/_internal_utils.py -> build/lib.linux-aarch64-3.10/matplotlib
  697. copying lib/matplotlib/_layoutgrid.py -> build/lib.linux-aarch64-3.10/matplotlib
  698. copying lib/matplotlib/_mathtext.py -> build/lib.linux-aarch64-3.10/matplotlib
  699. copying lib/matplotlib/_mathtext_data.py -> build/lib.linux-aarch64-3.10/matplotlib
  700. copying lib/matplotlib/_pylab_helpers.py -> build/lib.linux-aarch64-3.10/matplotlib
  701. copying lib/matplotlib/_text_helpers.py -> build/lib.linux-aarch64-3.10/matplotlib
  702. copying lib/matplotlib/_version.py -> build/lib.linux-aarch64-3.10/matplotlib
  703. copying lib/matplotlib/afm.py -> build/lib.linux-aarch64-3.10/matplotlib
  704. copying lib/matplotlib/animation.py -> build/lib.linux-aarch64-3.10/matplotlib
  705. copying lib/matplotlib/artist.py -> build/lib.linux-aarch64-3.10/matplotlib
  706. copying lib/matplotlib/axis.py -> build/lib.linux-aarch64-3.10/matplotlib
  707. copying lib/matplotlib/backend_bases.py -> build/lib.linux-aarch64-3.10/matplotlib
  708. copying lib/matplotlib/backend_managers.py -> build/lib.linux-aarch64-3.10/matplotlib
  709. copying lib/matplotlib/backend_tools.py -> build/lib.linux-aarch64-3.10/matplotlib
  710. copying lib/matplotlib/bezier.py -> build/lib.linux-aarch64-3.10/matplotlib
  711. copying lib/matplotlib/blocking_input.py -> build/lib.linux-aarch64-3.10/matplotlib
  712. copying lib/matplotlib/category.py -> build/lib.linux-aarch64-3.10/matplotlib
  713. copying lib/matplotlib/cm.py -> build/lib.linux-aarch64-3.10/matplotlib
  714. copying lib/matplotlib/collections.py -> build/lib.linux-aarch64-3.10/matplotlib
  715. copying lib/matplotlib/colorbar.py -> build/lib.linux-aarch64-3.10/matplotlib
  716. copying lib/matplotlib/colors.py -> build/lib.linux-aarch64-3.10/matplotlib
  717. copying lib/matplotlib/container.py -> build/lib.linux-aarch64-3.10/matplotlib
  718. copying lib/matplotlib/contour.py -> build/lib.linux-aarch64-3.10/matplotlib
  719. copying lib/matplotlib/dates.py -> build/lib.linux-aarch64-3.10/matplotlib
  720. copying lib/matplotlib/docstring.py -> build/lib.linux-aarch64-3.10/matplotlib
  721. copying lib/matplotlib/dviread.py -> build/lib.linux-aarch64-3.10/matplotlib
  722. copying lib/matplotlib/figure.py -> build/lib.linux-aarch64-3.10/matplotlib
  723. copying lib/matplotlib/font_manager.py -> build/lib.linux-aarch64-3.10/matplotlib
  724. copying lib/matplotlib/fontconfig_pattern.py -> build/lib.linux-aarch64-3.10/matplotlib
  725. copying lib/matplotlib/gridspec.py -> build/lib.linux-aarch64-3.10/matplotlib
  726. copying lib/matplotlib/hatch.py -> build/lib.linux-aarch64-3.10/matplotlib
  727. copying lib/matplotlib/image.py -> build/lib.linux-aarch64-3.10/matplotlib
  728. copying lib/matplotlib/legend.py -> build/lib.linux-aarch64-3.10/matplotlib
  729. copying lib/matplotlib/legend_handler.py -> build/lib.linux-aarch64-3.10/matplotlib
  730. copying lib/matplotlib/lines.py -> build/lib.linux-aarch64-3.10/matplotlib
  731. copying lib/matplotlib/markers.py -> build/lib.linux-aarch64-3.10/matplotlib
  732. copying lib/matplotlib/mathtext.py -> build/lib.linux-aarch64-3.10/matplotlib
  733. copying lib/matplotlib/mlab.py -> build/lib.linux-aarch64-3.10/matplotlib
  734. copying lib/matplotlib/offsetbox.py -> build/lib.linux-aarch64-3.10/matplotlib
  735. copying lib/matplotlib/patches.py -> build/lib.linux-aarch64-3.10/matplotlib
  736. copying lib/matplotlib/path.py -> build/lib.linux-aarch64-3.10/matplotlib
  737. copying lib/matplotlib/patheffects.py -> build/lib.linux-aarch64-3.10/matplotlib
  738. copying lib/matplotlib/pylab.py -> build/lib.linux-aarch64-3.10/matplotlib
  739. copying lib/matplotlib/pyplot.py -> build/lib.linux-aarch64-3.10/matplotlib
  740. copying lib/matplotlib/quiver.py -> build/lib.linux-aarch64-3.10/matplotlib
  741. copying lib/matplotlib/rcsetup.py -> build/lib.linux-aarch64-3.10/matplotlib
  742. copying lib/matplotlib/sankey.py -> build/lib.linux-aarch64-3.10/matplotlib
  743. copying lib/matplotlib/scale.py -> build/lib.linux-aarch64-3.10/matplotlib
  744. copying lib/matplotlib/spines.py -> build/lib.linux-aarch64-3.10/matplotlib
  745. copying lib/matplotlib/stackplot.py -> build/lib.linux-aarch64-3.10/matplotlib
  746. copying lib/matplotlib/streamplot.py -> build/lib.linux-aarch64-3.10/matplotlib
  747. copying lib/matplotlib/table.py -> build/lib.linux-aarch64-3.10/matplotlib
  748. copying lib/matplotlib/texmanager.py -> build/lib.linux-aarch64-3.10/matplotlib
  749. copying lib/matplotlib/text.py -> build/lib.linux-aarch64-3.10/matplotlib
  750. copying lib/matplotlib/textpath.py -> build/lib.linux-aarch64-3.10/matplotlib
  751. copying lib/matplotlib/ticker.py -> build/lib.linux-aarch64-3.10/matplotlib
  752. copying lib/matplotlib/tight_bbox.py -> build/lib.linux-aarch64-3.10/matplotlib
  753. copying lib/matplotlib/tight_layout.py -> build/lib.linux-aarch64-3.10/matplotlib
  754. copying lib/matplotlib/transforms.py -> build/lib.linux-aarch64-3.10/matplotlib
  755. copying lib/matplotlib/type1font.py -> build/lib.linux-aarch64-3.10/matplotlib
  756. copying lib/matplotlib/units.py -> build/lib.linux-aarch64-3.10/matplotlib
  757. copying lib/matplotlib/widgets.py -> build/lib.linux-aarch64-3.10/matplotlib
  758. creating build/lib.linux-aarch64-3.10/mpl_toolkits
  759. copying lib/mpl_toolkits/__init__.py -> build/lib.linux-aarch64-3.10/mpl_toolkits
  760. creating build/lib.linux-aarch64-3.10/matplotlib/_api
  761. copying lib/matplotlib/_api/__init__.py -> build/lib.linux-aarch64-3.10/matplotlib/_api
  762. copying lib/matplotlib/_api/deprecation.py -> build/lib.linux-aarch64-3.10/matplotlib/_api
  763. creating build/lib.linux-aarch64-3.10/matplotlib/axes
  764. copying lib/matplotlib/axes/__init__.py -> build/lib.linux-aarch64-3.10/matplotlib/axes
  765. copying lib/matplotlib/axes/_axes.py -> build/lib.linux-aarch64-3.10/matplotlib/axes
  766. copying lib/matplotlib/axes/_base.py -> build/lib.linux-aarch64-3.10/matplotlib/axes
  767. copying lib/matplotlib/axes/_secondary_axes.py -> build/lib.linux-aarch64-3.10/matplotlib/axes
  768. copying lib/matplotlib/axes/_subplots.py -> build/lib.linux-aarch64-3.10/matplotlib/axes
  769. creating build/lib.linux-aarch64-3.10/matplotlib/backends
  770. copying lib/matplotlib/backends/__init__.py -> build/lib.linux-aarch64-3.10/matplotlib/backends
  771. copying lib/matplotlib/backends/_backend_gtk.py -> build/lib.linux-aarch64-3.10/matplotlib/backends
  772. copying lib/matplotlib/backends/_backend_pdf_ps.py -> build/lib.linux-aarch64-3.10/matplotlib/backends
  773. copying lib/matplotlib/backends/_backend_tk.py -> build/lib.linux-aarch64-3.10/matplotlib/backends
  774. copying lib/matplotlib/backends/backend_agg.py -> build/lib.linux-aarch64-3.10/matplotlib/backends
  775. copying lib/matplotlib/backends/backend_cairo.py -> build/lib.linux-aarch64-3.10/matplotlib/backends
  776. copying lib/matplotlib/backends/backend_gtk3.py -> build/lib.linux-aarch64-3.10/matplotlib/backends
  777. copying lib/matplotlib/backends/backend_gtk3agg.py -> build/lib.linux-aarch64-3.10/matplotlib/backends
  778. copying lib/matplotlib/backends/backend_gtk3cairo.py -> build/lib.linux-aarch64-3.10/matplotlib/backends
  779. copying lib/matplotlib/backends/backend_gtk4.py -> build/lib.linux-aarch64-3.10/matplotlib/backends
  780. copying lib/matplotlib/backends/backend_gtk4agg.py -> build/lib.linux-aarch64-3.10/matplotlib/backends
  781. copying lib/matplotlib/backends/backend_gtk4cairo.py -> build/lib.linux-aarch64-3.10/matplotlib/backends
  782. copying lib/matplotlib/backends/backend_macosx.py -> build/lib.linux-aarch64-3.10/matplotlib/backends
  783. copying lib/matplotlib/backends/backend_mixed.py -> build/lib.linux-aarch64-3.10/matplotlib/backends
  784. copying lib/matplotlib/backends/backend_nbagg.py -> build/lib.linux-aarch64-3.10/matplotlib/backends
  785. copying lib/matplotlib/backends/backend_pdf.py -> build/lib.linux-aarch64-3.10/matplotlib/backends
  786. copying lib/matplotlib/backends/backend_pgf.py -> build/lib.linux-aarch64-3.10/matplotlib/backends
  787. copying lib/matplotlib/backends/backend_ps.py -> build/lib.linux-aarch64-3.10/matplotlib/backends
  788. copying lib/matplotlib/backends/backend_qt.py -> build/lib.linux-aarch64-3.10/matplotlib/backends
  789. copying lib/matplotlib/backends/backend_qt5.py -> build/lib.linux-aarch64-3.10/matplotlib/backends
  790. copying lib/matplotlib/backends/backend_qt5agg.py -> build/lib.linux-aarch64-3.10/matplotlib/backends
  791. copying lib/matplotlib/backends/backend_qt5cairo.py -> build/lib.linux-aarch64-3.10/matplotlib/backends
  792. copying lib/matplotlib/backends/backend_qtagg.py -> build/lib.linux-aarch64-3.10/matplotlib/backends
  793. copying lib/matplotlib/backends/backend_qtcairo.py -> build/lib.linux-aarch64-3.10/matplotlib/backends
  794. copying lib/matplotlib/backends/backend_svg.py -> build/lib.linux-aarch64-3.10/matplotlib/backends
  795. copying lib/matplotlib/backends/backend_template.py -> build/lib.linux-aarch64-3.10/matplotlib/backends
  796. copying lib/matplotlib/backends/backend_tkagg.py -> build/lib.linux-aarch64-3.10/matplotlib/backends
  797. copying lib/matplotlib/backends/backend_tkcairo.py -> build/lib.linux-aarch64-3.10/matplotlib/backends
  798. copying lib/matplotlib/backends/backend_webagg.py -> build/lib.linux-aarch64-3.10/matplotlib/backends
  799. copying lib/matplotlib/backends/backend_webagg_core.py -> build/lib.linux-aarch64-3.10/matplotlib/backends
  800. copying lib/matplotlib/backends/backend_wx.py -> build/lib.linux-aarch64-3.10/matplotlib/backends
  801. copying lib/matplotlib/backends/backend_wxagg.py -> build/lib.linux-aarch64-3.10/matplotlib/backends
  802. copying lib/matplotlib/backends/backend_wxcairo.py -> build/lib.linux-aarch64-3.10/matplotlib/backends
  803. copying lib/matplotlib/backends/qt_compat.py -> build/lib.linux-aarch64-3.10/matplotlib/backends
  804. creating build/lib.linux-aarch64-3.10/matplotlib/cbook
  805. copying lib/matplotlib/cbook/__init__.py -> build/lib.linux-aarch64-3.10/matplotlib/cbook
  806. copying lib/matplotlib/cbook/deprecation.py -> build/lib.linux-aarch64-3.10/matplotlib/cbook
  807. creating build/lib.linux-aarch64-3.10/matplotlib/projections
  808. copying lib/matplotlib/projections/__init__.py -> build/lib.linux-aarch64-3.10/matplotlib/projections
  809. copying lib/matplotlib/projections/geo.py -> build/lib.linux-aarch64-3.10/matplotlib/projections
  810. copying lib/matplotlib/projections/polar.py -> build/lib.linux-aarch64-3.10/matplotlib/projections
  811. creating build/lib.linux-aarch64-3.10/matplotlib/sphinxext
  812. copying lib/matplotlib/sphinxext/__init__.py -> build/lib.linux-aarch64-3.10/matplotlib/sphinxext
  813. copying lib/matplotlib/sphinxext/mathmpl.py -> build/lib.linux-aarch64-3.10/matplotlib/sphinxext
  814. copying lib/matplotlib/sphinxext/plot_directive.py -> build/lib.linux-aarch64-3.10/matplotlib/sphinxext
  815. creating build/lib.linux-aarch64-3.10/matplotlib/style
  816. copying lib/matplotlib/style/__init__.py -> build/lib.linux-aarch64-3.10/matplotlib/style
  817. copying lib/matplotlib/style/core.py -> build/lib.linux-aarch64-3.10/matplotlib/style
  818. creating build/lib.linux-aarch64-3.10/matplotlib/testing
  819. copying lib/matplotlib/testing/__init__.py -> build/lib.linux-aarch64-3.10/matplotlib/testing
  820. copying lib/matplotlib/testing/compare.py -> build/lib.linux-aarch64-3.10/matplotlib/testing
  821. copying lib/matplotlib/testing/conftest.py -> build/lib.linux-aarch64-3.10/matplotlib/testing
  822. copying lib/matplotlib/testing/decorators.py -> build/lib.linux-aarch64-3.10/matplotlib/testing
  823. copying lib/matplotlib/testing/exceptions.py -> build/lib.linux-aarch64-3.10/matplotlib/testing
  824. copying lib/matplotlib/testing/widgets.py -> build/lib.linux-aarch64-3.10/matplotlib/testing
  825. creating build/lib.linux-aarch64-3.10/matplotlib/tests
  826. copying lib/matplotlib/tests/__init__.py -> build/lib.linux-aarch64-3.10/matplotlib/tests
  827. copying lib/matplotlib/tests/conftest.py -> build/lib.linux-aarch64-3.10/matplotlib/tests
  828. copying lib/matplotlib/tests/test_afm.py -> build/lib.linux-aarch64-3.10/matplotlib/tests
  829. copying lib/matplotlib/tests/test_agg.py -> build/lib.linux-aarch64-3.10/matplotlib/tests
  830. copying lib/matplotlib/tests/test_agg_filter.py -> build/lib.linux-aarch64-3.10/matplotlib/tests
  831. copying lib/matplotlib/tests/test_animation.py -> build/lib.linux-aarch64-3.10/matplotlib/tests
  832. copying lib/matplotlib/tests/test_api.py -> build/lib.linux-aarch64-3.10/matplotlib/tests
  833. copying lib/matplotlib/tests/test_arrow_patches.py -> build/lib.linux-aarch64-3.10/matplotlib/tests
  834. copying lib/matplotlib/tests/test_artist.py -> build/lib.linux-aarch64-3.10/matplotlib/tests
  835. copying lib/matplotlib/tests/test_axes.py -> build/lib.linux-aarch64-3.10/matplotlib/tests
  836. copying lib/matplotlib/tests/test_backend_bases.py -> build/lib.linux-aarch64-3.10/matplotlib/tests
  837. copying lib/matplotlib/tests/test_backend_cairo.py -> build/lib.linux-aarch64-3.10/matplotlib/tests
  838. copying lib/matplotlib/tests/test_backend_gtk3.py -> build/lib.linux-aarch64-3.10/matplotlib/tests
  839. copying lib/matplotlib/tests/test_backend_macosx.py -> build/lib.linux-aarch64-3.10/matplotlib/tests
  840. copying lib/matplotlib/tests/test_backend_nbagg.py -> build/lib.linux-aarch64-3.10/matplotlib/tests
  841. copying lib/matplotlib/tests/test_backend_pdf.py -> build/lib.linux-aarch64-3.10/matplotlib/tests
  842. copying lib/matplotlib/tests/test_backend_pgf.py -> build/lib.linux-aarch64-3.10/matplotlib/tests
  843. copying lib/matplotlib/tests/test_backend_ps.py -> build/lib.linux-aarch64-3.10/matplotlib/tests
  844. copying lib/matplotlib/tests/test_backend_qt.py -> build/lib.linux-aarch64-3.10/matplotlib/tests
  845. copying lib/matplotlib/tests/test_backend_svg.py -> build/lib.linux-aarch64-3.10/matplotlib/tests
  846. copying lib/matplotlib/tests/test_backend_tk.py -> build/lib.linux-aarch64-3.10/matplotlib/tests
  847. copying lib/matplotlib/tests/test_backend_tools.py -> build/lib.linux-aarch64-3.10/matplotlib/tests
  848. copying lib/matplotlib/tests/test_backend_webagg.py -> build/lib.linux-aarch64-3.10/matplotlib/tests
  849. copying lib/matplotlib/tests/test_backends_interactive.py -> build/lib.linux-aarch64-3.10/matplotlib/tests
  850. copying lib/matplotlib/tests/test_basic.py -> build/lib.linux-aarch64-3.10/matplotlib/tests
  851. copying lib/matplotlib/tests/test_bbox_tight.py -> build/lib.linux-aarch64-3.10/matplotlib/tests
  852. copying lib/matplotlib/tests/test_category.py -> build/lib.linux-aarch64-3.10/matplotlib/tests
  853. copying lib/matplotlib/tests/test_cbook.py -> build/lib.linux-aarch64-3.10/matplotlib/tests
  854. copying lib/matplotlib/tests/test_collections.py -> build/lib.linux-aarch64-3.10/matplotlib/tests
  855. copying lib/matplotlib/tests/test_colorbar.py -> build/lib.linux-aarch64-3.10/matplotlib/tests
  856. copying lib/matplotlib/tests/test_colors.py -> build/lib.linux-aarch64-3.10/matplotlib/tests
  857. copying lib/matplotlib/tests/test_compare_images.py -> build/lib.linux-aarch64-3.10/matplotlib/tests
  858. copying lib/matplotlib/tests/test_constrainedlayout.py -> build/lib.linux-aarch64-3.10/matplotlib/tests
  859. copying lib/matplotlib/tests/test_container.py -> build/lib.linux-aarch64-3.10/matplotlib/tests
  860. copying lib/matplotlib/tests/test_contour.py -> build/lib.linux-aarch64-3.10/matplotlib/tests
  861. copying lib/matplotlib/tests/test_cycles.py -> build/lib.linux-aarch64-3.10/matplotlib/tests
  862. copying lib/matplotlib/tests/test_dates.py -> build/lib.linux-aarch64-3.10/matplotlib/tests
  863. copying lib/matplotlib/tests/test_determinism.py -> build/lib.linux-aarch64-3.10/matplotlib/tests
  864. copying lib/matplotlib/tests/test_dviread.py -> build/lib.linux-aarch64-3.10/matplotlib/tests
  865. copying lib/matplotlib/tests/test_figure.py -> build/lib.linux-aarch64-3.10/matplotlib/tests
  866. copying lib/matplotlib/tests/test_font_manager.py -> build/lib.linux-aarch64-3.10/matplotlib/tests
  867. copying lib/matplotlib/tests/test_fontconfig_pattern.py -> build/lib.linux-aarch64-3.10/matplotlib/tests
  868. copying lib/matplotlib/tests/test_getattr.py -> build/lib.linux-aarch64-3.10/matplotlib/tests
  869. copying lib/matplotlib/tests/test_gridspec.py -> build/lib.linux-aarch64-3.10/matplotlib/tests
  870. copying lib/matplotlib/tests/test_image.py -> build/lib.linux-aarch64-3.10/matplotlib/tests
  871. copying lib/matplotlib/tests/test_legend.py -> build/lib.linux-aarch64-3.10/matplotlib/tests
  872. copying lib/matplotlib/tests/test_lines.py -> build/lib.linux-aarch64-3.10/matplotlib/tests
  873. copying lib/matplotlib/tests/test_marker.py -> build/lib.linux-aarch64-3.10/matplotlib/tests
  874. copying lib/matplotlib/tests/test_mathtext.py -> build/lib.linux-aarch64-3.10/matplotlib/tests
  875. copying lib/matplotlib/tests/test_matplotlib.py -> build/lib.linux-aarch64-3.10/matplotlib/tests
  876. copying lib/matplotlib/tests/test_mlab.py -> build/lib.linux-aarch64-3.10/matplotlib/tests
  877. copying lib/matplotlib/tests/test_offsetbox.py -> build/lib.linux-aarch64-3.10/matplotlib/tests
  878. copying lib/matplotlib/tests/test_patches.py -> build/lib.linux-aarch64-3.10/matplotlib/tests
  879. copying lib/matplotlib/tests/test_path.py -> build/lib.linux-aarch64-3.10/matplotlib/tests
  880. copying lib/matplotlib/tests/test_patheffects.py -> build/lib.linux-aarch64-3.10/matplotlib/tests
  881. copying lib/matplotlib/tests/test_pickle.py -> build/lib.linux-aarch64-3.10/matplotlib/tests
  882. copying lib/matplotlib/tests/test_png.py -> build/lib.linux-aarch64-3.10/matplotlib/tests
  883. copying lib/matplotlib/tests/test_polar.py -> build/lib.linux-aarch64-3.10/matplotlib/tests
  884. copying lib/matplotlib/tests/test_preprocess_data.py -> build/lib.linux-aarch64-3.10/matplotlib/tests
  885. copying lib/matplotlib/tests/test_pyplot.py -> build/lib.linux-aarch64-3.10/matplotlib/tests
  886. copying lib/matplotlib/tests/test_quiver.py -> build/lib.linux-aarch64-3.10/matplotlib/tests
  887. copying lib/matplotlib/tests/test_rcparams.py -> build/lib.linux-aarch64-3.10/matplotlib/tests
  888. copying lib/matplotlib/tests/test_sankey.py -> build/lib.linux-aarch64-3.10/matplotlib/tests
  889. copying lib/matplotlib/tests/test_scale.py -> build/lib.linux-aarch64-3.10/matplotlib/tests
  890. copying lib/matplotlib/tests/test_simplification.py -> build/lib.linux-aarch64-3.10/matplotlib/tests
  891. copying lib/matplotlib/tests/test_skew.py -> build/lib.linux-aarch64-3.10/matplotlib/tests
  892. copying lib/matplotlib/tests/test_sphinxext.py -> build/lib.linux-aarch64-3.10/matplotlib/tests
  893. copying lib/matplotlib/tests/test_spines.py -> build/lib.linux-aarch64-3.10/matplotlib/tests
  894. copying lib/matplotlib/tests/test_streamplot.py -> build/lib.linux-aarch64-3.10/matplotlib/tests
  895. copying lib/matplotlib/tests/test_style.py -> build/lib.linux-aarch64-3.10/matplotlib/tests
  896. copying lib/matplotlib/tests/test_subplots.py -> build/lib.linux-aarch64-3.10/matplotlib/tests
  897. copying lib/matplotlib/tests/test_table.py -> build/lib.linux-aarch64-3.10/matplotlib/tests
  898. copying lib/matplotlib/tests/test_testing.py -> build/lib.linux-aarch64-3.10/matplotlib/tests
  899. copying lib/matplotlib/tests/test_texmanager.py -> build/lib.linux-aarch64-3.10/matplotlib/tests
  900. copying lib/matplotlib/tests/test_text.py -> build/lib.linux-aarch64-3.10/matplotlib/tests
  901. copying lib/matplotlib/tests/test_ticker.py -> build/lib.linux-aarch64-3.10/matplotlib/tests
  902. copying lib/matplotlib/tests/test_tightlayout.py -> build/lib.linux-aarch64-3.10/matplotlib/tests
  903. copying lib/matplotlib/tests/test_transforms.py -> build/lib.linux-aarch64-3.10/matplotlib/tests
  904. copying lib/matplotlib/tests/test_triangulation.py -> build/lib.linux-aarch64-3.10/matplotlib/tests
  905. copying lib/matplotlib/tests/test_ttconv.py -> build/lib.linux-aarch64-3.10/matplotlib/tests
  906. copying lib/matplotlib/tests/test_type1font.py -> build/lib.linux-aarch64-3.10/matplotlib/tests
  907. copying lib/matplotlib/tests/test_units.py -> build/lib.linux-aarch64-3.10/matplotlib/tests
  908. copying lib/matplotlib/tests/test_usetex.py -> build/lib.linux-aarch64-3.10/matplotlib/tests
  909. copying lib/matplotlib/tests/test_widgets.py -> build/lib.linux-aarch64-3.10/matplotlib/tests
  910. creating build/lib.linux-aarch64-3.10/matplotlib/tri
  911. copying lib/matplotlib/tri/__init__.py -> build/lib.linux-aarch64-3.10/matplotlib/tri
  912. copying lib/matplotlib/tri/triangulation.py -> build/lib.linux-aarch64-3.10/matplotlib/tri
  913. copying lib/matplotlib/tri/tricontour.py -> build/lib.linux-aarch64-3.10/matplotlib/tri
  914. copying lib/matplotlib/tri/trifinder.py -> build/lib.linux-aarch64-3.10/matplotlib/tri
  915. copying lib/matplotlib/tri/triinterpolate.py -> build/lib.linux-aarch64-3.10/matplotlib/tri
  916. copying lib/matplotlib/tri/tripcolor.py -> build/lib.linux-aarch64-3.10/matplotlib/tri
  917. copying lib/matplotlib/tri/triplot.py -> build/lib.linux-aarch64-3.10/matplotlib/tri
  918. copying lib/matplotlib/tri/trirefine.py -> build/lib.linux-aarch64-3.10/matplotlib/tri
  919. copying lib/matplotlib/tri/tritools.py -> build/lib.linux-aarch64-3.10/matplotlib/tri
  920. creating build/lib.linux-aarch64-3.10/matplotlib/backends/qt_editor
  921. copying lib/matplotlib/backends/qt_editor/__init__.py -> build/lib.linux-aarch64-3.10/matplotlib/backends/qt_editor
  922. copying lib/matplotlib/backends/qt_editor/_formlayout.py -> build/lib.linux-aarch64-3.10/matplotlib/backends/qt_editor
  923. copying lib/matplotlib/backends/qt_editor/figureoptions.py -> build/lib.linux-aarch64-3.10/matplotlib/backends/qt_editor
  924. creating build/lib.linux-aarch64-3.10/matplotlib/testing/jpl_units
  925. copying lib/matplotlib/testing/jpl_units/Duration.py -> build/lib.linux-aarch64-3.10/matplotlib/testing/jpl_units
  926. copying lib/matplotlib/testing/jpl_units/Epoch.py -> build/lib.linux-aarch64-3.10/matplotlib/testing/jpl_units
  927. copying lib/matplotlib/testing/jpl_units/EpochConverter.py -> build/lib.linux-aarch64-3.10/matplotlib/testing/jpl_units
  928. copying lib/matplotlib/testing/jpl_units/StrConverter.py -> build/lib.linux-aarch64-3.10/matplotlib/testing/jpl_units
  929. copying lib/matplotlib/testing/jpl_units/UnitDbl.py -> build/lib.linux-aarch64-3.10/matplotlib/testing/jpl_units
  930. copying lib/matplotlib/testing/jpl_units/UnitDblConverter.py -> build/lib.linux-aarch64-3.10/matplotlib/testing/jpl_units
  931. copying lib/matplotlib/testing/jpl_units/UnitDblFormatter.py -> build/lib.linux-aarch64-3.10/matplotlib/testing/jpl_units
  932. copying lib/matplotlib/testing/jpl_units/__init__.py -> build/lib.linux-aarch64-3.10/matplotlib/testing/jpl_units
  933. creating build/lib.linux-aarch64-3.10/mpl_toolkits/axes_grid
  934. copying lib/mpl_toolkits/axes_grid/__init__.py -> build/lib.linux-aarch64-3.10/mpl_toolkits/axes_grid
  935. copying lib/mpl_toolkits/axes_grid/anchored_artists.py -> build/lib.linux-aarch64-3.10/mpl_toolkits/axes_grid
  936. copying lib/mpl_toolkits/axes_grid/angle_helper.py -> build/lib.linux-aarch64-3.10/mpl_toolkits/axes_grid
  937. copying lib/mpl_toolkits/axes_grid/axes_divider.py -> build/lib.linux-aarch64-3.10/mpl_toolkits/axes_grid
  938. copying lib/mpl_toolkits/axes_grid/axes_grid.py -> build/lib.linux-aarch64-3.10/mpl_toolkits/axes_grid
  939. copying lib/mpl_toolkits/axes_grid/axes_rgb.py -> build/lib.linux-aarch64-3.10/mpl_toolkits/axes_grid
  940. copying lib/mpl_toolkits/axes_grid/axes_size.py -> build/lib.linux-aarch64-3.10/mpl_toolkits/axes_grid
  941. copying lib/mpl_toolkits/axes_grid/axis_artist.py -> build/lib.linux-aarch64-3.10/mpl_toolkits/axes_grid
  942. copying lib/mpl_toolkits/axes_grid/axisline_style.py -> build/lib.linux-aarch64-3.10/mpl_toolkits/axes_grid
  943. copying lib/mpl_toolkits/axes_grid/axislines.py -> build/lib.linux-aarch64-3.10/mpl_toolkits/axes_grid
  944. copying lib/mpl_toolkits/axes_grid/clip_path.py -> build/lib.linux-aarch64-3.10/mpl_toolkits/axes_grid
  945. copying lib/mpl_toolkits/axes_grid/floating_axes.py -> build/lib.linux-aarch64-3.10/mpl_toolkits/axes_grid
  946. copying lib/mpl_toolkits/axes_grid/grid_finder.py -> build/lib.linux-aarch64-3.10/mpl_toolkits/axes_grid
  947. copying lib/mpl_toolkits/axes_grid/grid_helper_curvelinear.py -> build/lib.linux-aarch64-3.10/mpl_toolkits/axes_grid
  948. copying lib/mpl_toolkits/axes_grid/inset_locator.py -> build/lib.linux-aarch64-3.10/mpl_toolkits/axes_grid
  949. copying lib/mpl_toolkits/axes_grid/parasite_axes.py -> build/lib.linux-aarch64-3.10/mpl_toolkits/axes_grid
  950. creating build/lib.linux-aarch64-3.10/mpl_toolkits/axes_grid1
  951. copying lib/mpl_toolkits/axes_grid1/__init__.py -> build/lib.linux-aarch64-3.10/mpl_toolkits/axes_grid1
  952. copying lib/mpl_toolkits/axes_grid1/anchored_artists.py -> build/lib.linux-aarch64-3.10/mpl_toolkits/axes_grid1
  953. copying lib/mpl_toolkits/axes_grid1/axes_divider.py -> build/lib.linux-aarch64-3.10/mpl_toolkits/axes_grid1
  954. copying lib/mpl_toolkits/axes_grid1/axes_grid.py -> build/lib.linux-aarch64-3.10/mpl_toolkits/axes_grid1
  955. copying lib/mpl_toolkits/axes_grid1/axes_rgb.py -> build/lib.linux-aarch64-3.10/mpl_toolkits/axes_grid1
  956. copying lib/mpl_toolkits/axes_grid1/axes_size.py -> build/lib.linux-aarch64-3.10/mpl_toolkits/axes_grid1
  957. copying lib/mpl_toolkits/axes_grid1/inset_locator.py -> build/lib.linux-aarch64-3.10/mpl_toolkits/axes_grid1
  958. copying lib/mpl_toolkits/axes_grid1/mpl_axes.py -> build/lib.linux-aarch64-3.10/mpl_toolkits/axes_grid1
  959. copying lib/mpl_toolkits/axes_grid1/parasite_axes.py -> build/lib.linux-aarch64-3.10/mpl_toolkits/axes_grid1
  960. creating build/lib.linux-aarch64-3.10/mpl_toolkits/axisartist
  961. copying lib/mpl_toolkits/axisartist/__init__.py -> build/lib.linux-aarch64-3.10/mpl_toolkits/axisartist
  962. copying lib/mpl_toolkits/axisartist/angle_helper.py -> build/lib.linux-aarch64-3.10/mpl_toolkits/axisartist
  963. copying lib/mpl_toolkits/axisartist/axes_divider.py -> build/lib.linux-aarch64-3.10/mpl_toolkits/axisartist
  964. copying lib/mpl_toolkits/axisartist/axes_grid.py -> build/lib.linux-aarch64-3.10/mpl_toolkits/axisartist
  965. copying lib/mpl_toolkits/axisartist/axes_rgb.py -> build/lib.linux-aarch64-3.10/mpl_toolkits/axisartist
  966. copying lib/mpl_toolkits/axisartist/axis_artist.py -> build/lib.linux-aarch64-3.10/mpl_toolkits/axisartist
  967. copying lib/mpl_toolkits/axisartist/axisline_style.py -> build/lib.linux-aarch64-3.10/mpl_toolkits/axisartist
  968. copying lib/mpl_toolkits/axisartist/axislines.py -> build/lib.linux-aarch64-3.10/mpl_toolkits/axisartist
  969. copying lib/mpl_toolkits/axisartist/clip_path.py -> build/lib.linux-aarch64-3.10/mpl_toolkits/axisartist
  970. copying lib/mpl_toolkits/axisartist/floating_axes.py -> build/lib.linux-aarch64-3.10/mpl_toolkits/axisartist
  971. copying lib/mpl_toolkits/axisartist/grid_finder.py -> build/lib.linux-aarch64-3.10/mpl_toolkits/axisartist
  972. copying lib/mpl_toolkits/axisartist/grid_helper_curvelinear.py -> build/lib.linux-aarch64-3.10/mpl_toolkits/axisartist
  973. copying lib/mpl_toolkits/axisartist/parasite_axes.py -> build/lib.linux-aarch64-3.10/mpl_toolkits/axisartist
  974. creating build/lib.linux-aarch64-3.10/mpl_toolkits/mplot3d
  975. copying lib/mpl_toolkits/mplot3d/__init__.py -> build/lib.linux-aarch64-3.10/mpl_toolkits/mplot3d
  976. copying lib/mpl_toolkits/mplot3d/art3d.py -> build/lib.linux-aarch64-3.10/mpl_toolkits/mplot3d
  977. copying lib/mpl_toolkits/mplot3d/axes3d.py -> build/lib.linux-aarch64-3.10/mpl_toolkits/mplot3d
  978. copying lib/mpl_toolkits/mplot3d/axis3d.py -> build/lib.linux-aarch64-3.10/mpl_toolkits/mplot3d
  979. copying lib/mpl_toolkits/mplot3d/proj3d.py -> build/lib.linux-aarch64-3.10/mpl_toolkits/mplot3d
  980. creating build/lib.linux-aarch64-3.10/mpl_toolkits/tests
  981. copying lib/mpl_toolkits/tests/__init__.py -> build/lib.linux-aarch64-3.10/mpl_toolkits/tests
  982. copying lib/mpl_toolkits/tests/conftest.py -> build/lib.linux-aarch64-3.10/mpl_toolkits/tests
  983. copying lib/mpl_toolkits/tests/test_axes_grid.py -> build/lib.linux-aarch64-3.10/mpl_toolkits/tests
  984. copying lib/mpl_toolkits/tests/test_axes_grid1.py -> build/lib.linux-aarch64-3.10/mpl_toolkits/tests
  985. copying lib/mpl_toolkits/tests/test_axisartist_angle_helper.py -> build/lib.linux-aarch64-3.10/mpl_toolkits/tests
  986. copying lib/mpl_toolkits/tests/test_axisartist_axis_artist.py -> build/lib.linux-aarch64-3.10/mpl_toolkits/tests
  987. copying lib/mpl_toolkits/tests/test_axisartist_axislines.py -> build/lib.linux-aarch64-3.10/mpl_toolkits/tests
  988. copying lib/mpl_toolkits/tests/test_axisartist_clip_path.py -> build/lib.linux-aarch64-3.10/mpl_toolkits/tests
  989. copying lib/mpl_toolkits/tests/test_axisartist_floating_axes.py -> build/lib.linux-aarch64-3.10/mpl_toolkits/tests
  990. copying lib/mpl_toolkits/tests/test_axisartist_grid_finder.py -> build/lib.linux-aarch64-3.10/mpl_toolkits/tests
  991. copying lib/mpl_toolkits/tests/test_axisartist_grid_helper_curvelinear.py -> build/lib.linux-aarch64-3.10/mpl_toolkits/tests
  992. copying lib/mpl_toolkits/tests/test_mplot3d.py -> build/lib.linux-aarch64-3.10/mpl_toolkits/tests
  993. creating build/lib.linux-aarch64-3.10/matplotlib/mpl-data
  994. creating build/lib.linux-aarch64-3.10/matplotlib/mpl-data/fonts
  995. creating build/lib.linux-aarch64-3.10/matplotlib/mpl-data/fonts/ttf
  996. copying lib/matplotlib/mpl-data/fonts/ttf/STIXGeneral.ttf -> build/lib.linux-aarch64-3.10/matplotlib/mpl-data/fonts/ttf
  997. creating build/lib.linux-aarch64-3.10/matplotlib/mpl-data/sample_data
  998. copying lib/matplotlib/mpl-data/sample_data/grace_hopper.jpg -> build/lib.linux-aarch64-3.10/matplotlib/mpl-data/sample_data
  999. copying lib/matplotlib/mpl-data/fonts/ttf/STIXSizFiveSymReg.ttf -> build/lib.linux-aarch64-3.10/matplotlib/mpl-data/fonts/ttf
  1000. copying lib/matplotlib/mpl-data/fonts/ttf/STIXSizFourSymReg.ttf -> build/lib.linux-aarch64-3.10/matplotlib/mpl-data/fonts/ttf
  1001. creating build/lib.linux-aarch64-3.10/matplotlib/mpl-data/images
  1002. copying lib/matplotlib/mpl-data/images/help_large.png -> build/lib.linux-aarch64-3.10/matplotlib/mpl-data/images
  1003. copying lib/matplotlib/mpl-data/images/home_large.png -> build/lib.linux-aarch64-3.10/matplotlib/mpl-data/images
  1004. copying lib/matplotlib/mpl-data/sample_data/README.txt -> build/lib.linux-aarch64-3.10/matplotlib/mpl-data/sample_data
  1005. creating build/lib.linux-aarch64-3.10/matplotlib/mpl-data/stylelib
  1006. copying lib/matplotlib/mpl-data/stylelib/Solarize_Light2.mplstyle -> build/lib.linux-aarch64-3.10/matplotlib/mpl-data/stylelib
  1007. copying lib/matplotlib/mpl-data/fonts/ttf/cmb10.ttf -> build/lib.linux-aarch64-3.10/matplotlib/mpl-data/fonts/ttf
  1008. copying lib/matplotlib/mpl-data/fonts/ttf/cmr10.ttf -> build/lib.linux-aarch64-3.10/matplotlib/mpl-data/fonts/ttf
  1009. copying lib/matplotlib/mpl-data/kpsewhich.lua -> build/lib.linux-aarch64-3.10/matplotlib/mpl-data
  1010. copying lib/matplotlib/mpl-data/images/subplots_large.png -> build/lib.linux-aarch64-3.10/matplotlib/mpl-data/images
  1011. copying lib/matplotlib/mpl-data/sample_data/data_x_x2_x3.csv -> build/lib.linux-aarch64-3.10/matplotlib/mpl-data/sample_data
  1012. copying lib/matplotlib/mpl-data/fonts/ttf/cmex10.ttf -> build/lib.linux-aarch64-3.10/matplotlib/mpl-data/fonts/ttf
  1013. copying lib/matplotlib/mpl-data/fonts/ttf/cmmi10.ttf -> build/lib.linux-aarch64-3.10/matplotlib/mpl-data/fonts/ttf
  1014. copying lib/matplotlib/mpl-data/fonts/ttf/cmss10.ttf -> build/lib.linux-aarch64-3.10/matplotlib/mpl-data/fonts/ttf
  1015. copying lib/matplotlib/mpl-data/fonts/ttf/cmsy10.ttf -> build/lib.linux-aarch64-3.10/matplotlib/mpl-data/fonts/ttf
  1016. copying lib/matplotlib/mpl-data/fonts/ttf/cmtt10.ttf -> build/lib.linux-aarch64-3.10/matplotlib/mpl-data/fonts/ttf
  1017. creating build/lib.linux-aarch64-3.10/matplotlib/mpl-data/fonts/afm
  1018. copying lib/matplotlib/mpl-data/fonts/afm/phvbo8an.afm -> build/lib.linux-aarch64-3.10/matplotlib/mpl-data/fonts/afm
  1019. copying lib/matplotlib/mpl-data/fonts/afm/phvro8an.afm -> build/lib.linux-aarch64-3.10/matplotlib/mpl-data/fonts/afm
  1020. copying lib/matplotlib/mpl-data/images/hand.png -> build/lib.linux-aarch64-3.10/matplotlib/mpl-data/images
  1021. copying lib/matplotlib/mpl-data/fonts/ttf/DejaVuSans-Bold.ttf -> build/lib.linux-aarch64-3.10/matplotlib/mpl-data/fonts/ttf
  1022. copying lib/matplotlib/mpl-data/images/qt4_editor_options.svg -> build/lib.linux-aarch64-3.10/matplotlib/mpl-data/images
  1023. copying lib/matplotlib/mpl-data/fonts/afm/pagd8a.afm -> build/lib.linux-aarch64-3.10/matplotlib/mpl-data/fonts/afm
  1024. copying lib/matplotlib/mpl-data/fonts/afm/pagk8a.afm -> build/lib.linux-aarch64-3.10/matplotlib/mpl-data/fonts/afm
  1025. copying lib/matplotlib/mpl-data/fonts/afm/pbkd8a.afm -> build/lib.linux-aarch64-3.10/matplotlib/mpl-data/fonts/afm
  1026. copying lib/matplotlib/mpl-data/fonts/afm/pbkl8a.afm -> build/lib.linux-aarch64-3.10/matplotlib/mpl-data/fonts/afm
  1027. copying lib/matplotlib/mpl-data/fonts/afm/pcrb8a.afm -> build/lib.linux-aarch64-3.10/matplotlib/mpl-data/fonts/afm
  1028. copying lib/matplotlib/mpl-data/fonts/afm/pcrr8a.afm -> build/lib.linux-aarch64-3.10/matplotlib/mpl-data/fonts/afm
  1029. copying lib/matplotlib/mpl-data/fonts/afm/phvb8a.afm -> build/lib.linux-aarch64-3.10/matplotlib/mpl-data/fonts/afm
  1030. copying lib/matplotlib/mpl-data/fonts/afm/phvl8a.afm -> build/lib.linux-aarch64-3.10/matplotlib/mpl-data/fonts/afm
  1031. copying lib/matplotlib/mpl-data/fonts/afm/phvr8a.afm -> build/lib.linux-aarch64-3.10/matplotlib/mpl-data/fonts/afm
  1032. copying lib/matplotlib/mpl-data/fonts/afm/pncb8a.afm -> build/lib.linux-aarch64-3.10/matplotlib/mpl-data/fonts/afm
  1033. copying lib/matplotlib/mpl-data/fonts/ttf/DejaVuSansMono-BoldOblique.ttf -> build/lib.linux-aarch64-3.10/matplotlib/mpl-data/fonts/ttf
  1034. creating build/lib.linux-aarch64-3.10/matplotlib/mpl-data/plot_directive
  1035. copying lib/matplotlib/mpl-data/plot_directive/plot_directive.css -> build/lib.linux-aarch64-3.10/matplotlib/mpl-data/plot_directive
  1036. copying lib/matplotlib/mpl-data/fonts/afm/pncr8a.afm -> build/lib.linux-aarch64-3.10/matplotlib/mpl-data/fonts/afm
  1037. copying lib/matplotlib/mpl-data/fonts/afm/pplb8a.afm -> build/lib.linux-aarch64-3.10/matplotlib/mpl-data/fonts/afm
  1038. copying lib/matplotlib/mpl-data/fonts/afm/pplr8a.afm -> build/lib.linux-aarch64-3.10/matplotlib/mpl-data/fonts/afm
  1039. copying lib/matplotlib/mpl-data/fonts/afm/ptmb8a.afm -> build/lib.linux-aarch64-3.10/matplotlib/mpl-data/fonts/afm
  1040. copying lib/matplotlib/mpl-data/fonts/afm/ptmr8a.afm -> build/lib.linux-aarch64-3.10/matplotlib/mpl-data/fonts/afm
  1041. copying lib/matplotlib/mpl-data/fonts/afm/putb8a.afm -> build/lib.linux-aarch64-3.10/matplotlib/mpl-data/fonts/afm
  1042. copying lib/matplotlib/mpl-data/fonts/afm/putr8a.afm -> build/lib.linux-aarch64-3.10/matplotlib/mpl-data/fonts/afm
  1043. copying lib/matplotlib/mpl-data/images/home.pdf -> build/lib.linux-aarch64-3.10/matplotlib/mpl-data/images
  1044. copying lib/matplotlib/mpl-data/images/qt4_editor_options_large.png -> build/lib.linux-aarch64-3.10/matplotlib/mpl-data/images
  1045. copying lib/matplotlib/mpl-data/stylelib/grayscale.mplstyle -> build/lib.linux-aarch64-3.10/matplotlib/mpl-data/stylelib
  1046. copying lib/matplotlib/mpl-data/fonts/ttf/STIXSizThreeSymBol.ttf -> build/lib.linux-aarch64-3.10/matplotlib/mpl-data/fonts/ttf
  1047. copying lib/matplotlib/mpl-data/fonts/ttf/STIXSizThreeSymReg.ttf -> build/lib.linux-aarch64-3.10/matplotlib/mpl-data/fonts/ttf
  1048. copying lib/matplotlib/mpl-data/fonts/ttf/DejaVuSans-Oblique.ttf -> build/lib.linux-aarch64-3.10/matplotlib/mpl-data/fonts/ttf
  1049. copying lib/matplotlib/mpl-data/fonts/ttf/STIXGeneralBol.ttf -> build/lib.linux-aarch64-3.10/matplotlib/mpl-data/fonts/ttf
  1050. copying lib/matplotlib/mpl-data/images/move-symbolic.svg -> build/lib.linux-aarch64-3.10/matplotlib/mpl-data/images
  1051. creating build/lib.linux-aarch64-3.10/matplotlib/backends/web_backend
  1052. copying lib/matplotlib/backends/web_backend/single_figure.html -> build/lib.linux-aarch64-3.10/matplotlib/backends/web_backend
  1053. copying lib/matplotlib/mpl-data/stylelib/dark_background.mplstyle -> build/lib.linux-aarch64-3.10/matplotlib/mpl-data/stylelib
  1054. copying lib/matplotlib/mpl-data/images/matplotlib.png -> build/lib.linux-aarch64-3.10/matplotlib/mpl-data/images
  1055. copying lib/matplotlib/mpl-data/sample_data/topobathy.npz -> build/lib.linux-aarch64-3.10/matplotlib/mpl-data/sample_data
  1056. copying lib/matplotlib/mpl-data/images/zoom_to_rect.png -> build/lib.linux-aarch64-3.10/matplotlib/mpl-data/images
  1057. copying lib/matplotlib/mpl-data/fonts/ttf/DejaVuSans.ttf -> build/lib.linux-aarch64-3.10/matplotlib/mpl-data/fonts/ttf
  1058. creating build/lib.linux-aarch64-3.10/matplotlib/mpl-data/fonts/pdfcorefonts
  1059. copying lib/matplotlib/mpl-data/fonts/pdfcorefonts/readme.txt -> build/lib.linux-aarch64-3.10/matplotlib/mpl-data/fonts/pdfcorefonts
  1060. copying lib/matplotlib/mpl-data/images/filesave_large.png -> build/lib.linux-aarch64-3.10/matplotlib/mpl-data/images
  1061. copying lib/matplotlib/mpl-data/images/help-symbolic.svg -> build/lib.linux-aarch64-3.10/matplotlib/mpl-data/images
  1062. copying lib/matplotlib/mpl-data/images/home-symbolic.svg -> build/lib.linux-aarch64-3.10/matplotlib/mpl-data/images
  1063. copying lib/matplotlib/mpl-data/images/move.png -> build/lib.linux-aarch64-3.10/matplotlib/mpl-data/images
  1064. copying lib/matplotlib/mpl-data/fonts/ttf/STIXSizOneSymBol.ttf -> build/lib.linux-aarch64-3.10/matplotlib/mpl-data/fonts/ttf
  1065. copying lib/matplotlib/mpl-data/fonts/ttf/STIXSizTwoSymBol.ttf -> build/lib.linux-aarch64-3.10/matplotlib/mpl-data/fonts/ttf
  1066. copying lib/matplotlib/mpl-data/images/back.pdf -> build/lib.linux-aarch64-3.10/matplotlib/mpl-data/images
  1067. copying lib/matplotlib/mpl-data/fonts/ttf/DejaVuSerif-BoldItalic.ttf -> build/lib.linux-aarch64-3.10/matplotlib/mpl-data/fonts/ttf
  1068. copying lib/matplotlib/mpl-data/sample_data/percent_bachelors_degrees_women_usa.csv -> build/lib.linux-aarch64-3.10/matplotlib/mpl-data/sample_data
  1069. copying lib/matplotlib/mpl-data/stylelib/seaborn-darkgrid.mplstyle -> build/lib.linux-aarch64-3.10/matplotlib/mpl-data/stylelib
  1070. copying lib/matplotlib/backends/web_backend/.prettierignore -> build/lib.linux-aarch64-3.10/matplotlib/backends/web_backend
  1071. copying lib/matplotlib/mpl-data/images/zoom_to_rect.pdf -> build/lib.linux-aarch64-3.10/matplotlib/mpl-data/images
  1072. copying lib/matplotlib/mpl-data/images/move.svg -> build/lib.linux-aarch64-3.10/matplotlib/mpl-data/images copying lib/matplotlib/mpl-data/fonts/afm/pbkdi8a.afm -> build/lib.linux-aarch64-3.10/matplotlib/mpl-data/fonts/afm copying lib/matplotlib/mpl-data/fonts/afm/pbkli8a.afm -> build/lib.linux-aarch64-3.10/matplotlib/mpl-data/fonts/afm copying lib/matplotlib/mpl-data/fonts/afm/pcrbo8a.afm -> build/lib.linux-aarch64-3.10/matplotlib/mpl-data/fonts/afm copying lib/matplotlib/mpl-data/fonts/afm/pcrro8a.afm -> build/lib.linux-aarch64-3.10/matplotlib/mpl-data/fonts/afm copying lib/matplotlib/mpl-data/fonts/afm/phvbo8a.afm -> build/lib.linux-aarch64-3.10/matplotlib/mpl-data/fonts/afm copying lib/matplotlib/mpl-data/fonts/afm/phvlo8a.afm -> build/lib.linux-aarch64-3.10/matplotlib/mpl-data/fonts/afm copying lib/matplotlib/mpl-data/fonts/afm/phvro8a.afm -> build/lib.linux-aarch64-3.10/matplotlib/mpl-data/fonts/afm copying lib/matplotlib/mpl-data/fonts/afm/pzcmi8a.afm -> build/lib.linux-aarch64-3.10/matplotlib/mpl-data/fonts/afm copying lib/matplotlib/mpl-data/fonts/ttf/DejaVuSerif.ttf -> build/lib.linux-aarch64-3.10/matplotlib/mpl-data/fonts/ttf copying lib/matplotlib/mpl-data/images/filesave-symbolic.svg -> build/lib.linux-aarch64-3.10/matplotlib/mpl-data/images copying lib/matplotlib/mpl-data/images/forward.svg -> build/lib.linux-aarch64-3.10/matplotlib/mpl-data/images copying lib/matplotlib/mpl-data/images/zoom_to_rect.svg -> build/lib.linux-aarch64-3.10/matplotlib/mpl-data/images creating build/lib.linux-aarch64-3.10/matplotlib/mpl-data/sample_data/axes_grid copying lib/matplotlib/mpl-data/sample_data/axes_grid/bivariate_normal.npy -> build/lib.linux-aarch64-3.10/matplotlib/mpl-data/sample_data/axes_grid copying lib/matplotlib/mpl-data/fonts/pdfcorefonts/Helvetica-Bold.afm -> build/lib.linux-aarch64-3.10/matplotlib/mpl-data/fonts/pdfcorefonts
  1073. copying lib/matplotlib/mpl-data/fonts/ttf/DejaVuSansDisplay.ttf -> build/lib.linux-aarch64-3.10/matplotlib/mpl-data/fonts/ttf
  1074. copying lib/matplotlib/mpl-data/fonts/pdfcorefonts/Courier-Bold.afm -> build/lib.linux-aarch64-3.10/matplotlib/mpl-data/fonts/pdfcorefonts
  1075. copying lib/matplotlib/mpl-data/matplotlibrc -> build/lib.linux-aarch64-3.10/matplotlib/mpl-data
  1076. copying lib/matplotlib/mpl-data/fonts/afm/cmex10.afm -> build/lib.linux-aarch64-3.10/matplotlib/mpl-data/fonts/afm
  1077. copying lib/matplotlib/mpl-data/fonts/afm/cmmi10.afm -> build/lib.linux-aarch64-3.10/matplotlib/mpl-data/fonts/afm
  1078. copying lib/matplotlib/mpl-data/fonts/afm/cmr10.afm -> build/lib.linux-aarch64-3.10/matplotlib/mpl-data/fonts/afm
  1079. copying lib/matplotlib/mpl-data/fonts/afm/cmsy10.afm -> build/lib.linux-aarch64-3.10/matplotlib/mpl-data/fonts/afm
  1080. copying lib/matplotlib/mpl-data/fonts/afm/cmtt10.afm -> build/lib.linux-aarch64-3.10/matplotlib/mpl-data/fonts/afm
  1081. copying lib/matplotlib/mpl-data/stylelib/fivethirtyeight.mplstyle -> build/lib.linux-aarch64-3.10/matplotlib/mpl-data/stylelib
  1082. copying lib/matplotlib/mpl-data/images/subplots.svg -> build/lib.linux-aarch64-3.10/matplotlib/mpl-data/images
  1083. copying lib/matplotlib/backends/web_backend/ipython_inline_figure.html -> build/lib.linux-aarch64-3.10/matplotlib/backends/web_backend
  1084. copying lib/matplotlib/mpl-data/sample_data/eeg.dat -> build/lib.linux-aarch64-3.10/matplotlib/mpl-data/sample_data
  1085. copying lib/matplotlib/mpl-data/fonts/ttf/STIXGeneralItalic.ttf -> build/lib.linux-aarch64-3.10/matplotlib/mpl-data/fonts/ttf
  1086. copying lib/matplotlib/mpl-data/sample_data/goog.npz -> build/lib.linux-aarch64-3.10/matplotlib/mpl-data/sample_data
  1087. copying lib/matplotlib/mpl-data/stylelib/seaborn-muted.mplstyle -> build/lib.linux-aarch64-3.10/matplotlib/mpl-data/stylelib copying lib/matplotlib/mpl-data/stylelib/seaborn-paper.mplstyle -> build/lib.linux-aarch64-3.10/matplotlib/mpl-data/stylelib copying lib/matplotlib/mpl-data/stylelib/seaborn-ticks.mplstyle -> build/lib.linux-aarch64-3.10/matplotlib/mpl-data/stylelib copying lib/matplotlib/mpl-data/fonts/pdfcorefonts/Symbol.afm -> build/lib.linux-aarch64-3.10/matplotlib/mpl-data/fonts/pdfcorefonts copying lib/matplotlib/mpl-data/images/matplotlib.pdf -> build/lib.linux-aarch64-3.10/matplotlib/mpl-data/images copying lib/matplotlib/mpl-data/stylelib/seaborn-white.mplstyle -> build/lib.linux-aarch64-3.10/matplotlib/mpl-data/stylelib copying lib/matplotlib/mpl-data/fonts/ttf/STIXGeneralBolIta.ttf -> build/lib.linux-aarch64-3.10/matplotlib/mpl-data/fonts/ttf copying lib/matplotlib/mpl-data/fonts/ttf/DejaVuSerifDisplay.ttf -> build/lib.linux-aarch64-3.10/matplotlib/mpl-data/fonts/ttf copying lib/matplotlib/mpl-data/sample_data/membrane.dat -> build/lib.linux-aarch64-3.10/matplotlib/mpl-data/sample_data creating build/lib.linux-aarch64-3.10/matplotlib/backends/web_backend/js
  1088. copying lib/matplotlib/backends/web_backend/js/nbagg_mpl.js -> build/lib.linux-aarch64-3.10/matplotlib/backends/web_backend/js
  1089. copying lib/matplotlib/mpl-data/images/matplotlib_128.ppm -> build/lib.linux-aarch64-3.10/matplotlib/mpl-data/images
  1090. copying lib/matplotlib/mpl-data/stylelib/fast.mplstyle -> build/lib.linux-aarch64-3.10/matplotlib/mpl-data/stylelib copying lib/matplotlib/mpl-data/fonts/ttf/LICENSE_STIX -> build/lib.linux-aarch64-3.10/matplotlib/mpl-data/fonts/ttf copying lib/matplotlib/mpl-data/fonts/ttf/STIXSizFourSymBol.ttf -> build/lib.linux-aarch64-3.10/matplotlib/mpl-data/fonts/ttf
  1091. copying lib/matplotlib/mpl-data/fonts/pdfcorefonts/Times-BoldItalic.afm -> build/lib.linux-aarch64-3.10/matplotlib/mpl-data/fonts/pdfcorefonts
  1092. creating build/lib.linux-aarch64-3.10/matplotlib/backends/web_backend/css
  1093. copying lib/matplotlib/backends/web_backend/css/fbm.css -> build/lib.linux-aarch64-3.10/matplotlib/backends/web_backend/css
  1094. copying lib/matplotlib/mpl-data/sample_data/s1045.ima.gz -> build/lib.linux-aarch64-3.10/matplotlib/mpl-data/sample_data
  1095. copying lib/matplotlib/mpl-data/fonts/pdfcorefonts/ZapfDingbats.afm -> build/lib.linux-aarch64-3.10/matplotlib/mpl-data/fonts/pdfcorefonts
  1096. copying lib/matplotlib/mpl-data/sample_data/msft.csv -> build/lib.linux-aarch64-3.10/matplotlib/mpl-data/sample_data
  1097. copying lib/matplotlib/mpl-data/stylelib/tableau-colorblind10.mplstyle -> build/lib.linux-aarch64-3.10/matplotlib/mpl-data/stylelib copying lib/matplotlib/backends/web_backend/nbagg_uat.ipynb -> build/lib.linux-aarch64-3.10/matplotlib/backends/web_backend copying lib/matplotlib/mpl-data/stylelib/seaborn-whitegrid.mplstyle -> build/lib.linux-aarch64-3.10/matplotlib/mpl-data/stylelib copying lib/matplotlib/mpl-data/stylelib/classic.mplstyle -> build/lib.linux-aarch64-3.10/matplotlib/mpl-data/stylelib copying lib/matplotlib/backends/web_backend/all_figures.html -> build/lib.linux-aarch64-3.10/matplotlib/backends/web_backend copying lib/matplotlib/mpl-data/images/qt4_editor_options.png -> build/lib.linux-aarch64-3.10/matplotlib/mpl-data/images
  1098. copying lib/matplotlib/mpl-data/stylelib/seaborn-bright.mplstyle -> build/lib.linux-aarch64-3.10/matplotlib/mpl-data/stylelib
  1099. copying lib/matplotlib/mpl-data/stylelib/seaborn-pastel.mplstyle -> build/lib.linux-aarch64-3.10/matplotlib/mpl-data/stylelib
  1100. copying lib/matplotlib/mpl-data/fonts/afm/psyr.afm -> build/lib.linux-aarch64-3.10/matplotlib/mpl-data/fonts/afm
  1101. copying lib/matplotlib/mpl-data/fonts/afm/pzdr.afm -> build/lib.linux-aarch64-3.10/matplotlib/mpl-data/fonts/afm
  1102. copying lib/matplotlib/mpl-data/stylelib/seaborn-poster.mplstyle -> build/lib.linux-aarch64-3.10/matplotlib/mpl-data/stylelib
  1103. copying lib/matplotlib/mpl-data/images/hand.svg -> build/lib.linux-aarch64-3.10/matplotlib/mpl-data/images
  1104. copying lib/matplotlib/mpl-data/images/move.pdf -> build/lib.linux-aarch64-3.10/matplotlib/mpl-data/images
  1105. copying lib/matplotlib/mpl-data/fonts/ttf/STIXNonUni.ttf -> build/lib.linux-aarch64-3.10/matplotlib/mpl-data/fonts/ttf
  1106. copying lib/matplotlib/mpl-data/fonts/pdfcorefonts/Helvetica-Oblique.afm -> build/lib.linux-aarch64-3.10/matplotlib/mpl-data/fonts/pdfcorefonts
  1107. copying lib/matplotlib/backends/web_backend/js/mpl.js -> build/lib.linux-aarch64-3.10/matplotlib/backends/web_backend/js copying lib/matplotlib/mpl-data/fonts/ttf/LICENSE_DEJAVU -> build/lib.linux-aarch64-3.10/matplotlib/mpl-data/fonts/ttf copying lib/matplotlib/mpl-data/images/forward.pdf -> build/lib.linux-aarch64-3.10/matplotlib/mpl-data/images
  1108. copying lib/matplotlib/mpl-data/stylelib/seaborn-colorblind.mplstyle -> build/lib.linux-aarch64-3.10/matplotlib/mpl-data/stylelib
  1109. copying lib/matplotlib/mpl-data/sample_data/logo2.png -> build/lib.linux-aarch64-3.10/matplotlib/mpl-data/sample_data
  1110. copying lib/matplotlib/mpl-data/stylelib/_classic_test_patch.mplstyle -> build/lib.linux-aarch64-3.10/matplotlib/mpl-data/stylelib copying lib/matplotlib/mpl-data/stylelib/seaborn-dark-palette.mplstyle -> build/lib.linux-aarch64-3.10/matplotlib/mpl-data/stylelib
  1111. copying lib/matplotlib/mpl-data/images/forward_large.png -> build/lib.linux-aarch64-3.10/matplotlib/mpl-data/images
  1112. copying lib/matplotlib/mpl-data/stylelib/seaborn.mplstyle -> build/lib.linux-aarch64-3.10/matplotlib/mpl-data/stylelib
  1113. copying lib/matplotlib/mpl-data/fonts/pdfcorefonts/Courier.afm -> build/lib.linux-aarch64-3.10/matplotlib/mpl-data/fonts/pdfcorefonts
  1114. copying lib/matplotlib/mpl-data/stylelib/_mpl-gallery-nogrid.mplstyle -> build/lib.linux-aarch64-3.10/matplotlib/mpl-data/stylelib
  1115. copying lib/matplotlib/mpl-data/images/help.png -> build/lib.linux-aarch64-3.10/matplotlib/mpl-data/images copying lib/matplotlib/mpl-data/images/filesave.pdf -> build/lib.linux-aarch64-3.10/matplotlib/mpl-data/images copying lib/matplotlib/mpl-data/fonts/pdfcorefonts/Times-Bold.afm -> build/lib.linux-aarch64-3.10/matplotlib/mpl-data/fonts/pdfcorefonts copying lib/matplotlib/mpl-data/fonts/afm/phvb8an.afm -> build/lib.linux-aarch64-3.10/matplotlib/mpl-data/fonts/afm
  1116. copying lib/matplotlib/mpl-data/stylelib/ggplot.mplstyle -> build/lib.linux-aarch64-3.10/matplotlib/mpl-data/stylelib
  1117. copying lib/matplotlib/mpl-data/stylelib/seaborn-dark.mplstyle -> build/lib.linux-aarch64-3.10/matplotlib/mpl-data/stylelib copying lib/matplotlib/mpl-data/stylelib/seaborn-deep.mplstyle -> build/lib.linux-aarch64-3.10/matplotlib/mpl-data/stylelib copying lib/matplotlib/mpl-data/stylelib/seaborn-talk.mplstyle -> build/lib.linux-aarch64-3.10/matplotlib/mpl-data/stylelib copying lib/matplotlib/mpl-data/images/help.svg -> build/lib.linux-aarch64-3.10/matplotlib/mpl-data/images copying lib/matplotlib/mpl-data/fonts/pdfcorefonts/Times-Italic.afm -> build/lib.linux-aarch64-3.10/matplotlib/mpl-data/fonts/pdfcorefonts copying lib/matplotlib/backends/web_backend/.prettierrc -> build/lib.linux-aarch64-3.10/matplotlib/backends/web_backend copying lib/matplotlib/backends/web_backend/package.json -> build/lib.linux-aarch64-3.10/matplotlib/backends/web_backend
  1118. copying lib/matplotlib/mpl-data/sample_data/jacksboro_fault_dem.npz -> build/lib.linux-aarch64-3.10/matplotlib/mpl-data/sample_data
  1119. copying lib/matplotlib/mpl-data/fonts/ttf/DejaVuSansMono-Bold.ttf -> build/lib.linux-aarch64-3.10/matplotlib/mpl-data/fonts/ttf copying lib/matplotlib/backends/web_backend/css/mpl.css -> build/lib.linux-aarch64-3.10/matplotlib/backends/web_backend/css
  1120. copying lib/matplotlib/mpl-data/images/back_large.png -> build/lib.linux-aarch64-3.10/matplotlib/mpl-data/images
  1121. copying lib/matplotlib/mpl-data/images/forward-symbolic.svg -> build/lib.linux-aarch64-3.10/matplotlib/mpl-data/images
  1122. copying lib/matplotlib/mpl-data/images/matplotlib.svg -> build/lib.linux-aarch64-3.10/matplotlib/mpl-data/images copying lib/matplotlib/mpl-data/fonts/ttf/STIXSizOneSymReg.ttf -> build/lib.linux-aarch64-3.10/matplotlib/mpl-data/fonts/ttf copying lib/matplotlib/mpl-data/fonts/ttf/STIXSizTwoSymReg.ttf -> build/lib.linux-aarch64-3.10/matplotlib/mpl-data/fonts/ttf copying lib/matplotlib/mpl-data/images/move_large.png -> build/lib.linux-aarch64-3.10/matplotlib/mpl-data/images copying lib/matplotlib/mpl-data/fonts/ttf/DejaVuSans-BoldOblique.ttf -> build/lib.linux-aarch64-3.10/matplotlib/mpl-data/fonts/ttf copying lib/matplotlib/mpl-data/images/qt4_editor_options.pdf -> build/lib.linux-aarch64-3.10/matplotlib/mpl-data/images
  1123. copying lib/matplotlib/backends/web_backend/css/page.css -> build/lib.linux-aarch64-3.10/matplotlib/backends/web_backend/css
  1124. copying lib/matplotlib/mpl-data/fonts/ttf/DejaVuSerif-Italic.ttf -> build/lib.linux-aarch64-3.10/matplotlib/mpl-data/fonts/ttf
  1125. copying lib/matplotlib/mpl-data/images/subplots.pdf -> build/lib.linux-aarch64-3.10/matplotlib/mpl-data/images
  1126. copying lib/matplotlib/mpl-data/stylelib/seaborn-notebook.mplstyle -> build/lib.linux-aarch64-3.10/matplotlib/mpl-data/stylelib
  1127. copying lib/matplotlib/backends/web_backend/.eslintrc.js -> build/lib.linux-aarch64-3.10/matplotlib/backends/web_backend
  1128. copying lib/matplotlib/mpl-data/fonts/pdfcorefonts/Times-Roman.afm -> build/lib.linux-aarch64-3.10/matplotlib/mpl-data/fonts/pdfcorefonts
  1129. copying lib/matplotlib/mpl-data/images/filesave.svg -> build/lib.linux-aarch64-3.10/matplotlib/mpl-data/images
  1130. copying lib/matplotlib/mpl-data/fonts/ttf/DejaVuSansMono-Oblique.ttf -> build/lib.linux-aarch64-3.10/matplotlib/mpl-data/fonts/ttf
  1131. copying lib/matplotlib/mpl-data/fonts/ttf/STIXNonUniBol.ttf -> build/lib.linux-aarch64-3.10/matplotlib/mpl-data/fonts/ttf
  1132. copying lib/matplotlib/mpl-data/fonts/ttf/STIXNonUniIta.ttf -> build/lib.linux-aarch64-3.10/matplotlib/mpl-data/fonts/ttf
  1133. copying lib/matplotlib/mpl-data/fonts/pdfcorefonts/Helvetica-BoldOblique.afm -> build/lib.linux-aarch64-3.10/matplotlib/mpl-data/fonts/pdfcorefonts
  1134. copying lib/matplotlib/mpl-data/images/help.pdf -> build/lib.linux-aarch64-3.10/matplotlib/mpl-data/images
  1135. copying lib/matplotlib/mpl-data/images/matplotlib_large.png -> build/lib.linux-aarch64-3.10/matplotlib/mpl-data/images
  1136. copying lib/matplotlib/backends/web_backend/js/mpl_tornado.js -> build/lib.linux-aarch64-3.10/matplotlib/backends/web_backend/js
  1137. copying lib/matplotlib/mpl-data/images/zoom_to_rect_large.png -> build/lib.linux-aarch64-3.10/matplotlib/mpl-data/images
  1138. copying lib/matplotlib/mpl-data/images/back.svg -> build/lib.linux-aarch64-3.10/matplotlib/mpl-data/images
  1139. copying lib/matplotlib/mpl-data/images/filesave.png -> build/lib.linux-aarch64-3.10/matplotlib/mpl-data/images
  1140. copying lib/matplotlib/mpl-data/fonts/pdfcorefonts/Courier-Oblique.afm -> build/lib.linux-aarch64-3.10/matplotlib/mpl-data/fonts/pdfcorefonts
  1141. copying lib/matplotlib/mpl-data/images/home.svg -> build/lib.linux-aarch64-3.10/matplotlib/mpl-data/images
  1142. copying lib/matplotlib/mpl-data/images/subplots-symbolic.svg -> build/lib.linux-aarch64-3.10/matplotlib/mpl-data/images
  1143. copying lib/matplotlib/mpl-data/stylelib/bmh.mplstyle -> build/lib.linux-aarch64-3.10/matplotlib/mpl-data/stylelib
  1144. copying lib/matplotlib/mpl-data/images/back-symbolic.svg -> build/lib.linux-aarch64-3.10/matplotlib/mpl-data/images
  1145. copying lib/matplotlib/mpl-data/images/hand.pdf -> build/lib.linux-aarch64-3.10/matplotlib/mpl-data/images
  1146. copying lib/matplotlib/mpl-data/stylelib/_mpl-gallery.mplstyle -> build/lib.linux-aarch64-3.10/matplotlib/mpl-data/stylelib
  1147. copying lib/matplotlib/mpl-data/images/zoom_to_rect-symbolic.svg -> build/lib.linux-aarch64-3.10/matplotlib/mpl-data/images
  1148. copying lib/matplotlib/mpl-data/fonts/afm/pncbi8a.afm -> build/lib.linux-aarch64-3.10/matplotlib/mpl-data/fonts/afm
  1149. copying lib/matplotlib/mpl-data/fonts/afm/pncri8a.afm -> build/lib.linux-aarch64-3.10/matplotlib/mpl-data/fonts/afm
  1150. copying lib/matplotlib/mpl-data/fonts/afm/pplbi8a.afm -> build/lib.linux-aarch64-3.10/matplotlib/mpl-data/fonts/afm
  1151. copying lib/matplotlib/mpl-data/fonts/afm/pplri8a.afm -> build/lib.linux-aarch64-3.10/matplotlib/mpl-data/fonts/afm
  1152. copying lib/matplotlib/mpl-data/fonts/afm/ptmbi8a.afm -> build/lib.linux-aarch64-3.10/matplotlib/mpl-data/fonts/afm
  1153. copying lib/matplotlib/mpl-data/fonts/afm/ptmri8a.afm -> build/lib.linux-aarch64-3.10/matplotlib/mpl-data/fonts/afm
  1154. copying lib/matplotlib/mpl-data/fonts/afm/putbi8a.afm -> build/lib.linux-aarch64-3.10/matplotlib/mpl-data/fonts/afm
  1155. copying lib/matplotlib/mpl-data/fonts/afm/putri8a.afm -> build/lib.linux-aarch64-3.10/matplotlib/mpl-data/fonts/afm
  1156. copying lib/matplotlib/mpl-data/fonts/afm/pagdo8a.afm -> build/lib.linux-aarch64-3.10/matplotlib/mpl-data/fonts/afm
  1157. copying lib/matplotlib/mpl-data/fonts/afm/pagko8a.afm -> build/lib.linux-aarch64-3.10/matplotlib/mpl-data/fonts/afm copying lib/matplotlib/mpl-data/fonts/ttf/DejaVuSansMono.ttf -> build/lib.linux-aarch64-3.10/matplotlib/mpl-data/fonts/ttf copying lib/matplotlib/mpl-data/images/forward.png -> build/lib.linux-aarch64-3.10/matplotlib/mpl-data/images
  1158. copying lib/matplotlib/mpl-data/sample_data/Minduka_Present_Blue_Pack.png -> build/lib.linux-aarch64-3.10/matplotlib/mpl-data/sample_data
  1159. copying lib/matplotlib/mpl-data/images/home.png -> build/lib.linux-aarch64-3.10/matplotlib/mpl-data/images
  1160. copying lib/matplotlib/mpl-data/fonts/ttf/DejaVuSerif-Bold.ttf -> build/lib.linux-aarch64-3.10/matplotlib/mpl-data/fonts/ttf
  1161. copying lib/matplotlib/mpl-data/fonts/ttf/STIXNonUniBolIta.ttf -> build/lib.linux-aarch64-3.10/matplotlib/mpl-data/fonts/ttf copying lib/matplotlib/backends/web_backend/css/boilerplate.css -> build/lib.linux-aarch64-3.10/matplotlib/backends/web_backend/css copying lib/matplotlib/mpl-data/images/back.png -> build/lib.linux-aarch64-3.10/matplotlib/mpl-data/images copying lib/matplotlib/mpl-data/images/subplots.png -> build/lib.linux-aarch64-3.10/matplotlib/mpl-data/images
  1162. copying lib/matplotlib/mpl-data/fonts/pdfcorefonts/Helvetica.afm -> build/lib.linux-aarch64-3.10/matplotlib/mpl-data/fonts/pdfcorefonts
  1163. copying lib/matplotlib/mpl-data/sample_data/embedding_in_wx3.xrc -> build/lib.linux-aarch64-3.10/matplotlib/mpl-data/sample_data
  1164. copying lib/matplotlib/mpl-data/fonts/pdfcorefonts/Courier-BoldOblique.afm -> build/lib.linux-aarch64-3.10/matplotlib/mpl-data/fonts/pdfcorefonts copying lib/matplotlib/mpl-data/fonts/afm/phvr8an.afm -> build/lib.linux-aarch64-3.10/matplotlib/mpl-data/fonts/afm running build_ext
  1165. aarch64-linux-android-clang -Wno-unused-result -Wsign-compare -Wunreachable-code -DNDEBUG -g -fwrapv -O3 -Wall -fstack-protector-strong -O3 -fstack-protector-strong -O3 -fPIC -I/data/data/com.termux/files/usr/include/python3.10 -c /data/data/com.termux/files/usr/tmp/tmpobwktl4p.cpp -o data/data/com.termux/files/usr/tmp/tmpobwktl4p.o -fvisibility=hidden aarch64-linux-android-clang -Wno-unused-result -Wsign-compare -Wunreachable-code -DNDEBUG -g -fwrapv -O3 -Wall -fstack-protector-strong -O3 -fstack-protector-strong -O3 -fPIC -I/data/data/com.termux/files/usr/include/python3.10 -c /data/data/com.termux/files/usr/tmp/tmpqea7ipss.cpp -o data/data/com.termux/files/usr/tmp/tmpqea7ipss.o -fvisibility-inlines-hidden aarch64-linux-android-clang -Wno-unused-result -Wsign-compare -Wunreachable-code -DNDEBUG -g -fwrapv -O3 -Wall -fstack-protector-strong -O3 -fstack-protector-strong -O3 -fPIC -I/data/data/com.termux/files/usr/include/python3.10 -c /data/data/com.termux/files/usr/tmp/tmphsnqj_r8.cpp -o data/data/com.termux/files/usr/tmp/tmphsnqj_r8.o -flto
  1166. Building freetype in build/freetype-2.6.1
  1167. FreeType build system -- automatic system detection
  1168. The following settings are used:
  1169. platform unix compiler aarch64-linux-android-clang
  1170. configuration directory ./builds/unix configuration rules ./builds/unix/unix.mk
  1171. If this does not correspond to your system or settings please remove the file `config.mk' from this directory then read the INSTALL file for help.
  1172. Otherwise, simply type `make' again to build the library,
  1173. or `make refdoc' to build the API reference (this needs python >= 2.6).
  1174. cd builds/unix; \ ./configure '--with-zlib=no' '--with-bzip2=no' '--with-png=no' '--with-harfbuzz=no' '--enable-static' '--disable-shared' '--host=x86_64-pc-linux-gnu'
  1175. checking build system type... aarch64-unknown-linux-gnu checking host system type... x86_64-pc-linux-gnu
  1176. checking for x86_64-pc-linux-gnu-gcc... aarch64-linux-android-clang checking whether the C compiler works... yes
  1177. checking for C compiler default output file name... a.out checking for suffix of executables...
  1178. checking whether we are cross compiling... no checking for suffix of object files... o
  1179. checking whether we are using the GNU C compiler... yes checking whether aarch64-linux-android-clang accepts -g... yes
  1180. checking for aarch64-linux-android-clang option to accept ISO C89... none needed
  1181. checking how to run the C preprocessor... aarch64-linux-android-clang -E checking for x86_64-pc-linux-gnu-pkg-config... no
  1182. checking for pkg-config... /data/data/com.termux/files/usr/bin/pkg-config
  1183. checking pkg-config is at least version 0.24... yes checking how to print strings... printf
  1184. checking for a sed that does not truncate output... /data/data/com.termux/files/usr/bin/sed
  1185. checking for grep that handles long lines and -e... /data/data/com.termux/files/usr/bin/grep
  1186. checking for egrep... /data/data/com.termux/files/usr/bin/grep -E checking for fgrep... /data/data/com.termux/files/usr/bin/grep -F
  1187. checking for ld used by aarch64-linux-android-clang... no configure: error: no acceptable ld found in $PATH
  1188. make: *** [builds/unix/detect.mk:85: setup] Error 1 Traceback (most recent call last):
  1189. File "<string>", line 1, in <module> File "/data/data/com.termux/files/usr/tmp/pip-install-6blmn66o/matplotlib_7913b26a186a4b01aa892bdc340c4faa/setup.py", line 273, in <module> setup( # Finally, pass this all along to setuptools to do the heavy lifting. File "/data/data/com.termux/files/usr/lib/python3.10/site-packages/setuptools/__init__.py", line 153, in setup return distutils.core.setup(**attrs)
  1190. File "/data/data/com.termux/files/usr/lib/python3.10/distutils/core.py", line 148, in setup
  1191. dist.run_commands() File "/data/data/com.termux/files/usr/lib/python3.10/distutils/dist.py", line 966, in run_commands self.run_command(cmd)
  1192. File "/data/data/com.termux/files/usr/lib/python3.10/distutils/dist.py", line 985, in run_command
  1193. cmd_obj.run() File "/data/data/com.termux/files/usr/lib/python3.10/site-packages/setuptools/command/install.py", line 61, in run return orig.install.run(self)
  1194. File "/data/data/com.termux/files/usr/lib/python3.10/distutils/command/install.py", line 568, in run
  1195. self.run_command('build') File "/data/data/com.termux/files/usr/lib/python3.10/distutils/cmd.py", line 313, in run_command self.distribution.run_command(command)
  1196. File "/data/data/com.termux/files/usr/lib/python3.10/distutils/dist.py", line 985, in run_command
  1197. cmd_obj.run() File "/data/data/com.termux/files/usr/lib/python3.10/distutils/command/build.py", line 135, in run self.run_command(cmd_name)
  1198. File "/data/data/com.termux/files/usr/lib/python3.10/distutils/cmd.py", line 313, in run_command
  1199. self.distribution.run_command(command) File "/data/data/com.termux/files/usr/lib/python3.10/distutils/dist.py", line 985, in run_command cmd_obj.run()
  1200. File "/data/data/com.termux/files/usr/lib/python3.10/site-packages/setuptools/command/build_ext.py", line 79, in run
  1201. _build_ext.run(self) File "/data/data/com.termux/files/usr/lib/python3.10/distutils/command/build_ext.py", line 340, in run self.build_extensions()
  1202. File "/data/data/com.termux/files/usr/tmp/pip-install-6blmn66o/matplotlib_7913b26a186a4b01aa892bdc340c4faa/setup.py", line 187, in build_extensions package.do_custom_build(env)
  1203. File "/data/data/com.termux/files/usr/tmp/pip-install-6blmn66o/matplotlib_7913b26a186a4b01aa892bdc340c4faa/setupext.py", line 631, in do_custom_build subprocess.check_call(configure, env=env, cwd=src_path)
  1204. File "/data/data/com.termux/files/usr/lib/python3.10/subprocess.py", line 369, in check_call
  1205. raise CalledProcessError(retcode, cmd) subprocess.CalledProcessError: Command '['./configure', '--with-zlib=no', '--with-bzip2=no', '--with-png=no', '--with-harfbuzz=no', '--enable-static', '--disable-shared', '--host=x86_64-pc-linux-gnu']' returned non-zero exit status 2. ----------------------------------------
  1206. ERROR: Command errored out with exit status 1: /data/data/com.termux/files/usr/bin/python3 -u -c 'import io, os, sys, setuptools, tokenize; sys.argv[0] = '"'"'/data/data/com.termux/files/usr/tmp/pip-install-6blmn66o/matplotlib_7913b26a186a4b01aa892bdc340c4faa/setup.py'"'"'; __file__='"'"'/data/data/com.termux/files/usr/tmp/pip-install-6blmn66o/matplotlib_7913b26a186a4b01aa892bdc340c4faa/setup.py'"'"';f = getattr(tokenize, '"'"'open'"'"', open)(__file__) if os.path.exists(__file__) else io.StringIO('"'"'from setuptools import setup; setup()'"'"');code = f.read().replace('"'"'\r\n'"'"', '"'"'\n'"'"');f.close();exec(compile(code, __file__, '"'"'exec'"'"'))' install --record /data/data/com.termux/files/usr/tmp/pip-record-083a3bxb/install-record.txt --single-version-externally-managed --compile --install-headers /data/data/com.termux/files/usr/include/python3.10/matplotlib Check the logs for full command output.
Advertisement
Advertisement
Advertisement
RAW Paste Data Copied
Advertisement