SHARE
TWEET

Untitled

a guest Jan 8th, 2013 5 Never
Not a member of Pastebin yet? Sign Up, it unlocks many cool features!
  1. Test Summary
  2. Sims Not Finishing: 0
  3. Tests Passed: 897
  4. Tests Failed: 4
  5. Tests Errored: 91
  6.  
  7. Relative error tolerance: 1e-3
  8. Bitwise tests not included
  9.  
  10.  
  11. Tests that passed:
  12. OneZoneFreefallTest__test_freefall.test_freefall: PASS
  13. OneZoneFreefallTest__test_freefall.test_freefall: PASS
  14. OneZoneFreefallTest__test_standard.test_exist: PASS
  15. OneZoneFreefallTest__test_standard.test_standard: PASS
  16. OneZoneFreefallTest__test_standard.test_standard: PASS
  17. OneZoneFreefallTest__test_standard.test_standard: PASS
  18. OneZoneFreefallTest__test_standard.test_standard: PASS
  19. OneZoneFreefallTest__test_standard.test_standard: PASS
  20. OneZoneFreefallTest__test_standard.test_standard: PASS
  21. OneZoneFreefallTest__test_standard.test_standard: PASS
  22. OneZoneFreefallTest__test_standard.test_standard: PASS
  23. OneZoneFreefallTest__test_standard.test_standard: PASS
  24. OneZoneFreefallTest__test_standard.test_standard: PASS
  25. OneZoneFreefallTest__test_standard.test_standard: PASS
  26. OneZoneFreefallTest__test_standard.test_standard: PASS
  27. OneZoneFreefallTest__test_standard.test_standard: PASS
  28. OneZoneFreefallTest__test_standard.test_standard: PASS
  29. OneZoneFreefallTest__test_standard.test_standard: PASS
  30. OneZoneFreefallTest__test_standard.test_standard: PASS
  31. OneZoneFreefallTest__test_standard.test_standard: PASS
  32. OneZoneFreefallTest__test_standard.test_standard: PASS
  33. OneZoneFreefallTest__test_standard.test_standard: PASS
  34. OneZoneFreefallTest__test_standard.test_standard: PASS
  35. OneZoneFreefallTest__test_standard.test_standard: PASS
  36. OneZoneFreefallTest__test_standard.test_standard: PASS
  37. AMRZeldovichPancake__test_almost_standard.test_exist: PASS
  38. AMRZeldovichPancake__test_almost_standard.test_standard: PASS
  39. AMRZeldovichPancake__test_almost_standard.test_standard: PASS
  40. AMRZeldovichPancake__test_almost_standard.test_standard: PASS
  41. AMRZeldovichPancake__test_almost_standard.test_standard: PASS
  42. AMRZeldovichPancake__test_almost_standard.test_standard: PASS
  43. AMRZeldovichPancake__test_almost_standard.test_standard: PASS
  44. AMRZeldovichPancake__test_almost_standard.test_standard: PASS
  45. AMRZeldovichPancake__test_almost_standard.test_standard: PASS
  46. AdiabaticExpansion__test_standard.test_exist: PASS
  47. MHDZeldovichPancake__test_standard.test_exist: PASS
  48. ZeldovichPancake__test_almost_standard.test_exist: PASS
  49. GravityTest__test_gravity.test_gravity_test: PASS
  50. GravityTestSphere__test_standard.test_exist: PASS
  51. GravityTestSphere__test_standard.test_standard: PASS
  52. GravityTestSphere__test_standard.test_standard: PASS
  53. GravityTestSphere__test_standard.test_standard: PASS
  54. GravityTestSphere__test_standard.test_standard: PASS
  55. GravityTestSphere__test_standard.test_standard: PASS
  56. GravityTestSphere__test_standard.test_standard: PASS
  57. GravityTestSphere__test_standard.test_standard: PASS
  58. GravityTestSphere__test_standard.test_standard: PASS
  59. GravityTestSphere__test_standard.test_standard: PASS
  60. GravityTestSphere__test_standard.test_standard: PASS
  61. GravityTestSphere__test_standard.test_standard: PASS
  62. GravityTestSphere__test_standard.test_standard: PASS
  63. GravityTestSphere__test_standard.test_standard: PASS
  64. GravityTestSphere__test_standard.test_standard: PASS
  65. GravityTestSphere__test_standard.test_standard: PASS
  66. GravityTestSphere__test_standard.test_standard: PASS
  67. GravityTestSphere__test_standard.test_standard: PASS
  68. GravityTestSphere__test_standard.test_standard: PASS
  69. GravityTestSphere__test_standard.test_standard: PASS
  70. GravityTestSphere__test_standard.test_standard: PASS
  71. GravityTestSphere__test_standard.test_standard: PASS
  72. GravityTestSphere__test_standard.test_standard: PASS
  73. GravityTestSphere__test_standard.test_standard: PASS
  74. GravityTestSphere__test_standard.test_standard: PASS
  75. GravityTestSphere__test_standard.test_standard: PASS
  76. GravityTestSphere__test_standard.test_standard: PASS
  77. GravityTestSphere__test_standard.test_standard: PASS
  78. GravityTestSphere__test_standard.test_standard: PASS
  79. GravityTestSphere__test_standard.test_standard: PASS
  80. TestOrbit__test_orbit.test_orbit: PASS
  81. TestOrbit__test_orbit.test_orbit: PASS
  82. TestOrbit__test_standard.test_exist: PASS
  83. TestOrbit__test_standard.test_standard: PASS
  84. FreeExpansion__test_free_expansion.test_collapse_max_value: PASS
  85. FreeExpansion__test_standard.test_exist: PASS
  86. FreeExpansion__test_standard.test_standard: PASS
  87. FreeExpansion__test_standard.test_standard: PASS
  88. FreeExpansion__test_standard.test_standard: PASS
  89. FreeExpansion__test_standard.test_standard: PASS
  90. FreeExpansion__test_standard.test_standard: PASS
  91. FreeExpansion__test_standard.test_standard: PASS
  92. FreeExpansion__test_standard.test_standard: PASS
  93. FreeExpansion__test_standard.test_standard: PASS
  94. FreeExpansion__test_standard.test_standard: PASS
  95. FreeExpansion__test_standard.test_standard: PASS
  96. FreeExpansion__test_standard.test_standard: PASS
  97. FreeExpansion__test_standard.test_standard: PASS
  98. FreeExpansion__test_standard.test_standard: PASS
  99. FreeExpansion__test_standard.test_standard: PASS
  100. FreeExpansion__test_standard.test_standard: PASS
  101. FreeExpansion__test_standard.test_standard: PASS
  102. FreeExpansion__test_standard.test_standard: PASS
  103. FreeExpansion__test_standard.test_standard: PASS
  104. FreeExpansion__test_standard.test_standard: PASS
  105. FreeExpansion__test_standard.test_standard: PASS
  106. FreeExpansion__test_standard.test_standard: PASS
  107. FreeExpansion__test_standard.test_standard: PASS
  108. FreeExpansion__test_standard.test_standard: PASS
  109. FreeExpansion__test_standard.test_standard: PASS
  110. FreeExpansion__test_standard.test_standard: PASS
  111. FreeExpansion__test_standard.test_standard: PASS
  112. FreeExpansion__test_standard.test_standard: PASS
  113. FreeExpansion__test_standard.test_standard: PASS
  114. FreeExpansion__test_standard.test_standard: PASS
  115. InteractingBlastWaves__test_standard.test_exist: PASS
  116. InteractingBlastWaves__test_standard.test_standard: PASS
  117. InteractingBlastWaves__test_standard.test_standard: PASS
  118. InteractingBlastWaves__test_standard.test_standard: PASS
  119. InteractingBlastWaves__test_standard.test_standard: PASS
  120. InteractingBlastWaves__test_standard.test_standard: PASS
  121. InteractingBlastWaves__test_standard.test_standard: PASS
  122. InteractingBlastWaves__test_standard.test_standard: PASS
  123. InteractingBlastWaves__test_standard.test_standard: PASS
  124. InteractingBlastWaves__test_standard.test_standard: PASS
  125. InteractingBlastWaves__test_standard.test_standard: PASS
  126. InteractingBlastWaves__test_standard.test_standard: PASS
  127. InteractingBlastWaves__test_standard.test_standard: PASS
  128. InteractingBlastWaves__test_standard.test_standard: PASS
  129. InteractingBlastWaves__test_standard.test_standard: PASS
  130. InteractingBlastWaves__test_standard.test_standard: PASS
  131. InteractingBlastWaves__test_standard.test_standard: PASS
  132. InteractingBlastWaves__test_standard.test_standard: PASS
  133. InteractingBlastWaves__test_standard.test_standard: PASS
  134. InteractingBlastWaves__test_standard.test_standard: PASS
  135. InteractingBlastWaves__test_standard.test_standard: PASS
  136. InteractingBlastWaves__test_standard.test_standard: PASS
  137. InteractingBlastWaves__test_standard.test_standard: PASS
  138. InteractingBlastWaves__test_standard.test_standard: PASS
  139. InteractingBlastWaves__test_standard.test_standard: PASS
  140. InteractingBlastWaves__test_standard.test_standard: PASS
  141. InteractingBlastWaves__test_standard.test_standard: PASS
  142. InteractingBlastWaves__test_standard.test_standard: PASS
  143. InteractingBlastWaves__test_standard.test_standard: PASS
  144. InteractingBlastWaves__test_standard.test_standard: PASS
  145. PressurelessCollapse__test_standard.test_exist: PASS
  146. PressurelessCollapse__test_standard.test_standard: PASS
  147. PressurelessCollapse__test_standard.test_standard: PASS
  148. PressurelessCollapse__test_standard.test_standard: PASS
  149. PressurelessCollapse__test_standard.test_standard: PASS
  150. PressurelessCollapse__test_standard.test_standard: PASS
  151. PressurelessCollapse__test_standard.test_standard: PASS
  152. PressurelessCollapse__test_standard.test_standard: PASS
  153. PressurelessCollapse__test_standard.test_standard: PASS
  154. PressurelessCollapse__test_standard.test_standard: PASS
  155. PressurelessCollapse__test_standard.test_standard: PASS
  156. PressurelessCollapse__test_standard.test_standard: PASS
  157. PressurelessCollapse__test_standard.test_standard: PASS
  158. PressurelessCollapse__test_standard.test_standard: PASS
  159. PressurelessCollapse__test_standard.test_standard: PASS
  160. PressurelessCollapse__test_standard.test_standard: PASS
  161. SodShockTube__test_sod.test_sod: PASS
  162. SodShockTube__test_sod.test_sod: PASS
  163. SodShockTube__test_sod.test_sod: PASS
  164. SodShockTube__test_sod.test_sod: PASS
  165. SodShockTube__test_standard.test_exist: PASS
  166. SodShockTube__test_standard.test_standard: PASS
  167. SodShockTube__test_standard.test_standard: PASS
  168. SodShockTube__test_standard.test_standard: PASS
  169. SodShockTube__test_standard.test_standard: PASS
  170. SodShockTube__test_standard.test_standard: PASS
  171. SodShockTube__test_standard.test_standard: PASS
  172. SodShockTube__test_standard.test_standard: PASS
  173. SodShockTube__test_standard.test_standard: PASS
  174. SodShockTube__test_standard.test_standard: PASS
  175. SodShockTube__test_standard.test_standard: PASS
  176. SodShockTube__test_standard.test_standard: PASS
  177. SodShockTube__test_standard.test_standard: PASS
  178. SodShockTube__test_standard.test_standard: PASS
  179. SodShockTube__test_standard.test_standard: PASS
  180. SodShockTube__test_standard.test_standard: PASS
  181. SodShockTube__test_standard.test_standard: PASS
  182. SodShockTube__test_standard.test_standard: PASS
  183. SodShockTube__test_standard.test_standard: PASS
  184. SodShockTube__test_standard.test_standard: PASS
  185. SodShockTube__test_standard.test_standard: PASS
  186. SodShockTube__test_standard.test_standard: PASS
  187. SodShockTube__test_standard.test_standard: PASS
  188. SodShockTube__test_standard.test_standard: PASS
  189. SodShockTube__test_standard.test_standard: PASS
  190. SodShockTube__test_standard.test_standard: PASS
  191. SodShockTube__test_standard.test_standard: PASS
  192. SodShockTube__test_standard.test_standard: PASS
  193. SodShockTube__test_standard.test_standard: PASS
  194. SodShockTube__test_standard.test_standard: PASS
  195. Toro-1-ShockTube__test_standard.test_exist: PASS
  196. Toro-1-ShockTube__test_standard.test_standard: PASS
  197. Toro-1-ShockTube__test_standard.test_standard: PASS
  198. Toro-1-ShockTube__test_standard.test_standard: PASS
  199. Toro-1-ShockTube__test_standard.test_standard: PASS
  200. Toro-1-ShockTube__test_standard.test_standard: PASS
  201. Toro-1-ShockTube__test_standard.test_standard: PASS
  202. Toro-1-ShockTube__test_standard.test_standard: PASS
  203. Toro-1-ShockTube__test_standard.test_standard: PASS
  204. Toro-1-ShockTube__test_standard.test_standard: PASS
  205. Toro-1-ShockTube__test_standard.test_standard: PASS
  206. Toro-1-ShockTube__test_standard.test_standard: PASS
  207. Toro-1-ShockTube__test_standard.test_standard: PASS
  208. Toro-1-ShockTube__test_standard.test_standard: PASS
  209. Toro-1-ShockTube__test_standard.test_standard: PASS
  210. Toro-1-ShockTube__test_standard.test_standard: PASS
  211. Toro-1-ShockTube__test_standard.test_standard: PASS
  212. Toro-1-ShockTube__test_standard.test_standard: PASS
  213. Toro-1-ShockTube__test_standard.test_standard: PASS
  214. Toro-1-ShockTube__test_standard.test_standard: PASS
  215. Toro-1-ShockTube__test_standard.test_standard: PASS
  216. Toro-1-ShockTube__test_standard.test_standard: PASS
  217. Toro-1-ShockTube__test_standard.test_standard: PASS
  218. Toro-1-ShockTube__test_standard.test_standard: PASS
  219. Toro-1-ShockTube__test_standard.test_standard: PASS
  220. Toro-1-ShockTube__test_standard.test_standard: PASS
  221. Toro-1-ShockTube__test_standard.test_standard: PASS
  222. Toro-1-ShockTube__test_standard.test_standard: PASS
  223. Toro-1-ShockTube__test_standard.test_standard: PASS
  224. Toro-1-ShockTube__test_standard.test_standard: PASS
  225. Toro-1-ShockTube__test_toro1.test_toro1: PASS
  226. Toro-1-ShockTube__test_toro1.test_toro1: PASS
  227. Toro-1-ShockTube__test_toro1.test_toro1: PASS
  228. Toro-1-ShockTube__test_toro1.test_toro1: PASS
  229. Toro-1-ShockTube__test_toro1.test_toro1: PASS
  230. Toro-1-ShockTube__test_toro1.test_toro1: PASS
  231. Toro-1-ShockTube__test_toro1.test_toro1: PASS
  232. Toro-1-ShockTube__test_toro1.test_toro1: PASS
  233. Toro-1-ShockTubeAMR__test_standard.test_exist: PASS
  234. Toro-1-ShockTubeAMR__test_standard.test_standard: PASS
  235. Toro-1-ShockTubeAMR__test_standard.test_standard: PASS
  236. Toro-1-ShockTubeAMR__test_standard.test_standard: PASS
  237. Toro-1-ShockTubeAMR__test_standard.test_standard: PASS
  238. Toro-1-ShockTubeAMR__test_standard.test_standard: PASS
  239. Toro-1-ShockTubeAMR__test_standard.test_standard: PASS
  240. Toro-1-ShockTubeAMR__test_standard.test_standard: PASS
  241. Toro-1-ShockTubeAMR__test_standard.test_standard: PASS
  242. Toro-1-ShockTubeAMR__test_standard.test_standard: PASS
  243. Toro-1-ShockTubeAMR__test_standard.test_standard: PASS
  244. Toro-1-ShockTubeAMR__test_standard.test_standard: PASS
  245. Toro-1-ShockTubeAMR__test_standard.test_standard: PASS
  246. Toro-1-ShockTubeAMR__test_standard.test_standard: PASS
  247. Toro-1-ShockTubeAMR__test_standard.test_standard: PASS
  248. Toro-1-ShockTubeAMR__test_standard.test_standard: PASS
  249. Toro-1-ShockTubeAMR__test_standard.test_standard: PASS
  250. Toro-1-ShockTubeAMR__test_standard.test_standard: PASS
  251. Toro-1-ShockTubeAMR__test_standard.test_standard: PASS
  252. Toro-1-ShockTubeAMR__test_standard.test_standard: PASS
  253. Toro-1-ShockTubeAMR__test_standard.test_standard: PASS
  254. Toro-1-ShockTubeAMR__test_standard.test_standard: PASS
  255. Toro-1-ShockTubeAMR__test_standard.test_standard: PASS
  256. Toro-1-ShockTubeAMR__test_standard.test_standard: PASS
  257. Toro-1-ShockTubeAMR__test_standard.test_standard: PASS
  258. Toro-1-ShockTubeAMR__test_standard.test_standard: PASS
  259. Toro-1-ShockTubeAMR__test_standard.test_standard: PASS
  260. Toro-1-ShockTubeAMR__test_standard.test_standard: PASS
  261. Toro-1-ShockTubeAMR__test_standard.test_standard: PASS
  262. Toro-1-ShockTubeAMR__test_standard.test_standard: PASS
  263. Toro-1-ShockTubeAMR__test_toro1_amr.test_toro1_amr: PASS
  264. Toro-1-ShockTubeAMR__test_toro1_amr.test_toro1_amr: PASS
  265. Toro-1-ShockTubeAMR__test_toro1_amr.test_toro1_amr: PASS
  266. Toro-1-ShockTubeAMR__test_toro1_amr.test_toro1_amr: PASS
  267. Toro-1-ShockTubeAMR__test_toro1_amr.test_toro1_amr: PASS
  268. Toro-1-ShockTubeAMR__test_toro1_amr.test_toro1_amr: PASS
  269. Toro-1-ShockTubeAMR__test_toro1_amr.test_toro1_amr: PASS
  270. Toro-1-ShockTubeAMR__test_toro1_amr.test_toro1_amr: PASS
  271. Toro-2-ShockTube__test_standard.test_exist: PASS
  272. Toro-2-ShockTube__test_standard.test_standard: PASS
  273. Toro-2-ShockTube__test_standard.test_standard: PASS
  274. Toro-2-ShockTube__test_standard.test_standard: PASS
  275. Toro-2-ShockTube__test_standard.test_standard: PASS
  276. Toro-2-ShockTube__test_standard.test_standard: PASS
  277. Toro-2-ShockTube__test_standard.test_standard: PASS
  278. Toro-2-ShockTube__test_standard.test_standard: PASS
  279. Toro-2-ShockTube__test_standard.test_standard: PASS
  280. Toro-2-ShockTube__test_standard.test_standard: PASS
  281. Toro-2-ShockTube__test_standard.test_standard: PASS
  282. Toro-2-ShockTube__test_standard.test_standard: PASS
  283. Toro-2-ShockTube__test_standard.test_standard: PASS
  284. Toro-2-ShockTube__test_standard.test_standard: PASS
  285. Toro-2-ShockTube__test_standard.test_standard: PASS
  286. Toro-2-ShockTube__test_standard.test_standard: PASS
  287. Toro-2-ShockTube__test_standard.test_standard: PASS
  288. Toro-2-ShockTube__test_standard.test_standard: PASS
  289. Toro-2-ShockTube__test_standard.test_standard: PASS
  290. Toro-2-ShockTube__test_standard.test_standard: PASS
  291. Toro-2-ShockTube__test_standard.test_standard: PASS
  292. Toro-2-ShockTube__test_standard.test_standard: PASS
  293. Toro-2-ShockTube__test_standard.test_standard: PASS
  294. Toro-2-ShockTube__test_standard.test_standard: PASS
  295. Toro-2-ShockTube__test_standard.test_standard: PASS
  296. Toro-2-ShockTube__test_standard.test_standard: PASS
  297. Toro-2-ShockTube__test_standard.test_standard: PASS
  298. Toro-2-ShockTube__test_standard.test_standard: PASS
  299. Toro-2-ShockTube__test_standard.test_standard: PASS
  300. Toro-2-ShockTube__test_standard.test_standard: PASS
  301. Toro-2-ShockTube__test_toro2.test_toro2: PASS
  302. Toro-2-ShockTube__test_toro2.test_toro2: PASS
  303. Toro-2-ShockTube__test_toro2.test_toro2: PASS
  304. Toro-2-ShockTube__test_toro2.test_toro2: PASS
  305. Toro-2-ShockTubeAMR__test_standard.test_exist: PASS
  306. Toro-2-ShockTubeAMR__test_standard.test_standard: PASS
  307. Toro-2-ShockTubeAMR__test_standard.test_standard: PASS
  308. Toro-2-ShockTubeAMR__test_standard.test_standard: PASS
  309. Toro-2-ShockTubeAMR__test_standard.test_standard: PASS
  310. Toro-2-ShockTubeAMR__test_standard.test_standard: PASS
  311. Toro-2-ShockTubeAMR__test_standard.test_standard: PASS
  312. Toro-2-ShockTubeAMR__test_standard.test_standard: PASS
  313. Toro-2-ShockTubeAMR__test_standard.test_standard: PASS
  314. Toro-2-ShockTubeAMR__test_standard.test_standard: PASS
  315. Toro-2-ShockTubeAMR__test_standard.test_standard: PASS
  316. Toro-2-ShockTubeAMR__test_standard.test_standard: PASS
  317. Toro-2-ShockTubeAMR__test_standard.test_standard: PASS
  318. Toro-2-ShockTubeAMR__test_standard.test_standard: PASS
  319. Toro-2-ShockTubeAMR__test_standard.test_standard: PASS
  320. Toro-2-ShockTubeAMR__test_standard.test_standard: PASS
  321. Toro-2-ShockTubeAMR__test_standard.test_standard: PASS
  322. Toro-2-ShockTubeAMR__test_standard.test_standard: PASS
  323. Toro-2-ShockTubeAMR__test_standard.test_standard: PASS
  324. Toro-2-ShockTubeAMR__test_standard.test_standard: PASS
  325. Toro-2-ShockTubeAMR__test_standard.test_standard: PASS
  326. Toro-2-ShockTubeAMR__test_standard.test_standard: PASS
  327. Toro-2-ShockTubeAMR__test_standard.test_standard: PASS
  328. Toro-2-ShockTubeAMR__test_standard.test_standard: PASS
  329. Toro-2-ShockTubeAMR__test_standard.test_standard: PASS
  330. Toro-2-ShockTubeAMR__test_standard.test_standard: PASS
  331. Toro-2-ShockTubeAMR__test_standard.test_standard: PASS
  332. Toro-2-ShockTubeAMR__test_standard.test_standard: PASS
  333. Toro-2-ShockTubeAMR__test_standard.test_standard: PASS
  334. Toro-2-ShockTubeAMR__test_standard.test_standard: PASS
  335. Toro-2-ShockTubeAMR__test_toro2_amr.test_toro2_amr: PASS
  336. Toro-2-ShockTubeAMR__test_toro2_amr.test_toro2_amr: PASS
  337. Toro-2-ShockTubeAMR__test_toro2_amr.test_toro2_amr: PASS
  338. Toro-2-ShockTubeAMR__test_toro2_amr.test_toro2_amr: PASS
  339. Toro-2-ShockTubeAMR__test_toro2_amr.test_toro2_amr: PASS
  340. Toro-2-ShockTubeAMR__test_toro2_amr.test_toro2_amr: PASS
  341. Toro-2-ShockTubeAMR__test_toro2_amr.test_toro2_amr: PASS
  342. Toro-2-ShockTubeAMR__test_toro2_amr.test_toro2_amr: PASS
  343. Toro-3-ShockTube__test_standard.test_exist: PASS
  344. Toro-3-ShockTube__test_standard.test_standard: PASS
  345. Toro-3-ShockTube__test_standard.test_standard: PASS
  346. Toro-3-ShockTube__test_standard.test_standard: PASS
  347. Toro-3-ShockTube__test_standard.test_standard: PASS
  348. Toro-3-ShockTube__test_standard.test_standard: PASS
  349. Toro-3-ShockTube__test_standard.test_standard: PASS
  350. Toro-3-ShockTube__test_standard.test_standard: PASS
  351. Toro-3-ShockTube__test_standard.test_standard: PASS
  352. Toro-3-ShockTube__test_standard.test_standard: PASS
  353. Toro-3-ShockTube__test_standard.test_standard: PASS
  354. Toro-3-ShockTube__test_standard.test_standard: PASS
  355. Toro-3-ShockTube__test_standard.test_standard: PASS
  356. Toro-3-ShockTube__test_standard.test_standard: PASS
  357. Toro-3-ShockTube__test_standard.test_standard: PASS
  358. Toro-3-ShockTube__test_standard.test_standard: PASS
  359. Toro-3-ShockTube__test_standard.test_standard: PASS
  360. Toro-3-ShockTube__test_standard.test_standard: PASS
  361. Toro-3-ShockTube__test_standard.test_standard: PASS
  362. Toro-3-ShockTube__test_standard.test_standard: PASS
  363. Toro-3-ShockTube__test_standard.test_standard: PASS
  364. Toro-3-ShockTube__test_standard.test_standard: PASS
  365. Toro-3-ShockTube__test_standard.test_standard: PASS
  366. Toro-3-ShockTube__test_standard.test_standard: PASS
  367. Toro-3-ShockTube__test_standard.test_standard: PASS
  368. Toro-3-ShockTube__test_standard.test_standard: PASS
  369. Toro-3-ShockTube__test_standard.test_standard: PASS
  370. Toro-3-ShockTube__test_standard.test_standard: PASS
  371. Toro-3-ShockTube__test_standard.test_standard: PASS
  372. Toro-3-ShockTube__test_standard.test_standard: PASS
  373. Toro-3-ShockTube__test_toro3.test_toro3: PASS
  374. Toro-3-ShockTube__test_toro3.test_toro3: PASS
  375. Toro-3-ShockTube__test_toro3.test_toro3: PASS
  376. Toro-3-ShockTube__test_toro3.test_toro3: PASS
  377. Toro-3-ShockTube__test_toro3.test_toro3: PASS
  378. Toro-3-ShockTube__test_toro3.test_toro3: PASS
  379. Toro-3-ShockTube__test_toro3.test_toro3: PASS
  380. Toro-3-ShockTube__test_toro3.test_toro3: PASS
  381. Toro-3-ShockTubeAMR__test_standard.test_exist: PASS
  382. Toro-3-ShockTubeAMR__test_standard.test_standard: PASS
  383. Toro-3-ShockTubeAMR__test_standard.test_standard: PASS
  384. Toro-3-ShockTubeAMR__test_standard.test_standard: PASS
  385. Toro-3-ShockTubeAMR__test_standard.test_standard: PASS
  386. Toro-3-ShockTubeAMR__test_standard.test_standard: PASS
  387. Toro-3-ShockTubeAMR__test_standard.test_standard: PASS
  388. Toro-3-ShockTubeAMR__test_standard.test_standard: PASS
  389. Toro-3-ShockTubeAMR__test_standard.test_standard: PASS
  390. Toro-3-ShockTubeAMR__test_standard.test_standard: PASS
  391. Toro-3-ShockTubeAMR__test_standard.test_standard: PASS
  392. Toro-3-ShockTubeAMR__test_standard.test_standard: PASS
  393. Toro-3-ShockTubeAMR__test_standard.test_standard: PASS
  394. Toro-3-ShockTubeAMR__test_standard.test_standard: PASS
  395. Toro-3-ShockTubeAMR__test_standard.test_standard: PASS
  396. Toro-3-ShockTubeAMR__test_standard.test_standard: PASS
  397. Toro-3-ShockTubeAMR__test_standard.test_standard: PASS
  398. Toro-3-ShockTubeAMR__test_standard.test_standard: PASS
  399. Toro-3-ShockTubeAMR__test_standard.test_standard: PASS
  400. Toro-3-ShockTubeAMR__test_standard.test_standard: PASS
  401. Toro-3-ShockTubeAMR__test_standard.test_standard: PASS
  402. Toro-3-ShockTubeAMR__test_standard.test_standard: PASS
  403. Toro-3-ShockTubeAMR__test_standard.test_standard: PASS
  404. Toro-3-ShockTubeAMR__test_standard.test_standard: PASS
  405. Toro-3-ShockTubeAMR__test_standard.test_standard: PASS
  406. Toro-3-ShockTubeAMR__test_standard.test_standard: PASS
  407. Toro-3-ShockTubeAMR__test_standard.test_standard: PASS
  408. Toro-3-ShockTubeAMR__test_standard.test_standard: PASS
  409. Toro-3-ShockTubeAMR__test_standard.test_standard: PASS
  410. Toro-3-ShockTubeAMR__test_standard.test_standard: PASS
  411. Toro-3-ShockTubeAMR__test_toro3_amr.test_toro3_amr: PASS
  412. Toro-3-ShockTubeAMR__test_toro3_amr.test_toro3_amr: PASS
  413. Toro-3-ShockTubeAMR__test_toro3_amr.test_toro3_amr: PASS
  414. Toro-3-ShockTubeAMR__test_toro3_amr.test_toro3_amr: PASS
  415. Toro-3-ShockTubeAMR__test_toro3_amr.test_toro3_amr: PASS
  416. Toro-3-ShockTubeAMR__test_toro3_amr.test_toro3_amr: PASS
  417. Toro-3-ShockTubeAMR__test_toro3_amr.test_toro3_amr: PASS
  418. Toro-3-ShockTubeAMR__test_toro3_amr.test_toro3_amr: PASS
  419. Toro-4-ShockTube__test_standard.test_exist: PASS
  420. Toro-4-ShockTube__test_standard.test_standard: PASS
  421. Toro-4-ShockTube__test_standard.test_standard: PASS
  422. Toro-4-ShockTube__test_standard.test_standard: PASS
  423. Toro-4-ShockTube__test_standard.test_standard: PASS
  424. Toro-4-ShockTube__test_standard.test_standard: PASS
  425. Toro-4-ShockTube__test_standard.test_standard: PASS
  426. Toro-4-ShockTube__test_standard.test_standard: PASS
  427. Toro-4-ShockTube__test_standard.test_standard: PASS
  428. Toro-4-ShockTube__test_standard.test_standard: PASS
  429. Toro-4-ShockTube__test_standard.test_standard: PASS
  430. Toro-4-ShockTube__test_standard.test_standard: PASS
  431. Toro-4-ShockTube__test_standard.test_standard: PASS
  432. Toro-4-ShockTube__test_standard.test_standard: PASS
  433. Toro-4-ShockTube__test_standard.test_standard: PASS
  434. Toro-4-ShockTube__test_standard.test_standard: PASS
  435. Toro-4-ShockTube__test_standard.test_standard: PASS
  436. Toro-4-ShockTube__test_standard.test_standard: PASS
  437. Toro-4-ShockTube__test_standard.test_standard: PASS
  438. Toro-4-ShockTube__test_standard.test_standard: PASS
  439. Toro-4-ShockTube__test_standard.test_standard: PASS
  440. Toro-4-ShockTube__test_standard.test_standard: PASS
  441. Toro-4-ShockTube__test_standard.test_standard: PASS
  442. Toro-4-ShockTube__test_standard.test_standard: PASS
  443. Toro-4-ShockTube__test_standard.test_standard: PASS
  444. Toro-4-ShockTube__test_standard.test_standard: PASS
  445. Toro-4-ShockTube__test_standard.test_standard: PASS
  446. Toro-4-ShockTube__test_standard.test_standard: PASS
  447. Toro-4-ShockTube__test_standard.test_standard: PASS
  448. Toro-4-ShockTube__test_standard.test_standard: PASS
  449. Toro-4-ShockTube__test_toro4.test_toro4: PASS
  450. Toro-4-ShockTube__test_toro4.test_toro4: PASS
  451. Toro-4-ShockTube__test_toro4.test_toro4: PASS
  452. Toro-4-ShockTube__test_toro4.test_toro4: PASS
  453. Toro-4-ShockTube__test_toro4.test_toro4: PASS
  454. Toro-4-ShockTube__test_toro4.test_toro4: PASS
  455. Toro-4-ShockTube__test_toro4.test_toro4: PASS
  456. Toro-4-ShockTube__test_toro4.test_toro4: PASS
  457. Toro-4-ShockTubeAMR__test_standard.test_exist: PASS
  458. Toro-4-ShockTubeAMR__test_standard.test_standard: PASS
  459. Toro-4-ShockTubeAMR__test_standard.test_standard: PASS
  460. Toro-4-ShockTubeAMR__test_standard.test_standard: PASS
  461. Toro-4-ShockTubeAMR__test_standard.test_standard: PASS
  462. Toro-4-ShockTubeAMR__test_standard.test_standard: PASS
  463. Toro-4-ShockTubeAMR__test_standard.test_standard: PASS
  464. Toro-4-ShockTubeAMR__test_standard.test_standard: PASS
  465. Toro-4-ShockTubeAMR__test_standard.test_standard: PASS
  466. Toro-4-ShockTubeAMR__test_standard.test_standard: PASS
  467. Toro-4-ShockTubeAMR__test_standard.test_standard: PASS
  468. Toro-4-ShockTubeAMR__test_standard.test_standard: PASS
  469. Toro-4-ShockTubeAMR__test_standard.test_standard: PASS
  470. Toro-4-ShockTubeAMR__test_standard.test_standard: PASS
  471. Toro-4-ShockTubeAMR__test_standard.test_standard: PASS
  472. Toro-4-ShockTubeAMR__test_standard.test_standard: PASS
  473. Toro-4-ShockTubeAMR__test_standard.test_standard: PASS
  474. Toro-4-ShockTubeAMR__test_standard.test_standard: PASS
  475. Toro-4-ShockTubeAMR__test_standard.test_standard: PASS
  476. Toro-4-ShockTubeAMR__test_standard.test_standard: PASS
  477. Toro-4-ShockTubeAMR__test_standard.test_standard: PASS
  478. Toro-4-ShockTubeAMR__test_standard.test_standard: PASS
  479. Toro-4-ShockTubeAMR__test_standard.test_standard: PASS
  480. Toro-4-ShockTubeAMR__test_standard.test_standard: PASS
  481. Toro-4-ShockTubeAMR__test_standard.test_standard: PASS
  482. Toro-4-ShockTubeAMR__test_standard.test_standard: PASS
  483. Toro-4-ShockTubeAMR__test_standard.test_standard: PASS
  484. Toro-4-ShockTubeAMR__test_standard.test_standard: PASS
  485. Toro-4-ShockTubeAMR__test_standard.test_standard: PASS
  486. Toro-4-ShockTubeAMR__test_standard.test_standard: PASS
  487. Toro-4-ShockTubeAMR__test_toro4_amr.test_toro4_amr: PASS
  488. Toro-4-ShockTubeAMR__test_toro4_amr.test_toro4_amr: PASS
  489. Toro-4-ShockTubeAMR__test_toro4_amr.test_toro4_amr: PASS
  490. Toro-4-ShockTubeAMR__test_toro4_amr.test_toro4_amr: PASS
  491. Toro-4-ShockTubeAMR__test_toro4_amr.test_toro4_amr: PASS
  492. Toro-4-ShockTubeAMR__test_toro4_amr.test_toro4_amr: PASS
  493. Toro-4-ShockTubeAMR__test_toro4_amr.test_toro4_amr: PASS
  494. Toro-4-ShockTubeAMR__test_toro4_amr.test_toro4_amr: PASS
  495. Toro-5-ShockTube__test_standard.test_exist: PASS
  496. Toro-5-ShockTube__test_standard.test_standard: PASS
  497. Toro-5-ShockTube__test_standard.test_standard: PASS
  498. Toro-5-ShockTube__test_standard.test_standard: PASS
  499. Toro-5-ShockTube__test_standard.test_standard: PASS
  500. Toro-5-ShockTube__test_standard.test_standard: PASS
  501. Toro-5-ShockTube__test_standard.test_standard: PASS
  502. Toro-5-ShockTube__test_standard.test_standard: PASS
  503. Toro-5-ShockTube__test_standard.test_standard: PASS
  504. Toro-5-ShockTube__test_standard.test_standard: PASS
  505. Toro-5-ShockTube__test_standard.test_standard: PASS
  506. Toro-5-ShockTube__test_standard.test_standard: PASS
  507. Toro-5-ShockTube__test_standard.test_standard: PASS
  508. Toro-5-ShockTube__test_standard.test_standard: PASS
  509. Toro-5-ShockTube__test_standard.test_standard: PASS
  510. Toro-5-ShockTube__test_standard.test_standard: PASS
  511. Toro-5-ShockTube__test_standard.test_standard: PASS
  512. Toro-5-ShockTube__test_standard.test_standard: PASS
  513. Toro-5-ShockTube__test_standard.test_standard: PASS
  514. Toro-5-ShockTube__test_standard.test_standard: PASS
  515. Toro-5-ShockTube__test_standard.test_standard: PASS
  516. Toro-5-ShockTube__test_standard.test_standard: PASS
  517. Toro-5-ShockTube__test_standard.test_standard: PASS
  518. Toro-5-ShockTube__test_standard.test_standard: PASS
  519. Toro-5-ShockTube__test_standard.test_standard: PASS
  520. Toro-5-ShockTube__test_standard.test_standard: PASS
  521. Toro-5-ShockTube__test_standard.test_standard: PASS
  522. Toro-5-ShockTube__test_standard.test_standard: PASS
  523. Toro-5-ShockTube__test_standard.test_standard: PASS
  524. Toro-5-ShockTube__test_standard.test_standard: PASS
  525. Toro-5-ShockTube__test_toro5.test_toro5_amr: PASS
  526. Toro-5-ShockTube__test_toro5.test_toro5_amr: PASS
  527. Toro-5-ShockTube__test_toro5.test_toro5_amr: PASS
  528. Toro-5-ShockTubeAMR__test_standard.test_exist: PASS
  529. Toro-5-ShockTubeAMR__test_standard.test_standard: PASS
  530. Toro-5-ShockTubeAMR__test_standard.test_standard: PASS
  531. Toro-5-ShockTubeAMR__test_standard.test_standard: PASS
  532. Toro-5-ShockTubeAMR__test_standard.test_standard: PASS
  533. Toro-5-ShockTubeAMR__test_standard.test_standard: PASS
  534. Toro-5-ShockTubeAMR__test_standard.test_standard: PASS
  535. Toro-5-ShockTubeAMR__test_standard.test_standard: PASS
  536. Toro-5-ShockTubeAMR__test_standard.test_standard: PASS
  537. Toro-5-ShockTubeAMR__test_standard.test_standard: PASS
  538. Toro-5-ShockTubeAMR__test_standard.test_standard: PASS
  539. Toro-5-ShockTubeAMR__test_standard.test_standard: PASS
  540. Toro-5-ShockTubeAMR__test_standard.test_standard: PASS
  541. Toro-5-ShockTubeAMR__test_standard.test_standard: PASS
  542. Toro-5-ShockTubeAMR__test_standard.test_standard: PASS
  543. Toro-5-ShockTubeAMR__test_standard.test_standard: PASS
  544. Toro-5-ShockTubeAMR__test_standard.test_standard: PASS
  545. Toro-5-ShockTubeAMR__test_standard.test_standard: PASS
  546. Toro-5-ShockTubeAMR__test_standard.test_standard: PASS
  547. Toro-5-ShockTubeAMR__test_standard.test_standard: PASS
  548. Toro-5-ShockTubeAMR__test_standard.test_standard: PASS
  549. Toro-5-ShockTubeAMR__test_standard.test_standard: PASS
  550. Toro-5-ShockTubeAMR__test_standard.test_standard: PASS
  551. Toro-5-ShockTubeAMR__test_standard.test_standard: PASS
  552. Toro-5-ShockTubeAMR__test_standard.test_standard: PASS
  553. Toro-5-ShockTubeAMR__test_standard.test_standard: PASS
  554. Toro-5-ShockTubeAMR__test_standard.test_standard: PASS
  555. Toro-5-ShockTubeAMR__test_standard.test_standard: PASS
  556. Toro-5-ShockTubeAMR__test_standard.test_standard: PASS
  557. Toro-5-ShockTubeAMR__test_standard.test_standard: PASS
  558. Toro-5-ShockTubeAMR__test_toro5_amr.test_toro5_amr: PASS
  559. Toro-5-ShockTubeAMR__test_toro5_amr.test_toro5_amr: PASS
  560. Toro-5-ShockTubeAMR__test_toro5_amr.test_toro5_amr: PASS
  561. Toro-6-ShockTube__test_toro6.test_exist: PASS
  562. Toro-6-ShockTube__test_toro6.test_toro6: PASS
  563. Toro-6-ShockTube__test_toro6.test_almost_standard: PASS
  564. Toro-6-ShockTube__test_toro6.test_almost_standard: PASS
  565. Toro-6-ShockTube__test_toro6.test_almost_standard: PASS
  566. Toro-6-ShockTube__test_toro6.test_almost_standard: PASS
  567. Toro-6-ShockTube__test_toro6.test_almost_standard: PASS
  568. Toro-6-ShockTube__test_toro6.test_almost_standard: PASS
  569. Toro-6-ShockTube__test_toro6.test_almost_standard: PASS
  570. Toro-6-ShockTube__test_toro6.test_almost_standard: PASS
  571. Toro-7-ShockTube__test_standard.test_exist: PASS
  572. Toro-7-ShockTube__test_standard.test_standard: PASS
  573. Toro-7-ShockTube__test_standard.test_standard: PASS
  574. Toro-7-ShockTube__test_standard.test_standard: PASS
  575. Toro-7-ShockTube__test_standard.test_standard: PASS
  576. Toro-7-ShockTube__test_standard.test_standard: PASS
  577. Toro-7-ShockTube__test_standard.test_standard: PASS
  578. Toro-7-ShockTube__test_standard.test_standard: PASS
  579. Toro-7-ShockTube__test_standard.test_standard: PASS
  580. Toro-7-ShockTube__test_standard.test_standard: PASS
  581. Toro-7-ShockTube__test_standard.test_standard: PASS
  582. Toro-7-ShockTube__test_standard.test_standard: PASS
  583. Toro-7-ShockTube__test_standard.test_standard: PASS
  584. Toro-7-ShockTube__test_standard.test_standard: PASS
  585. Toro-7-ShockTube__test_standard.test_standard: PASS
  586. Toro-7-ShockTube__test_standard.test_standard: PASS
  587. Toro-7-ShockTube__test_standard.test_standard: PASS
  588. Toro-7-ShockTube__test_standard.test_standard: PASS
  589. Toro-7-ShockTube__test_standard.test_standard: PASS
  590. Toro-7-ShockTube__test_standard.test_standard: PASS
  591. Toro-7-ShockTube__test_standard.test_standard: PASS
  592. Toro-7-ShockTube__test_standard.test_standard: PASS
  593. Toro-7-ShockTube__test_standard.test_standard: PASS
  594. Toro-7-ShockTube__test_standard.test_standard: PASS
  595. Toro-7-ShockTube__test_standard.test_standard: PASS
  596. Toro-7-ShockTube__test_standard.test_standard: PASS
  597. Toro-7-ShockTube__test_standard.test_standard: PASS
  598. Toro-7-ShockTube__test_standard.test_standard: PASS
  599. Toro-7-ShockTube__test_standard.test_standard: PASS
  600. Toro-7-ShockTube__test_standard.test_standard: PASS
  601. Toro-7-ShockTube__test_toro7.test_toro7: PASS
  602. Toro-7-ShockTube__test_toro7.test_toro7: PASS
  603. Toro-7-ShockTube__test_toro7.test_toro7: PASS
  604. Toro-7-ShockTube__test_toro7.test_toro7: PASS
  605. Toro-7-ShockTube__test_toro7.test_toro7: PASS
  606. Toro-7-ShockTube__test_toro7.test_toro7: PASS
  607. Toro-7-ShockTube__test_toro7.test_toro7: PASS
  608. Toro-7-ShockTube__test_toro7.test_toro7: PASS
  609. WavePool__test_standard.test_exist: PASS
  610. WavePool__test_standard.test_standard: PASS
  611. WavePool__test_standard.test_standard: PASS
  612. WavePool__test_standard.test_standard: PASS
  613. WavePool__test_standard.test_standard: PASS
  614. WavePool__test_standard.test_standard: PASS
  615. WavePool__test_standard.test_standard: PASS
  616. WavePool__test_standard.test_standard: PASS
  617. WavePool__test_standard.test_standard: PASS
  618. WavePool__test_standard.test_standard: PASS
  619. WavePool__test_standard.test_standard: PASS
  620. WavePool__test_standard.test_standard: PASS
  621. WavePool__test_standard.test_standard: PASS
  622. WavePool__test_standard.test_standard: PASS
  623. WavePool__test_standard.test_standard: PASS
  624. WavePool__test_standard.test_standard: PASS
  625. AMRShockPool2D__test_standard.test_exist: PASS
  626. AMRShockPool2D__test_standard.test_standard: PASS
  627. AMRShockPool2D__test_standard.test_standard: PASS
  628. AMRShockPool2D__test_standard.test_standard: PASS
  629. AMRShockPool2D__test_standard.test_standard: PASS
  630. AMRShockPool2D__test_standard.test_standard: PASS
  631. AMRShockPool2D__test_standard.test_standard: PASS
  632. AMRShockPool2D__test_standard.test_standard: PASS
  633. AMRShockPool2D__test_standard.test_standard: PASS
  634. AMRShockPool2D__test_standard.test_standard: PASS
  635. AMRShockPool2D__test_standard.test_standard: PASS
  636. AMRShockPool2D__test_standard.test_standard: PASS
  637. AMRShockPool2D__test_standard.test_standard: PASS
  638. AMRShockPool2D__test_standard.test_standard: PASS
  639. AMRShockPool2D__test_standard.test_standard: PASS
  640. AMRShockPool2D__test_standard.test_standard: PASS
  641. AMRShockPool2D__test_standard.test_standard: PASS
  642. AMRShockPool2D__test_standard.test_standard: PASS
  643. AMRShockPool2D__test_standard.test_standard: PASS
  644. AMRShockPool2D__test_standard.test_standard: PASS
  645. AMRShockPool2D__test_standard.test_standard: PASS
  646. AMRShockPool2D__test_standard.test_standard: PASS
  647. AMRShockPool2D__test_standard.test_standard: PASS
  648. FreeExpansionAMR__test_free_expansion.test_collapse_max_value: PASS
  649. FreeExpansionAMR__test_standard.test_exist: PASS
  650. FreeExpansionAMR__test_standard.test_standard: PASS
  651. FreeExpansionAMR__test_standard.test_standard: PASS
  652. FreeExpansionAMR__test_standard.test_standard: PASS
  653. FreeExpansionAMR__test_standard.test_standard: PASS
  654. FreeExpansionAMR__test_standard.test_standard: PASS
  655. FreeExpansionAMR__test_standard.test_standard: PASS
  656. FreeExpansionAMR__test_standard.test_standard: PASS
  657. FreeExpansionAMR__test_standard.test_standard: PASS
  658. FreeExpansionAMR__test_standard.test_standard: PASS
  659. FreeExpansionAMR__test_standard.test_standard: PASS
  660. FreeExpansionAMR__test_standard.test_standard: PASS
  661. FreeExpansionAMR__test_standard.test_standard: PASS
  662. FreeExpansionAMR__test_standard.test_standard: PASS
  663. FreeExpansionAMR__test_standard.test_standard: PASS
  664. FreeExpansionAMR__test_standard.test_standard: PASS
  665. FreeExpansionAMR__test_standard.test_standard: PASS
  666. FreeExpansionAMR__test_standard.test_standard: PASS
  667. FreeExpansionAMR__test_standard.test_standard: PASS
  668. FreeExpansionAMR__test_standard.test_standard: PASS
  669. FreeExpansionAMR__test_standard.test_standard: PASS
  670. FreeExpansionAMR__test_standard.test_standard: PASS
  671. FreeExpansionAMR__test_standard.test_standard: PASS
  672. FreeExpansionAMR__test_standard.test_standard: PASS
  673. FreeExpansionAMR__test_standard.test_standard: PASS
  674. FreeExpansionAMR__test_standard.test_standard: PASS
  675. FreeExpansionAMR__test_standard.test_standard: PASS
  676. FreeExpansionAMR__test_standard.test_standard: PASS
  677. FreeExpansionAMR__test_standard.test_standard: PASS
  678. FreeExpansionAMR__test_standard.test_standard: PASS
  679. HDMHD2DCheckOddEvenCouplingOfRiemannSolver__test_standard.test_exist: PASS
  680. HDMHD2DCheckOddEvenCouplingOfRiemannSolver__test_standard.test_standard: PASS
  681. HDMHD2DCheckOddEvenCouplingOfRiemannSolver__test_standard.test_standard: PASS
  682. HDMHD2DCheckOddEvenCouplingOfRiemannSolver__test_standard.test_standard: PASS
  683. HDMHD2DCheckOddEvenCouplingOfRiemannSolver__test_standard.test_standard: PASS
  684. HDMHD2DCheckOddEvenCouplingOfRiemannSolver__test_standard.test_standard: PASS
  685. HDMHD2DCheckOddEvenCouplingOfRiemannSolver__test_standard.test_standard: PASS
  686. HDMHD2DCheckOddEvenCouplingOfRiemannSolver__test_standard.test_standard: PASS
  687. HDMHD2DCheckOddEvenCouplingOfRiemannSolver__test_standard.test_standard: PASS
  688. HDMHD2DCheckOddEvenCouplingOfRiemannSolver__test_standard.test_standard: PASS
  689. HDMHD2DCheckOddEvenCouplingOfRiemannSolver__test_standard.test_standard: PASS
  690. HDMHD2DCheckOddEvenCouplingOfRiemannSolver__test_standard.test_standard: PASS
  691. HDMHD2DCheckOddEvenCouplingOfRiemannSolver__test_standard.test_standard: PASS
  692. HDMHD2DCheckOddEvenCouplingOfRiemannSolver__test_standard.test_standard: PASS
  693. HDMHD2DCheckOddEvenCouplingOfRiemannSolver__test_standard.test_standard: PASS
  694. HDMHD2DCheckOddEvenCouplingOfRiemannSolver__test_standard.test_standard: PASS
  695. HDMHD2DCheckOddEvenCouplingOfRiemannSolver__test_standard.test_standard: PASS
  696. HDMHD2DCheckOddEvenCouplingOfRiemannSolver__test_standard.test_standard: PASS
  697. HDMHD2DCheckOddEvenCouplingOfRiemannSolver__test_standard.test_standard: PASS
  698. HDMHD2DCheckOddEvenCouplingOfRiemannSolver__test_standard.test_standard: PASS
  699. HDMHD2DCheckOddEvenCouplingOfRiemannSolver__test_standard.test_standard: PASS
  700. HDMHD2DCheckOddEvenCouplingOfRiemannSolver__test_standard.test_standard: PASS
  701. HDMHD2DCheckOddEvenCouplingOfRiemannSolver__test_standard.test_standard: PASS
  702. HDMHD2DCheckOddEvenCouplingOfRiemannSolver__test_standard.test_standard: PASS
  703. HDMHD2DCheckOddEvenCouplingOfRiemannSolver__test_standard.test_standard: PASS
  704. HDMHD2DCheckOddEvenCouplingOfRiemannSolver__test_standard.test_standard: PASS
  705. HDMHD2DCheckOddEvenCouplingOfRiemannSolver__test_standard.test_standard: PASS
  706. HDMHD2DCheckOddEvenCouplingOfRiemannSolver__test_standard.test_standard: PASS
  707. HDMHD2DCheckOddEvenCouplingOfRiemannSolver__test_standard.test_standard: PASS
  708. HDMHD2DCheckOddEvenCouplingOfRiemannSolver__test_standard.test_standard: PASS
  709. NohProblem2D__test_noh2d.test_noh2d: PASS
  710. NohProblem2D__test_noh2d.test_noh2d: PASS
  711. NohProblem2D__test_standard.test_exist: PASS
  712. NohProblem2D__test_standard.test_standard: PASS
  713. NohProblem2D__test_standard.test_standard: PASS
  714. NohProblem2D__test_standard.test_standard: PASS
  715. NohProblem2D__test_standard.test_standard: PASS
  716. NohProblem2D__test_standard.test_standard: PASS
  717. NohProblem2D__test_standard.test_standard: PASS
  718. NohProblem2D__test_standard.test_standard: PASS
  719. NohProblem2D__test_standard.test_standard: PASS
  720. NohProblem2D__test_standard.test_standard: PASS
  721. NohProblem2D__test_standard.test_standard: PASS
  722. NohProblem2D__test_standard.test_standard: PASS
  723. NohProblem2D__test_standard.test_standard: PASS
  724. NohProblem2D__test_standard.test_standard: PASS
  725. NohProblem2D__test_standard.test_standard: PASS
  726. NohProblem2D__test_standard.test_standard: PASS
  727. NohProblem2D__test_standard.test_standard: PASS
  728. NohProblem2D__test_standard.test_standard: PASS
  729. NohProblem2D__test_standard.test_standard: PASS
  730. NohProblem2D__test_standard.test_standard: PASS
  731. NohProblem2D__test_standard.test_standard: PASS
  732. NohProblem2D__test_standard.test_standard: PASS
  733. NohProblem2D__test_standard.test_standard: PASS
  734. ShockPool2D__test_standard.test_exist: PASS
  735. ShockPool2D__test_standard.test_standard: PASS
  736. ShockPool2D__test_standard.test_standard: PASS
  737. ShockPool2D__test_standard.test_standard: PASS
  738. ShockPool2D__test_standard.test_standard: PASS
  739. ShockPool2D__test_standard.test_standard: PASS
  740. ShockPool2D__test_standard.test_standard: PASS
  741. ShockPool2D__test_standard.test_standard: PASS
  742. ShockPool2D__test_standard.test_standard: PASS
  743. ShockPool2D__test_standard.test_standard: PASS
  744. ShockPool2D__test_standard.test_standard: PASS
  745. ShockPool2D__test_standard.test_standard: PASS
  746. ShockPool2D__test_standard.test_standard: PASS
  747. ShockPool2D__test_standard.test_standard: PASS
  748. ShockPool2D__test_standard.test_standard: PASS
  749. ShockPool2D__test_standard.test_standard: PASS
  750. ShockPool2D__test_standard.test_standard: PASS
  751. ShockPool2D__test_standard.test_standard: PASS
  752. ShockPool2D__test_standard.test_standard: PASS
  753. ShockPool2D__test_standard.test_standard: PASS
  754. ShockPool2D__test_standard.test_standard: PASS
  755. ShockPool2D__test_standard.test_standard: PASS
  756. ShockPool2D__test_standard.test_standard: PASS
  757. ExtremeAdvectionTest__test_standard.test_exist: PASS
  758. BrioWu-MHD-1D__test_briowu.test_briowu: PASS
  759. BrioWu-MHD-1D__test_standard.test_exist: PASS
  760. BrioWu-MHD-1D__test_standard.test_standard: PASS
  761. BrioWu-MHD-1D__test_standard.test_standard: PASS
  762. BrioWu-MHD-1D__test_standard.test_standard: PASS
  763. BrioWu-MHD-1D__test_standard.test_standard: PASS
  764. BrioWu-MHD-1D__test_standard.test_standard: PASS
  765. BrioWu-MHD-1D__test_standard.test_standard: PASS
  766. BrioWu-MHD-1D__test_standard.test_standard: PASS
  767. BrioWu-MHD-1D__test_standard.test_standard: PASS
  768. BrioWu-MHD-1D__test_standard.test_standard: PASS
  769. BrioWu-MHD-1D__test_standard.test_standard: PASS
  770. BrioWu-MHD-1D__test_standard.test_standard: PASS
  771. BrioWu-MHD-1D__test_standard.test_standard: PASS
  772. BrioWu-MHD-1D__test_standard.test_standard: PASS
  773. BrioWu-MHD-1D__test_standard.test_standard: PASS
  774. BrioWu-MHD-1D__test_standard.test_standard: PASS
  775. BrioWu-MHD-1D__test_standard.test_standard: PASS
  776. BrioWu-MHD-1D__test_standard.test_standard: PASS
  777. BrioWu-MHD-1D__test_standard.test_standard: PASS
  778. BrioWu-MHD-1D__test_standard.test_standard: PASS
  779. BrioWu-MHD-1D__test_standard.test_standard: PASS
  780. BrioWu-MHD-1D__test_standard.test_standard: PASS
  781. BrioWu-MHD-1D__test_standard.test_standard: PASS
  782. BrioWu-MHD-1D__test_standard.test_standard: PASS
  783. BrioWu-MHD-1D__test_standard.test_standard: PASS
  784. BrioWu-MHD-1D__test_standard.test_standard: PASS
  785. BrioWu-MHD-1D__test_standard.test_standard: PASS
  786. BrioWu-MHD-1D__test_standard.test_standard: PASS
  787. BrioWu-MHD-1D__test_standard.test_standard: PASS
  788. BrioWu-MHD-1D__test_standard.test_standard: PASS
  789. MHD2DRotorTest__test_almost_standard.test_exist: PASS
  790. MHD2DRotorTest__test_almost_standard.test_standard: PASS
  791. MHD2DRotorTest__test_almost_standard.test_standard: PASS
  792. MHD2DRotorTest__test_almost_standard.test_standard: PASS
  793. MHD2DRotorTest__test_almost_standard.test_standard: PASS
  794. MHD2DRotorTest__test_almost_standard.test_standard: PASS
  795. MHD2DRotorTest__test_almost_standard.test_standard: PASS
  796. MHD2DRotorTest__test_almost_standard.test_standard: PASS
  797. MHD2DRotorTest__test_almost_standard.test_standard: PASS
  798. MHD2DRotorTest__test_almost_standard.test_standard: PASS
  799. MHD2DRotorTest__test_almost_standard.test_standard: PASS
  800. MHD2DRotorTest__test_almost_standard.test_standard: PASS
  801. MHD2DRotorTest__test_almost_standard.test_standard: PASS
  802. MHD2DRotorTest__test_almost_standard.test_standard: PASS
  803. MHD2DRotorTest__test_almost_standard.test_standard: PASS
  804. MHD2DRotorTest__test_almost_standard.test_standard: PASS
  805. MHD2DRotorTest__test_rotor.test_rotor: PASS
  806. MHD2DRotorTest__test_rotor.test_rotor: PASS
  807. MHD2DRotorTest__test_rotor.test_rotor: PASS
  808. SedovBlast-MHD-2D-Gardiner__test_gardiner.test_gardiner: PASS
  809. SedovBlast-MHD-2D-Gardiner__test_gardiner.test_gardiner: PASS
  810. SedovBlast-MHD-2D-Gardiner__test_gardiner.test_gardiner: PASS
  811. SedovBlast-MHD-2D-Gardiner__test_gardiner.test_gardiner: PASS
  812. SedovBlast-MHD-2D-Gardiner__test_standard.test_exist: PASS
  813. SedovBlast-MHD-2D-Gardiner__test_standard.test_standard: PASS
  814. SedovBlast-MHD-2D-Gardiner__test_standard.test_standard: PASS
  815. SedovBlast-MHD-2D-Gardiner__test_standard.test_standard: PASS
  816. SedovBlast-MHD-2D-Gardiner__test_standard.test_standard: PASS
  817. SedovBlast-MHD-2D-Gardiner__test_standard.test_standard: PASS
  818. SedovBlast-MHD-2D-Gardiner__test_standard.test_standard: PASS
  819. SedovBlast-MHD-2D-Gardiner__test_standard.test_standard: PASS
  820. SedovBlast-MHD-2D-Gardiner__test_standard.test_standard: PASS
  821. SedovBlast-MHD-2D-Gardiner__test_standard.test_standard: PASS
  822. SedovBlast-MHD-2D-Gardiner__test_standard.test_standard: PASS
  823. SedovBlast-MHD-2D-Gardiner__test_standard.test_standard: PASS
  824. SedovBlast-MHD-2D-Gardiner__test_standard.test_standard: PASS
  825. SedovBlast-MHD-2D-Gardiner__test_standard.test_standard: PASS
  826. SedovBlast-MHD-2D-Gardiner__test_standard.test_standard: PASS
  827. SedovBlast-MHD-2D-Gardiner__test_standard.test_standard: PASS
  828. SedovBlast-MHD-2D-Gardiner__test_standard.test_standard: PASS
  829. SedovBlast-MHD-2D-Gardiner__test_standard.test_standard: PASS
  830. SedovBlast-MHD-2D-Gardiner__test_standard.test_standard: PASS
  831. SedovBlast-MHD-2D-Gardiner__test_standard.test_standard: PASS
  832. SedovBlast-MHD-2D-Gardiner__test_standard.test_standard: PASS
  833. SedovBlast-MHD-2D-Gardiner__test_standard.test_standard: PASS
  834. SedovBlast-MHD-2D-Gardiner__test_standard.test_standard: PASS
  835. SedovBlast-MHD-2D-Gardiner__test_standard.test_standard: PASS
  836. SedovBlast-MHD-2D-Gardiner__test_standard.test_standard: PASS
  837. SedovBlast-MHD-2D-Gardiner__test_standard.test_standard: PASS
  838. SedovBlast-MHD-2D-Gardiner__test_standard.test_standard: PASS
  839. SedovBlast-MHD-2D-Gardiner__test_standard.test_standard: PASS
  840. SedovBlast-MHD-2D-Gardiner__test_standard.test_standard: PASS
  841. SedovBlast-MHD-2D-Gardiner__test_standard.test_standard: PASS
  842. PhotonShadowing__test_photonshadowing.test_photon_shadowing: PASS
  843. PhotonShadowing__test_photonshadowing.test_photon_shadowing: PASS
  844. PhotonShadowing__test_photonshadowing.test_photon_shadowing: PASS
  845. PhotonShadowing__test_photonshadowing.test_photon_shadowing: PASS
  846. PhotonShadowing__test_standard.test_exist: PASS
  847. PhotonShadowing__test_standard.test_standard: PASS
  848. PhotonShadowing__test_standard.test_standard: PASS
  849. PhotonShadowing__test_standard.test_standard: PASS
  850. PhotonShadowing__test_standard.test_standard: PASS
  851. PhotonShadowing__test_standard.test_standard: PASS
  852. PhotonShadowing__test_standard.test_standard: PASS
  853. PhotonShadowing__test_standard.test_standard: PASS
  854. PhotonShadowing__test_standard.test_standard: PASS
  855. PhotonShadowing__test_standard.test_standard: PASS
  856. PhotonShadowing__test_standard.test_standard: PASS
  857. PhotonShadowing__test_standard.test_standard: PASS
  858. PhotonShadowing__test_standard.test_standard: PASS
  859. PhotonShadowing__test_standard.test_standard: PASS
  860. PhotonShadowing__test_standard.test_standard: PASS
  861. PhotonShadowing__test_standard.test_standard: PASS
  862. PhotonShadowing__test_standard.test_standard: PASS
  863. PhotonShadowing__test_standard.test_standard: PASS
  864. PhotonShadowing__test_standard.test_standard: PASS
  865. PhotonShadowing__test_standard.test_standard: PASS
  866. PhotonShadowing__test_standard.test_standard: PASS
  867. PhotonShadowing__test_standard.test_standard: PASS
  868. PhotonShadowing__test_standard.test_standard: PASS
  869. PhotonShadowing__test_standard.test_standard: PASS
  870. PhotonShadowing__test_standard.test_standard: PASS
  871. PhotonShadowing__test_standard.test_standard: PASS
  872. PhotonShadowing__test_standard.test_standard: PASS
  873. PhotonShadowing__test_standard.test_standard: PASS
  874. PhotonShadowing__test_standard.test_standard: PASS
  875. PhotonShadowing__test_standard.test_standard: PASS
  876. PhotonTest__test_photontest.test_photon_test: PASS
  877. PhotonTest__test_photontest.test_photon_test: PASS
  878. PhotonTest__test_photontest.test_photon_test: PASS
  879. PhotonTest__test_standard.test_exist: PASS
  880. PhotonTest__test_standard.test_standard: PASS
  881. PhotonTest__test_standard.test_standard: PASS
  882. PhotonTest__test_standard.test_standard: PASS
  883. PhotonTest__test_standard.test_standard: PASS
  884. PhotonTest__test_standard.test_standard: PASS
  885. PhotonTest__test_standard.test_standard: PASS
  886. PhotonTest__test_standard.test_standard: PASS
  887. PhotonTest__test_standard.test_standard: PASS
  888. PhotonTest__test_standard.test_standard: PASS
  889. PhotonTest__test_standard.test_standard: PASS
  890. PhotonTest__test_standard.test_standard: PASS
  891. PhotonTest__test_standard.test_standard: PASS
  892. PhotonTest__test_standard.test_standard: PASS
  893. PhotonTest__test_standard.test_standard: PASS
  894. PhotonTest__test_standard.test_standard: PASS
  895. PhotonTest__test_standard.test_standard: PASS
  896. PhotonTest__test_standard.test_standard: PASS
  897. PhotonTest__test_standard.test_standard: PASS
  898. PhotonTest__test_standard.test_standard: PASS
  899. PhotonTest__test_standard.test_standard: PASS
  900. PhotonTest__test_standard.test_standard: PASS
  901. PhotonTest__test_standard.test_standard: PASS
  902. PhotonTest__test_standard.test_standard: PASS
  903. PhotonTest__test_standard.test_standard: PASS
  904. PhotonTest__test_standard.test_standard: PASS
  905. PhotonTest__test_standard.test_standard: PASS
  906. PhotonTest__test_standard.test_standard: PASS
  907. PhotonTest__test_standard.test_standard: PASS
  908. PhotonTest__test_standard.test_standard: PASS
  909.  
  910. Tests that failed:
  911. AdiabaticExpansion__test_standard.test_standard: FAILURE (<type 'exceptions.AssertionError'>, AssertionError('
  912.     Items are not equal: Number of outputs not equal.
  913.      ACTUAL: 17
  914.      DESIRED: 16',), <traceback object at 0x6736b48>)
  915. MHDZeldovichPancake__test_standard.test_standard: FAILURE (<type 'exceptions.AssertionError'>, AssertionError('
  916.     Items are not equal: Number of outputs not equal.
  917.      ACTUAL: 21
  918.      DESIRED: 20',), <traceback object at 0x6547878>)
  919. ZeldovichPancake__test_almost_standard.test_almost_standard: FAILURE (<type 'exceptions.AssertionError'>, AssertionError('
  920.     Items are not equal: Number of outputs not equal.
  921.      ACTUAL: 2
  922.      DESIRED: 1',), <traceback object at 0x69377a0>)
  923. ExtremeAdvectionTest__test_standard.test_standard: FAILURE (<type 'exceptions.AssertionError'>, AssertionError('
  924.     Items are not equal: Number of outputs not equal.
  925.      ACTUAL: 8
  926.      DESIRED: 7',), <traceback object at 0x5bbb6c8>)
  927.  
  928. Tests that errored:
  929. AdiabaticExpansion__test_standard.test_standard: ERROR (<class 'yt.utilities.exceptions.YTNoOldAnswer'>, YTNoOldAnswer(), <traceback object at 0x6594248>)
  930. AdiabaticExpansion__test_standard.test_standard: ERROR (<class 'yt.utilities.exceptions.YTNoOldAnswer'>, YTNoOldAnswer(), <traceback object at 0x6572368>)
  931. AdiabaticExpansion__test_standard.test_standard: ERROR (<class 'yt.utilities.exceptions.YTNoOldAnswer'>, YTNoOldAnswer(), <traceback object at 0x65725a8>)
  932. AdiabaticExpansion__test_standard.test_standard: ERROR (<class 'yt.utilities.exceptions.YTNoOldAnswer'>, YTNoOldAnswer(), <traceback object at 0x65723f8>)
  933. AdiabaticExpansion__test_standard.test_standard: ERROR (<class 'yt.utilities.exceptions.YTNoOldAnswer'>, YTNoOldAnswer(), <traceback object at 0x6572b00>)
  934. AdiabaticExpansion__test_standard.test_standard: ERROR (<class 'yt.utilities.exceptions.YTNoOldAnswer'>, YTNoOldAnswer(), <traceback object at 0x6572c20>)
  935. AdiabaticExpansion__test_standard.test_standard: ERROR (<class 'yt.utilities.exceptions.YTNoOldAnswer'>, YTNoOldAnswer(), <traceback object at 0x6572bd8>)
  936. AdiabaticExpansion__test_standard.test_standard: ERROR (<class 'yt.utilities.exceptions.YTNoOldAnswer'>, YTNoOldAnswer(), <traceback object at 0x6572c68>)
  937. AdiabaticExpansion__test_standard.test_standard: ERROR (<class 'yt.utilities.exceptions.YTNoOldAnswer'>, YTNoOldAnswer(), <traceback object at 0x6572cb0>)
  938. AdiabaticExpansion__test_standard.test_standard: ERROR (<class 'yt.utilities.exceptions.YTNoOldAnswer'>, YTNoOldAnswer(), <traceback object at 0x6572d88>)
  939. AdiabaticExpansion__test_standard.test_standard: ERROR (<class 'yt.utilities.exceptions.YTNoOldAnswer'>, YTNoOldAnswer(), <traceback object at 0x6594a28>)
  940. AdiabaticExpansion__test_standard.test_standard: ERROR (<class 'yt.utilities.exceptions.YTNoOldAnswer'>, YTNoOldAnswer(), <traceback object at 0x65946c8>)
  941. AdiabaticExpansion__test_standard.test_standard: ERROR (<class 'yt.utilities.exceptions.YTNoOldAnswer'>, YTNoOldAnswer(), <traceback object at 0x65947a0>)
  942. AdiabaticExpansion__test_standard.test_standard: ERROR (<class 'yt.utilities.exceptions.YTNoOldAnswer'>, YTNoOldAnswer(), <traceback object at 0x6594248>)
  943. AdiabaticExpansion__test_standard.test_standard: ERROR (<class 'yt.utilities.exceptions.YTNoOldAnswer'>, YTNoOldAnswer(), <traceback object at 0x6580c68>)
  944. AdiabaticExpansion__test_standard.test_standard: ERROR (<class 'yt.utilities.exceptions.YTNoOldAnswer'>, YTNoOldAnswer(), <traceback object at 0x6580ef0>)
  945. AdiabaticExpansion__test_standard.test_standard: ERROR (<class 'yt.utilities.exceptions.YTNoOldAnswer'>, YTNoOldAnswer(), <traceback object at 0x6580170>)
  946. AdiabaticExpansion__test_standard.test_standard: ERROR (<class 'yt.utilities.exceptions.YTNoOldAnswer'>, YTNoOldAnswer(), <traceback object at 0x657d878>)
  947. AdiabaticExpansion__test_standard.test_standard: ERROR (<class 'yt.utilities.exceptions.YTNoOldAnswer'>, YTNoOldAnswer(), <traceback object at 0x657d680>)
  948. AdiabaticExpansion__test_standard.test_standard: ERROR (<class 'yt.utilities.exceptions.YTNoOldAnswer'>, YTNoOldAnswer(), <traceback object at 0x6594a28>)
  949. AdiabaticExpansion__test_standard.test_standard: ERROR (<class 'yt.utilities.exceptions.YTNoOldAnswer'>, YTNoOldAnswer(), <traceback object at 0x6594320>)
  950. AdiabaticExpansion__test_standard.test_standard: ERROR (<class 'yt.utilities.exceptions.YTNoOldAnswer'>, YTNoOldAnswer(), <traceback object at 0x6572c68>)
  951. AdiabaticExpansion__test_standard.test_standard: ERROR (<class 'yt.utilities.exceptions.YTNoOldAnswer'>, YTNoOldAnswer(), <traceback object at 0x6572c20>)
  952. AdiabaticExpansion__test_standard.test_standard: ERROR (<class 'yt.utilities.exceptions.YTNoOldAnswer'>, YTNoOldAnswer(), <traceback object at 0x6572ea8>)
  953. AdiabaticExpansion__test_standard.test_standard: ERROR (<class 'yt.utilities.exceptions.YTNoOldAnswer'>, YTNoOldAnswer(), <traceback object at 0x65723b0>)
  954. AdiabaticExpansion__test_standard.test_standard: ERROR (<class 'yt.utilities.exceptions.YTNoOldAnswer'>, YTNoOldAnswer(), <traceback object at 0x65724d0>)
  955. AdiabaticExpansion__test_standard.test_standard: ERROR (<class 'yt.utilities.exceptions.YTNoOldAnswer'>, YTNoOldAnswer(), <traceback object at 0x6572dd0>)
  956. AdiabaticExpansion__test_standard.test_standard: ERROR (<class 'yt.utilities.exceptions.YTNoOldAnswer'>, YTNoOldAnswer(), <traceback object at 0x6580518>)
  957. MHDZeldovichPancake__test_standard.test_standard: ERROR (<class 'yt.utilities.exceptions.YTNoOldAnswer'>, YTNoOldAnswer(), <traceback object at 0x65ad368>)
  958. MHDZeldovichPancake__test_standard.test_standard: ERROR (<class 'yt.utilities.exceptions.YTNoOldAnswer'>, YTNoOldAnswer(), <traceback object at 0x65ad3f8>)
  959. MHDZeldovichPancake__test_standard.test_standard: ERROR (<class 'yt.utilities.exceptions.YTNoOldAnswer'>, YTNoOldAnswer(), <traceback object at 0x65ad098>)
  960. MHDZeldovichPancake__test_standard.test_standard: ERROR (<class 'yt.utilities.exceptions.YTNoOldAnswer'>, YTNoOldAnswer(), <traceback object at 0x6594170>)
  961. MHDZeldovichPancake__test_standard.test_standard: ERROR (<class 'yt.utilities.exceptions.YTNoOldAnswer'>, YTNoOldAnswer(), <traceback object at 0x65add88>)
  962. MHDZeldovichPancake__test_standard.test_standard: ERROR (<class 'yt.utilities.exceptions.YTNoOldAnswer'>, YTNoOldAnswer(), <traceback object at 0x65add88>)
  963. MHDZeldovichPancake__test_standard.test_standard: ERROR (<class 'yt.utilities.exceptions.YTNoOldAnswer'>, YTNoOldAnswer(), <traceback object at 0x65827a0>)
  964. MHDZeldovichPancake__test_standard.test_standard: ERROR (<class 'yt.utilities.exceptions.YTNoOldAnswer'>, YTNoOldAnswer(), <traceback object at 0x6582830>)
  965. MHDZeldovichPancake__test_standard.test_standard: ERROR (<class 'yt.utilities.exceptions.YTNoOldAnswer'>, YTNoOldAnswer(), <traceback object at 0x693b998>)
  966. MHDZeldovichPancake__test_standard.test_standard: ERROR (<class 'yt.utilities.exceptions.YTNoOldAnswer'>, YTNoOldAnswer(), <traceback object at 0x693b950>)
  967. MHDZeldovichPancake__test_standard.test_standard: ERROR (<class 'yt.utilities.exceptions.YTNoOldAnswer'>, YTNoOldAnswer(), <traceback object at 0x693bfc8>)
  968. MHDZeldovichPancake__test_standard.test_standard: ERROR (<class 'yt.utilities.exceptions.YTNoOldAnswer'>, YTNoOldAnswer(), <traceback object at 0x693ba70>)
  969. MHDZeldovichPancake__test_standard.test_standard: ERROR (<class 'yt.utilities.exceptions.YTNoOldAnswer'>, YTNoOldAnswer(), <traceback object at 0x693b908>)
  970. MHDZeldovichPancake__test_standard.test_standard: ERROR (<class 'yt.utilities.exceptions.YTNoOldAnswer'>, YTNoOldAnswer(), <traceback object at 0x693be18>)
  971. MHDZeldovichPancake__test_standard.test_standard: ERROR (<class 'yt.utilities.exceptions.YTNoOldAnswer'>, YTNoOldAnswer(), <traceback object at 0x693b3b0>)
  972. MHDZeldovichPancake__test_standard.test_standard: ERROR (<class 'yt.utilities.exceptions.YTNoOldAnswer'>, YTNoOldAnswer(), <traceback object at 0x693b368>)
  973. MHDZeldovichPancake__test_standard.test_standard: ERROR (<class 'yt.utilities.exceptions.YTNoOldAnswer'>, YTNoOldAnswer(), <traceback object at 0x69300e0>)
  974. MHDZeldovichPancake__test_standard.test_standard: ERROR (<class 'yt.utilities.exceptions.YTNoOldAnswer'>, YTNoOldAnswer(), <traceback object at 0x6930f80>)
  975. MHDZeldovichPancake__test_standard.test_standard: ERROR (<class 'yt.utilities.exceptions.YTNoOldAnswer'>, YTNoOldAnswer(), <traceback object at 0x69309e0>)
  976. MHDZeldovichPancake__test_standard.test_standard: ERROR (<class 'yt.utilities.exceptions.YTNoOldAnswer'>, YTNoOldAnswer(), <traceback object at 0x6930830>)
  977. MHDZeldovichPancake__test_standard.test_standard: ERROR (<class 'yt.utilities.exceptions.YTNoOldAnswer'>, YTNoOldAnswer(), <traceback object at 0x6949a70>)
  978. MHDZeldovichPancake__test_standard.test_standard: ERROR (<class 'yt.utilities.exceptions.YTNoOldAnswer'>, YTNoOldAnswer(), <traceback object at 0x69496c8>)
  979. MHDZeldovichPancake__test_standard.test_standard: ERROR (<class 'yt.utilities.exceptions.YTNoOldAnswer'>, YTNoOldAnswer(), <traceback object at 0x6949638>)
  980. MHDZeldovichPancake__test_standard.test_standard: ERROR (<class 'yt.utilities.exceptions.YTNoOldAnswer'>, YTNoOldAnswer(), <traceback object at 0x69307e8>)
  981. MHDZeldovichPancake__test_standard.test_standard: ERROR (<class 'yt.utilities.exceptions.YTNoOldAnswer'>, YTNoOldAnswer(), <traceback object at 0x6930f80>)
  982. MHDZeldovichPancake__test_standard.test_standard: ERROR (<class 'yt.utilities.exceptions.YTNoOldAnswer'>, YTNoOldAnswer(), <traceback object at 0x6949cf8>)
  983. MHDZeldovichPancake__test_standard.test_standard: ERROR (<class 'yt.utilities.exceptions.YTNoOldAnswer'>, YTNoOldAnswer(), <traceback object at 0x693be18>)
  984. MHDZeldovichPancake__test_standard.test_standard: ERROR (<class 'yt.utilities.exceptions.YTNoOldAnswer'>, YTNoOldAnswer(), <traceback object at 0x693bfc8>)
  985. ZeldovichPancake__test_almost_standard.test_almost_standard: ERROR (<class 'yt.utilities.exceptions.YTNoOldAnswer'>, YTNoOldAnswer(), <traceback object at 0x5982050>)
  986. ZeldovichPancake__test_almost_standard.test_almost_standard: ERROR (<class 'yt.utilities.exceptions.YTNoOldAnswer'>, YTNoOldAnswer(), <traceback object at 0x5984830>)
  987. ZeldovichPancake__test_almost_standard.test_almost_standard: ERROR (<class 'yt.utilities.exceptions.YTNoOldAnswer'>, YTNoOldAnswer(), <traceback object at 0x5984998>)
  988. ZeldovichPancake__test_almost_standard.test_almost_standard: ERROR (<class 'yt.utilities.exceptions.YTNoOldAnswer'>, YTNoOldAnswer(), <traceback object at 0x597b518>)
  989. ZeldovichPancake__test_almost_standard.test_almost_standard: ERROR (<class 'yt.utilities.exceptions.YTNoOldAnswer'>, YTNoOldAnswer(), <traceback object at 0x597b368>)
  990. ZeldovichPancake__test_almost_standard.test_almost_standard: ERROR (<class 'yt.utilities.exceptions.YTNoOldAnswer'>, YTNoOldAnswer(), <traceback object at 0x5cff638>)
  991. ZeldovichPancake__test_almost_standard.test_almost_standard: ERROR (<class 'yt.utilities.exceptions.YTNoOldAnswer'>, YTNoOldAnswer(), <traceback object at 0x5cffa70>)
  992. ExtremeAdvectionTest__test_standard.test_standard: ERROR (<class 'yt.utilities.exceptions.YTNoOldAnswer'>, YTNoOldAnswer(), <traceback object at 0x5c8c7e8>)
  993. ExtremeAdvectionTest__test_standard.test_standard: ERROR (<class 'yt.utilities.exceptions.YTNoOldAnswer'>, YTNoOldAnswer(), <traceback object at 0x6584518>)
  994. ExtremeAdvectionTest__test_standard.test_standard: ERROR (<class 'yt.utilities.exceptions.YTNoOldAnswer'>, YTNoOldAnswer(), <traceback object at 0x65844d0>)
  995. ExtremeAdvectionTest__test_standard.test_standard: ERROR (<class 'yt.utilities.exceptions.YTNoOldAnswer'>, YTNoOldAnswer(), <traceback object at 0x65841b8>)
  996. ExtremeAdvectionTest__test_standard.test_standard: ERROR (<class 'yt.utilities.exceptions.YTNoOldAnswer'>, YTNoOldAnswer(), <traceback object at 0x65843f8>)
  997. ExtremeAdvectionTest__test_standard.test_standard: ERROR (<class 'yt.utilities.exceptions.YTNoOldAnswer'>, YTNoOldAnswer(), <traceback object at 0x597d3b0>)
  998. ExtremeAdvectionTest__test_standard.test_standard: ERROR (<class 'yt.utilities.exceptions.YTNoOldAnswer'>, YTNoOldAnswer(), <traceback object at 0x6584248>)
  999. ExtremeAdvectionTest__test_standard.test_standard: ERROR (<class 'yt.utilities.exceptions.YTNoOldAnswer'>, YTNoOldAnswer(), <traceback object at 0x5cf15a8>)
  1000. ExtremeAdvectionTest__test_standard.test_standard: ERROR (<class 'yt.utilities.exceptions.YTNoOldAnswer'>, YTNoOldAnswer(), <traceback object at 0x5eacdd0>)
  1001. ExtremeAdvectionTest__test_standard.test_standard: ERROR (<class 'yt.utilities.exceptions.YTNoOldAnswer'>, YTNoOldAnswer(), <traceback object at 0x5ea8320>)
  1002. ExtremeAdvectionTest__test_standard.test_standard: ERROR (<class 'yt.utilities.exceptions.YTNoOldAnswer'>, YTNoOldAnswer(), <traceback object at 0x5ecfc20>)
  1003. ExtremeAdvectionTest__test_standard.test_standard: ERROR (<class 'yt.utilities.exceptions.YTNoOldAnswer'>, YTNoOldAnswer(), <traceback object at 0x5ecf5a8>)
  1004. ExtremeAdvectionTest__test_standard.test_standard: ERROR (<class 'yt.utilities.exceptions.YTNoOldAnswer'>, YTNoOldAnswer(), <traceback object at 0x5ecf560>)
  1005. ExtremeAdvectionTest__test_standard.test_standard: ERROR (<class 'yt.utilities.exceptions.YTNoOldAnswer'>, YTNoOldAnswer(), <traceback object at 0x5ecf320>)
  1006. ExtremeAdvectionTest__test_standard.test_standard: ERROR (<class 'yt.utilities.exceptions.YTNoOldAnswer'>, YTNoOldAnswer(), <traceback object at 0x597d950>)
  1007. ExtremeAdvectionTest__test_standard.test_standard: ERROR (<class 'yt.utilities.exceptions.YTNoOldAnswer'>, YTNoOldAnswer(), <traceback object at 0x5c976c8>)
  1008. ExtremeAdvectionTest__test_standard.test_standard: ERROR (<class 'yt.utilities.exceptions.YTNoOldAnswer'>, YTNoOldAnswer(), <traceback object at 0x597d5f0>)
  1009. ExtremeAdvectionTest__test_standard.test_standard: ERROR (<class 'yt.utilities.exceptions.YTNoOldAnswer'>, YTNoOldAnswer(), <traceback object at 0x5eacdd0>)
  1010. ExtremeAdvectionTest__test_standard.test_standard: ERROR (<class 'yt.utilities.exceptions.YTNoOldAnswer'>, YTNoOldAnswer(), <traceback object at 0x6584cf8>)
  1011. ExtremeAdvectionTest__test_standard.test_standard: ERROR (<class 'yt.utilities.exceptions.YTNoOldAnswer'>, YTNoOldAnswer(), <traceback object at 0x6584cb0>)
  1012. ExtremeAdvectionTest__test_standard.test_standard: ERROR (<class 'yt.utilities.exceptions.YTNoOldAnswer'>, YTNoOldAnswer(), <traceback object at 0x5ecf488>)
  1013. ExtremeAdvectionTest__test_standard.test_standard: ERROR (<class 'yt.utilities.exceptions.YTNoOldAnswer'>, YTNoOldAnswer(), <traceback object at 0x5ecfe18>)
  1014. ExtremeAdvectionTest__test_standard.test_standard: ERROR (<class 'yt.utilities.exceptions.YTNoOldAnswer'>, YTNoOldAnswer(), <traceback object at 0x5ecf0e0>)
  1015. ExtremeAdvectionTest__test_standard.test_standard: ERROR (<class 'yt.utilities.exceptions.YTNoOldAnswer'>, YTNoOldAnswer(), <traceback object at 0x6113d40>)
  1016. ExtremeAdvectionTest__test_standard.test_standard: ERROR (<class 'yt.utilities.exceptions.YTNoOldAnswer'>, YTNoOldAnswer(), <traceback object at 0x60d3e18>)
  1017. ExtremeAdvectionTest__test_standard.test_standard: ERROR (<class 'yt.utilities.exceptions.YTNoOldAnswer'>, YTNoOldAnswer(), <traceback object at 0x5cf2a28>)
  1018. ExtremeAdvectionTest__test_standard.test_standard: ERROR (<class 'yt.utilities.exceptions.YTNoOldAnswer'>, YTNoOldAnswer(), <traceback object at 0x5ecf560>)
  1019. ExtremeAdvectionTest__test_standard.test_standard: ERROR (<class 'yt.utilities.exceptions.YTNoOldAnswer'>, YTNoOldAnswer(), <traceback object at 0x61077a0>)
RAW Paste Data
We use cookies for various purposes including analytics. By continuing to use Pastebin, you agree to our use of cookies as described in the Cookies Policy. OK, I Understand
Top