Advertisement
rohankanojia

Untitled

Apr 26th, 2018
47
0
Never
Not a member of Pastebin yet? Sign Up, it unlocks many cool features!
text 37.80 KB | None | 0 0
  1. OpenShift Build hshinde/test-jenkins-base-image-again-83-1 from https://github.com/hrishin/test-jenkins-base-image-again-83.git
  2. 14:54:04 Connecting to https://api.github.com using hrishin/****** (cd-github)
  3. Obtained Jenkinsfile from 8add262a5639108b46c7d05a94db8ae23eb550a8
  4. Loading library github.com/fabric8io/fabric8-pipeline-library@master
  5. Attempting to resolve master from remote references...
  6. > git --version # timeout=10
  7. > git ls-remote -h -t https://github.com/fabric8io/fabric8-pipeline-library.git # timeout=10
  8. Found match: refs/heads/master revision 0bff0f50a2af9a0dcc4d2c4abb28d1eafcbfdfb9
  9. Cloning the remote Git repository
  10. Cloning with configured refspecs honoured and without tags
  11. Cloning repository https://github.com/fabric8io/fabric8-pipeline-library.git
  12. > git init /var/lib/jenkins/jobs/hrishin/jobs/test-jenkins-base-image-again-83/branches/master/workspace@libs/github.com/fabric8io/fabric8-pipeline-library # timeout=10
  13. Fetching upstream changes from https://github.com/fabric8io/fabric8-pipeline-library.git
  14. > git --version # timeout=10
  15. > git fetch --no-tags --progress https://github.com/fabric8io/fabric8-pipeline-library.git +refs/heads/*:refs/remotes/origin/*
  16. > git config remote.origin.url https://github.com/fabric8io/fabric8-pipeline-library.git # timeout=10
  17. > git config --add remote.origin.fetch +refs/heads/*:refs/remotes/origin/* # timeout=10
  18. > git config remote.origin.url https://github.com/fabric8io/fabric8-pipeline-library.git # timeout=10
  19. Fetching without tags
  20. Fetching upstream changes from https://github.com/fabric8io/fabric8-pipeline-library.git
  21. > git fetch --no-tags --progress https://github.com/fabric8io/fabric8-pipeline-library.git +refs/heads/*:refs/remotes/origin/*
  22. Checking out Revision 0bff0f50a2af9a0dcc4d2c4abb28d1eafcbfdfb9 (master)
  23. > git config core.sparsecheckout # timeout=10
  24. > git checkout -f 0bff0f50a2af9a0dcc4d2c4abb28d1eafcbfdfb9
  25. Commit message: "Merge pull request #399 from edewit/versions-update"
  26. First time build. Skipping changelog.
  27. [Pipeline] echo
  28. Loaded PipelineConfiguration PipelineConfiguration{jobNameToKindMap={}, ciBranchPatterns=[PR-.*], cdBranchPatterns=[master], cdGitHostAndOrganisationToBranchPatterns={}, disableITestsCD=false, disableITestsCI=false, useDockerSocketFlag=false}
  29. [Pipeline] echo
  30. Loaded the useDockerSocket flag false
  31. [Pipeline] podTemplate
  32. [Pipeline] {
  33. [Pipeline] node
  34. Still waiting to schedule task
  35. jenkins-slave-5b4h1-prxxd is offline
  36. Running on jenkins-slave-5b4h1-prxxd in /home/jenkins/workspace/-base-image-again-83_master-IDMCDLVOPH6T6IZTWJHFBEQLPJS2QQUMOYO2RLXPXZIFQ47WE6JA
  37. [Pipeline] {
  38. [Pipeline] checkout
  39. Cloning the remote Git repository
  40. Cloning with configured refspecs honoured and without tags
  41. Cloning repository https://github.com/hrishin/test-jenkins-base-image-again-83.git
  42. > git init /home/jenkins/workspace/-base-image-again-83_master-IDMCDLVOPH6T6IZTWJHFBEQLPJS2QQUMOYO2RLXPXZIFQ47WE6JA # timeout=10
  43. Fetching upstream changes from https://github.com/hrishin/test-jenkins-base-image-again-83.git
  44. > git --version # timeout=10
  45. using GIT_ASKPASS to set credentials cd-github
  46. > git fetch --no-tags --progress https://github.com/hrishin/test-jenkins-base-image-again-83.git +refs/heads/master:refs/remotes/origin/master
  47. > git config remote.origin.url https://github.com/hrishin/test-jenkins-base-image-again-83.git # timeout=10
  48. > git config --add remote.origin.fetch +refs/heads/master:refs/remotes/origin/master # timeout=10
  49. > git config remote.origin.url https://github.com/hrishin/test-jenkins-base-image-again-83.git # timeout=10
  50. Fetching without tags
  51. Fetching upstream changes from https://github.com/hrishin/test-jenkins-base-image-again-83.git
  52. using GIT_ASKPASS to set credentials cd-github
  53. > git fetch --no-tags --progress https://github.com/hrishin/test-jenkins-base-image-again-83.git +refs/heads/master:refs/remotes/origin/master
  54. Checking out Revision 8add262a5639108b46c7d05a94db8ae23eb550a8 (master)
  55. > git config core.sparsecheckout # timeout=10
  56. > git checkout -f 8add262a5639108b46c7d05a94db8ae23eb550a8
  57. Commit message: "Initial import"
  58. First time build. Skipping changelog.
  59. fatal: bad object 0bff0f50a2af9a0dcc4d2c4abb28d1eafcbfdfb9
  60. [Pipeline] echo
  61. Using branch master
  62. [Pipeline] echo
  63. Using branch master
  64. [Pipeline] echo
  65. NOTE: running pipelines for the first time will take longer as build and base docker images are pulled onto the node
  66. [Pipeline] container
  67. [Pipeline] {
  68. [Pipeline] stage
  69. [Pipeline] { (Build Release)
  70. [Pipeline] sh
  71. [-base-image-again-83_master-IDMCDLVOPH6T6IZTWJHFBEQLPJS2QQUMOYO2RLXPXZIFQ47WE6JA] Running shell script
  72. + git checkout -b hrishin/test-jenkins-base-image-again-83/master-1.0.1
  73. Switched to a new branch 'hrishin/test-jenkins-base-image-again-83/master-1.0.1'
  74. [Pipeline] readMavenPom
  75. [Pipeline] echo
  76. patching maven plugin for spring-boot-booster-parent v1.5.10-15
  77. [Pipeline] writeMavenPom
  78. [Pipeline] sh
  79. [-base-image-again-83_master-IDMCDLVOPH6T6IZTWJHFBEQLPJS2QQUMOYO2RLXPXZIFQ47WE6JA] Running shell script
  80. + mvn org.codehaus.mojo:versions-maven-plugin:2.5:set -U -DnewVersion=1.0.1
  81. Picked up _JAVA_OPTIONS: -Duser.home=/root/ -XX:+UnlockExperimentalVMOptions -XX:+UseCGroupMemoryLimitForHeap -Dsun.zip.disableMemoryMapping=true -XX:+UseParallelGC -XX:MinHeapFreeRatio=5 -XX:MaxHeapFreeRatio=10 -XX:GCTimeRatio=4 -XX:AdaptiveSizePolicyWeight=90 -Xms10m -Xmx192m
  82. [INFO] Scanning for projects...
  83. [INFO]
  84. [INFO] ------------------------------------------------------------------------
  85. [INFO] Building Spring Boot - HTTP Booster 1.0.0-SNAPSHOT
  86. [INFO] ------------------------------------------------------------------------
  87. [INFO]
  88. [INFO] --- versions-maven-plugin:2.5:set (default-cli) @ test-jenkins-base-image-again-83 ---
  89. [INFO] Searching for local aggregator root...
  90. [INFO] Local aggregation root: /home/jenkins/workspace/-base-image-again-83_master-IDMCDLVOPH6T6IZTWJHFBEQLPJS2QQUMOYO2RLXPXZIFQ47WE6JA
  91. [INFO] Processing change of io.openshift.booster:test-jenkins-base-image-again-83:1.0.0-SNAPSHOT -> 1.0.1
  92. [INFO] Processing io.openshift.booster:test-jenkins-base-image-again-83
  93. [INFO] Updating project io.openshift.booster:test-jenkins-base-image-again-83
  94. [INFO] from version 1.0.0-SNAPSHOT to 1.0.1
  95. [INFO]
  96. [INFO] ------------------------------------------------------------------------
  97. [INFO] BUILD SUCCESS
  98. [INFO] ------------------------------------------------------------------------
  99. [INFO] Total time: 17.008 s
  100. [INFO] Finished at: 2018-04-26T14:55:56+00:00
  101. [INFO] Final Memory: 11M/16M
  102. [INFO] ------------------------------------------------------------------------
  103. [Pipeline] sh
  104. [-base-image-again-83_master-IDMCDLVOPH6T6IZTWJHFBEQLPJS2QQUMOYO2RLXPXZIFQ47WE6JA] Running shell script
  105. + mvn clean -B -e -U deploy -Dmaven.test.skip=false -P openshift
  106. Picked up _JAVA_OPTIONS: -Duser.home=/root/ -XX:+UnlockExperimentalVMOptions -XX:+UseCGroupMemoryLimitForHeap -Dsun.zip.disableMemoryMapping=true -XX:+UseParallelGC -XX:MinHeapFreeRatio=5 -XX:MaxHeapFreeRatio=10 -XX:GCTimeRatio=4 -XX:AdaptiveSizePolicyWeight=90 -Xms10m -Xmx192m
  107. [INFO] Error stacktraces are turned on.
  108. [INFO] Scanning for projects...
  109. [INFO]
  110. [INFO] ------------------------------------------------------------------------
  111. [INFO] Building Spring Boot - HTTP Booster 1.0.1
  112. [INFO] ------------------------------------------------------------------------
  113. [INFO]
  114. [INFO] --- maven-clean-plugin:3.0.0:clean (default-clean) @ test-jenkins-base-image-again-83 ---
  115. [INFO]
  116. [INFO] --- maven-enforcer-plugin:3.0.0-M1:enforce (enforce-java-version) @ test-jenkins-base-image-again-83 ---
  117. [INFO]
  118. [INFO] --- maven-enforcer-plugin:3.0.0-M1:enforce (enforce-maven-version) @ test-jenkins-base-image-again-83 ---
  119. [INFO]
  120. [INFO] --- buildnumber-maven-plugin:1.4:create (get-scm-revision) @ test-jenkins-base-image-again-83 ---
  121. [INFO] Executing: /bin/sh -c cd '/home/jenkins/workspace/-base-image-again-83_master-IDMCDLVOPH6T6IZTWJHFBEQLPJS2QQUMOYO2RLXPXZIFQ47WE6JA' && 'git' 'rev-parse' '--verify' 'HEAD'
  122. [INFO] Working directory: /home/jenkins/workspace/-base-image-again-83_master-IDMCDLVOPH6T6IZTWJHFBEQLPJS2QQUMOYO2RLXPXZIFQ47WE6JA
  123. [INFO] Storing buildNumber: 8add262a5639108b46c7d05a94db8ae23eb550a8 at timestamp: 1524754613716
  124. [INFO] Storing buildScmBranch: hrishin/test-jenkins-base-image-again-83/master-1.0.1
  125. [INFO]
  126. [INFO] --- maven-resources-plugin:3.0.2:resources (default-resources) @ test-jenkins-base-image-again-83 ---
  127. [INFO] Using 'UTF-8' encoding to copy filtered resources.
  128. [INFO] Copying 2 resources
  129. [INFO]
  130. [INFO] --- fabric8-maven-plugin:3.5.38:resource (fmp) @ test-jenkins-base-image-again-83 ---
  131. Apr 26, 2018 2:57:03 PM org.apache.maven.wagon.providers.http.httpclient.impl.execchain.RetryExec execute
  132. INFO: I/O exception (java.net.SocketException) caught when processing request to {s}->https://repo.maven.apache.org:443: Connection reset
  133. Apr 26, 2018 2:57:03 PM org.apache.maven.wagon.providers.http.httpclient.impl.execchain.RetryExec execute
  134. INFO: Retrying request to {s}->https://repo.maven.apache.org:443
  135. [INFO] F8: Running in OpenShift mode
  136. [INFO] F8: Using docker image name of namespace: hshinde-jenkins
  137. [INFO] F8: Running generator spring-boot
  138. [INFO] F8: spring-boot: Using Docker image registry.access.redhat.com/redhat-openjdk-18/openjdk18-openshift:1.2 as base / builder
  139. [INFO] F8: using resource templates from /home/jenkins/workspace/-base-image-again-83_master-IDMCDLVOPH6T6IZTWJHFBEQLPJS2QQUMOYO2RLXPXZIFQ47WE6JA/src/main/fabric8
  140. [INFO] F8: fmp-controller: Adding a default Deployment
  141. [INFO] F8: fmp-service: Adding a default service 'test-jenkins-base-image-again-83' with ports [8080]
  142. [INFO] F8: spring-boot-health-check: Adding readiness probe on port 8080, path='/health', scheme='HTTP', with initial delay 10 seconds
  143. [INFO] F8: spring-boot-health-check: Adding liveness probe on port 8080, path='/health', scheme='HTTP', with initial delay 180 seconds
  144. [INFO] F8: fmp-revision-history: Adding revision history limit to 2
  145. [INFO] F8: f8-icon: Adding icon for deployment
  146. [INFO] F8: f8-icon: Adding icon for service
  147. [INFO] F8: validating /home/jenkins/workspace/-base-image-again-83_master-IDMCDLVOPH6T6IZTWJHFBEQLPJS2QQUMOYO2RLXPXZIFQ47WE6JA/target/classes/META-INF/fabric8/openshift/test-jenkins-base-image-again-83-svc.yml resource
  148. [INFO] F8: validating /home/jenkins/workspace/-base-image-again-83_master-IDMCDLVOPH6T6IZTWJHFBEQLPJS2QQUMOYO2RLXPXZIFQ47WE6JA/target/classes/META-INF/fabric8/openshift/test-jenkins-base-image-again-83-deploymentconfig.yml resource
  149. [INFO] F8: validating /home/jenkins/workspace/-base-image-again-83_master-IDMCDLVOPH6T6IZTWJHFBEQLPJS2QQUMOYO2RLXPXZIFQ47WE6JA/target/classes/META-INF/fabric8/openshift/test-jenkins-base-image-again-83-route.yml resource
  150. [INFO] F8: validating /home/jenkins/workspace/-base-image-again-83_master-IDMCDLVOPH6T6IZTWJHFBEQLPJS2QQUMOYO2RLXPXZIFQ47WE6JA/target/classes/META-INF/fabric8/kubernetes/test-jenkins-base-image-again-83-svc.yml resource
  151. [INFO] F8: validating /home/jenkins/workspace/-base-image-again-83_master-IDMCDLVOPH6T6IZTWJHFBEQLPJS2QQUMOYO2RLXPXZIFQ47WE6JA/target/classes/META-INF/fabric8/kubernetes/test-jenkins-base-image-again-83-deployment.yml resource
  152. [INFO]
  153. [INFO] --- maven-compiler-plugin:3.7.0:compile (default-compile) @ test-jenkins-base-image-again-83 ---
  154. Apr 26, 2018 2:57:35 PM org.apache.maven.wagon.providers.http.httpclient.impl.execchain.RetryExec execute
  155. INFO: I/O exception (java.net.SocketException) caught when processing request to {s}->https://repo1.maven.org:443: Connection reset
  156. Apr 26, 2018 2:57:35 PM org.apache.maven.wagon.providers.http.httpclient.impl.execchain.RetryExec execute
  157. INFO: Retrying request to {s}->https://repo1.maven.org:443
  158. [INFO] Changes detected - recompiling the module!
  159. [INFO] Compiling 4 source files to /home/jenkins/workspace/-base-image-again-83_master-IDMCDLVOPH6T6IZTWJHFBEQLPJS2QQUMOYO2RLXPXZIFQ47WE6JA/target/classes
  160. [INFO]
  161. [INFO] --- maven-resources-plugin:3.0.2:testResources (default-testResources) @ test-jenkins-base-image-again-83 ---
  162. [INFO] Using 'UTF-8' encoding to copy filtered resources.
  163. [INFO] Copying 2 resources
  164. [INFO]
  165. [INFO] --- maven-compiler-plugin:3.7.0:testCompile (default-testCompile) @ test-jenkins-base-image-again-83 ---
  166. [INFO] Changes detected - recompiling the module!
  167. [INFO] Compiling 3 source files to /home/jenkins/workspace/-base-image-again-83_master-IDMCDLVOPH6T6IZTWJHFBEQLPJS2QQUMOYO2RLXPXZIFQ47WE6JA/target/test-classes
  168. [INFO]
  169. [INFO] --- maven-surefire-plugin:2.20:test (default-test) @ test-jenkins-base-image-again-83 ---
  170. [INFO] Surefire report directory: /home/jenkins/workspace/-base-image-again-83_master-IDMCDLVOPH6T6IZTWJHFBEQLPJS2QQUMOYO2RLXPXZIFQ47WE6JA/target/surefire-reports
  171. [INFO]
  172. [INFO] -------------------------------------------------------
  173. [INFO] T E S T S
  174. [INFO] -------------------------------------------------------
  175. [INFO] Running io.openshift.booster.LocalTest
  176. 2018-04-26 14:57:43.925 INFO --- [ main] .b.t.c.SpringBootTestContextBootstrapper : Neither @ContextConfiguration nor @ContextHierarchy found for test class [io.openshift.booster.LocalTest], using SpringBootContextLoader
  177. 2018-04-26 14:57:43.934 INFO --- [ main] o.s.t.c.support.AbstractContextLoader : Could not detect default resource locations for test class [io.openshift.booster.LocalTest]: no resource found for suffixes {-context.xml, Context.groovy}.
  178. 2018-04-26 14:57:43.935 INFO --- [ main] t.c.s.AnnotationConfigContextLoaderUtils : Could not detect default configuration classes for test class [io.openshift.booster.LocalTest]: LocalTest does not declare any static, non-private, non-final, nested classes annotated with @Configuration.
  179. 2018-04-26 14:57:44.145 INFO --- [ main] .b.t.c.SpringBootTestContextBootstrapper : Found @SpringBootConfiguration io.openshift.booster.BoosterApplication for test class io.openshift.booster.LocalTest
  180. 2018-04-26 14:57:44.222 INFO --- [ main] .b.t.c.SpringBootTestContextBootstrapper : Loaded default TestExecutionListener class names from location [META-INF/spring.factories]: [org.springframework.boot.test.mock.mockito.MockitoTestExecutionListener, org.springframework.boot.test.mock.mockito.ResetMocksTestExecutionListener, org.springframework.boot.test.autoconfigure.restdocs.RestDocsTestExecutionListener, org.springframework.boot.test.autoconfigure.web.client.MockRestServiceServerResetTestExecutionListener, org.springframework.boot.test.autoconfigure.web.servlet.MockMvcPrintOnlyOnFailureTestExecutionListener, org.springframework.boot.test.autoconfigure.web.servlet.WebDriverTestExecutionListener, org.springframework.test.context.web.ServletTestExecutionListener, org.springframework.test.context.support.DirtiesContextBeforeModesTestExecutionListener, org.springframework.test.context.support.DependencyInjectionTestExecutionListener, org.springframework.test.context.support.DirtiesContextTestExecutionListener, org.springframework.test.context.transaction.TransactionalTestExecutionListener, org.springframework.test.context.jdbc.SqlScriptsTestExecutionListener]
  181. 2018-04-26 14:57:44.315 INFO --- [ main] .b.t.c.SpringBootTestContextBootstrapper : Using TestExecutionListeners: [org.springframework.test.context.web.ServletTestExecutionListener@f4ea7c, org.springframework.test.context.support.DirtiesContextBeforeModesTestExecutionListener@16813f3, org.springframework.boot.test.autoconfigure.SpringBootDependencyInjectionTestExecutionListener@fe5c40, org.springframework.test.context.support.DirtiesContextTestExecutionListener@1ebb011, org.springframework.boot.test.mock.mockito.MockitoTestExecutionListener@e31a9a, org.springframework.boot.test.mock.mockito.ResetMocksTestExecutionListener@11774fe, org.springframework.boot.test.autoconfigure.restdocs.RestDocsTestExecutionListener@18d2680, org.springframework.boot.test.autoconfigure.web.client.MockRestServiceServerResetTestExecutionListener@1847718, org.springframework.boot.test.autoconfigure.web.servlet.MockMvcPrintOnlyOnFailureTestExecutionListener@13b84b8, org.springframework.boot.test.autoconfigure.web.servlet.WebDriverTestExecutionListener@1a3af25]
  182.  
  183. . ____ _ __ _ _
  184. /\\ / ___'_ __ _ _(_)_ __ __ _ \ \ \ \
  185. ( ( )\___ | '_ | '_| | '_ \/ _` | \ \ \ \
  186. \\/ ___)| |_)| | | | | || (_| | ) ) ) )
  187. ' |____| .__|_| |_|_| |_\__, | / / / /
  188. =========|_|==============|___/=/_/_/_/
  189. :: Spring Boot :: (v1.5.10.RELEASE)
  190.  
  191. 2018-04-26 14:57:45.333 INFO 274 --- [ main] io.openshift.booster.LocalTest : Starting LocalTest on jenkins-slave-5b4h1-prxxd with PID 274 (started by ? in /home/jenkins/workspace/-base-image-again-83_master-IDMCDLVOPH6T6IZTWJHFBEQLPJS2QQUMOYO2RLXPXZIFQ47WE6JA)
  192. 2018-04-26 14:57:45.334 INFO 274 --- [ main] io.openshift.booster.LocalTest : No active profile set, falling back to default profiles: default
  193. 2018-04-26 14:57:46.524 INFO 274 --- [ main] ationConfigEmbeddedWebApplicationContext : Refreshing org.springframework.boot.context.embedded.AnnotationConfigEmbeddedWebApplicationContext@9a5ed8: startup date [Thu Apr 26 14:57:46 UTC 2018]; root of context hierarchy
  194. 2018-04-26 14:57:49.220 INFO 274 --- [ main] o.s.b.f.xml.XmlBeanDefinitionReader : Loading XML bean definitions from class path resource [META-INF/cxf/cxf.xml]
  195. 2018-04-26 14:57:51.440 INFO 274 --- [ main] f.a.AutowiredAnnotationBeanPostProcessor : JSR-330 'javax.inject.Inject' annotation found and supported for autowiring
  196. 2018-04-26 14:57:54.716 INFO 274 --- [ main] s.b.c.e.t.TomcatEmbeddedServletContainer : Tomcat initialized with port(s): 0 (http)
  197. 2018-04-26 14:57:54.837 INFO 274 --- [ main] o.apache.catalina.core.StandardService : Starting service [Tomcat]
  198. 2018-04-26 14:57:54.838 INFO 274 --- [ main] org.apache.catalina.core.StandardEngine : Starting Servlet Engine: Apache Tomcat/8.5.20
  199. 2018-04-26 14:57:55.735 INFO 274 --- [ost-startStop-1] o.a.c.c.C.[Tomcat].[localhost].[/] : Initializing Spring embedded WebApplicationContext
  200. 2018-04-26 14:57:55.737 INFO 274 --- [ost-startStop-1] o.s.web.context.ContextLoader : Root WebApplicationContext: initialization completed in 9217 ms
  201. 2018-04-26 14:58:00.220 INFO 274 --- [ost-startStop-1] o.s.b.w.servlet.ServletRegistrationBean : Mapping servlet: 'dispatcherServlet' to [/]
  202. 2018-04-26 14:58:00.222 INFO 274 --- [ost-startStop-1] o.s.b.w.servlet.ServletRegistrationBean : Mapping servlet: 'CXFServlet' to [/api/*]
  203. 2018-04-26 14:58:00.224 INFO 274 --- [ost-startStop-1] o.s.b.w.servlet.FilterRegistrationBean : Mapping filter: 'metricsFilter' to: [/*]
  204. 2018-04-26 14:58:00.225 INFO 274 --- [ost-startStop-1] o.s.b.w.servlet.FilterRegistrationBean : Mapping filter: 'characterEncodingFilter' to: [/*]
  205. 2018-04-26 14:58:00.225 INFO 274 --- [ost-startStop-1] o.s.b.w.servlet.FilterRegistrationBean : Mapping filter: 'hiddenHttpMethodFilter' to: [/*]
  206. 2018-04-26 14:58:00.225 INFO 274 --- [ost-startStop-1] o.s.b.w.servlet.FilterRegistrationBean : Mapping filter: 'httpPutFormContentFilter' to: [/*]
  207. 2018-04-26 14:58:00.225 INFO 274 --- [ost-startStop-1] o.s.b.w.servlet.FilterRegistrationBean : Mapping filter: 'requestContextFilter' to: [/*]
  208. 2018-04-26 14:58:00.225 INFO 274 --- [ost-startStop-1] o.s.b.w.servlet.FilterRegistrationBean : Mapping filter: 'webRequestLoggingFilter' to: [/*]
  209. 2018-04-26 14:58:00.225 INFO 274 --- [ost-startStop-1] o.s.b.w.servlet.FilterRegistrationBean : Mapping filter: 'applicationContextIdFilter' to: [/*]
  210. 2018-04-26 14:58:05.427 INFO 274 --- [ main] s.w.s.m.m.a.RequestMappingHandlerAdapter : Looking for @ControllerAdvice: org.springframework.boot.context.embedded.AnnotationConfigEmbeddedWebApplicationContext@9a5ed8: startup date [Thu Apr 26 14:57:46 UTC 2018]; root of context hierarchy
  211. 2018-04-26 14:58:05.630 INFO 274 --- [ main] s.w.s.m.m.a.RequestMappingHandlerMapping : Mapped "{[/error],produces=[text/html]}" onto public org.springframework.web.servlet.ModelAndView org.springframework.boot.autoconfigure.web.BasicErrorController.errorHtml(javax.servlet.http.HttpServletRequest,javax.servlet.http.HttpServletResponse)
  212. 2018-04-26 14:58:05.631 INFO 274 --- [ main] s.w.s.m.m.a.RequestMappingHandlerMapping : Mapped "{[/error]}" onto public org.springframework.http.ResponseEntity<java.util.Map<java.lang.String, java.lang.Object>> org.springframework.boot.autoconfigure.web.BasicErrorController.error(javax.servlet.http.HttpServletRequest)
  213. 2018-04-26 14:58:05.838 INFO 274 --- [ main] o.s.w.s.handler.SimpleUrlHandlerMapping : Mapped URL path [/webjars/**] onto handler of type [class org.springframework.web.servlet.resource.ResourceHttpRequestHandler]
  214. 2018-04-26 14:58:05.838 INFO 274 --- [ main] o.s.w.s.handler.SimpleUrlHandlerMapping : Mapped URL path [/**] onto handler of type [class org.springframework.web.servlet.resource.ResourceHttpRequestHandler]
  215. 2018-04-26 14:58:06.313 INFO 274 --- [ main] o.s.w.s.handler.SimpleUrlHandlerMapping : Mapped URL path [/**/favicon.ico] onto handler of type [class org.springframework.web.servlet.resource.ResourceHttpRequestHandler]
  216. 2018-04-26 14:58:06.417 INFO 274 --- [ main] oConfiguration$WelcomePageHandlerMapping : Adding welcome page: class path resource [static/index.html]
  217. 2018-04-26 14:58:07.228 INFO 274 --- [ main] org.apache.cxf.endpoint.ServerImpl : Setting the server's publish address to be /
  218. 2018-04-26 14:58:09.216 INFO 274 --- [ main] o.s.b.a.e.mvc.EndpointHandlerMapping : Mapped "{[/metrics/{name:.*}],methods=[GET],produces=[application/vnd.spring-boot.actuator.v1+json || application/json]}" onto public java.lang.Object org.springframework.boot.actuate.endpoint.mvc.MetricsMvcEndpoint.value(java.lang.String)
  219. 2018-04-26 14:58:09.217 INFO 274 --- [ main] o.s.b.a.e.mvc.EndpointHandlerMapping : Mapped "{[/metrics || /metrics.json],methods=[GET],produces=[application/vnd.spring-boot.actuator.v1+json || application/json]}" onto public java.lang.Object org.springframework.boot.actuate.endpoint.mvc.EndpointMvcAdapter.invoke()
  220. 2018-04-26 14:58:09.218 INFO 274 --- [ main] o.s.b.a.e.mvc.EndpointHandlerMapping : Mapped "{[/dump || /dump.json],methods=[GET],produces=[application/vnd.spring-boot.actuator.v1+json || application/json]}" onto public java.lang.Object org.springframework.boot.actuate.endpoint.mvc.EndpointMvcAdapter.invoke()
  221. 2018-04-26 14:58:09.219 INFO 274 --- [ main] o.s.b.a.e.mvc.EndpointHandlerMapping : Mapped "{[/env/{name:.*}],methods=[GET],produces=[application/vnd.spring-boot.actuator.v1+json || application/json]}" onto public java.lang.Object org.springframework.boot.actuate.endpoint.mvc.EnvironmentMvcEndpoint.value(java.lang.String)
  222. 2018-04-26 14:58:09.219 INFO 274 --- [ main] o.s.b.a.e.mvc.EndpointHandlerMapping : Mapped "{[/env || /env.json],methods=[GET],produces=[application/vnd.spring-boot.actuator.v1+json || application/json]}" onto public java.lang.Object org.springframework.boot.actuate.endpoint.mvc.EndpointMvcAdapter.invoke()
  223. 2018-04-26 14:58:09.221 INFO 274 --- [ main] o.s.b.a.e.mvc.EndpointHandlerMapping : Mapped "{[/loggers/{name:.*}],methods=[GET],produces=[application/vnd.spring-boot.actuator.v1+json || application/json]}" onto public java.lang.Object org.springframework.boot.actuate.endpoint.mvc.LoggersMvcEndpoint.get(java.lang.String)
  224. 2018-04-26 14:58:09.221 INFO 274 --- [ main] o.s.b.a.e.mvc.EndpointHandlerMapping : Mapped "{[/loggers/{name:.*}],methods=[POST],consumes=[application/vnd.spring-boot.actuator.v1+json || application/json],produces=[application/vnd.spring-boot.actuator.v1+json || application/json]}" onto public java.lang.Object org.springframework.boot.actuate.endpoint.mvc.LoggersMvcEndpoint.set(java.lang.String,java.util.Map<java.lang.String, java.lang.String>)
  225. 2018-04-26 14:58:09.222 INFO 274 --- [ main] o.s.b.a.e.mvc.EndpointHandlerMapping : Mapped "{[/loggers || /loggers.json],methods=[GET],produces=[application/vnd.spring-boot.actuator.v1+json || application/json]}" onto public java.lang.Object org.springframework.boot.actuate.endpoint.mvc.EndpointMvcAdapter.invoke()
  226. 2018-04-26 14:58:09.222 INFO 274 --- [ main] o.s.b.a.e.mvc.EndpointHandlerMapping : Mapped "{[/auditevents || /auditevents.json],methods=[GET],produces=[application/vnd.spring-boot.actuator.v1+json || application/json]}" onto public org.springframework.http.ResponseEntity<?> org.springframework.boot.actuate.endpoint.mvc.AuditEventsMvcEndpoint.findByPrincipalAndAfterAndType(java.lang.String,java.util.Date,java.lang.String)
  227. 2018-04-26 14:58:09.224 INFO 274 --- [ main] o.s.b.a.e.mvc.EndpointHandlerMapping : Mapped "{[/health || /health.json],methods=[GET],produces=[application/vnd.spring-boot.actuator.v1+json || application/json]}" onto public java.lang.Object org.springframework.boot.actuate.endpoint.mvc.HealthMvcEndpoint.invoke(javax.servlet.http.HttpServletRequest,java.security.Principal)
  228. 2018-04-26 14:58:09.225 INFO 274 --- [ main] o.s.b.a.e.mvc.EndpointHandlerMapping : Mapped "{[/info || /info.json],methods=[GET],produces=[application/vnd.spring-boot.actuator.v1+json || application/json]}" onto public java.lang.Object org.springframework.boot.actuate.endpoint.mvc.EndpointMvcAdapter.invoke()
  229. 2018-04-26 14:58:09.226 INFO 274 --- [ main] o.s.b.a.e.mvc.EndpointHandlerMapping : Mapped "{[/mappings || /mappings.json],methods=[GET],produces=[application/vnd.spring-boot.actuator.v1+json || application/json]}" onto public java.lang.Object org.springframework.boot.actuate.endpoint.mvc.EndpointMvcAdapter.invoke()
  230. 2018-04-26 14:58:09.227 INFO 274 --- [ main] o.s.b.a.e.mvc.EndpointHandlerMapping : Mapped "{[/trace || /trace.json],methods=[GET],produces=[application/vnd.spring-boot.actuator.v1+json || application/json]}" onto public java.lang.Object org.springframework.boot.actuate.endpoint.mvc.EndpointMvcAdapter.invoke()
  231. 2018-04-26 14:58:09.227 INFO 274 --- [ main] o.s.b.a.e.mvc.EndpointHandlerMapping : Mapped "{[/beans || /beans.json],methods=[GET],produces=[application/vnd.spring-boot.actuator.v1+json || application/json]}" onto public java.lang.Object org.springframework.boot.actuate.endpoint.mvc.EndpointMvcAdapter.invoke()
  232. 2018-04-26 14:58:09.228 INFO 274 --- [ main] o.s.b.a.e.mvc.EndpointHandlerMapping : Mapped "{[/autoconfig || /autoconfig.json],methods=[GET],produces=[application/vnd.spring-boot.actuator.v1+json || application/json]}" onto public java.lang.Object org.springframework.boot.actuate.endpoint.mvc.EndpointMvcAdapter.invoke()
  233. 2018-04-26 14:58:09.229 INFO 274 --- [ main] o.s.b.a.e.mvc.EndpointHandlerMapping : Mapped "{[/configprops || /configprops.json],methods=[GET],produces=[application/vnd.spring-boot.actuator.v1+json || application/json]}" onto public java.lang.Object org.springframework.boot.actuate.endpoint.mvc.EndpointMvcAdapter.invoke()
  234. 2018-04-26 14:58:09.229 INFO 274 --- [ main] o.s.b.a.e.mvc.EndpointHandlerMapping : Mapped "{[/heapdump || /heapdump.json],methods=[GET],produces=[application/octet-stream]}" onto public void org.springframework.boot.actuate.endpoint.mvc.HeapdumpMvcEndpoint.invoke(boolean,javax.servlet.http.HttpServletRequest,javax.servlet.http.HttpServletResponse) throws java.io.IOException,javax.servlet.ServletException
  235. 2018-04-26 14:58:10.022 INFO 274 --- [ main] s.b.c.e.t.TomcatEmbeddedServletContainer : Tomcat started on port(s): 39580 (http)
  236. 2018-04-26 14:58:10.028 INFO 274 --- [ main] io.openshift.booster.LocalTest : Started LocalTest in 25.504 seconds (JVM running for 27.494)
  237. [INFO] Tests run: 2, Failures: 0, Errors: 0, Skipped: 0, Time elapsed: 34.304 s - in io.openshift.booster.LocalTest
  238. 2018-04-26 14:58:17.517 INFO 274 --- [ Thread-4] ationConfigEmbeddedWebApplicationContext : Closing org.springframework.boot.context.embedded.AnnotationConfigEmbeddedWebApplicationContext@9a5ed8: startup date [Thu Apr 26 14:57:46 UTC 2018]; root of context hierarchy
  239. [INFO]
  240. [INFO] Results:
  241. [INFO]
  242. [INFO] Tests run: 2, Failures: 0, Errors: 0, Skipped: 0
  243. [INFO]
  244. [INFO]
  245. [INFO] --- maven-jar-plugin:3.0.2:jar (default-jar) @ test-jenkins-base-image-again-83 ---
  246. [INFO] Building jar: /home/jenkins/workspace/-base-image-again-83_master-IDMCDLVOPH6T6IZTWJHFBEQLPJS2QQUMOYO2RLXPXZIFQ47WE6JA/target/test-jenkins-base-image-again-83-1.0.1.jar
  247. [INFO]
  248. [INFO] --- spring-boot-maven-plugin:1.5.10.RELEASE:repackage (default) @ test-jenkins-base-image-again-83 ---
  249. [INFO] Attaching archive: /home/jenkins/workspace/-base-image-again-83_master-IDMCDLVOPH6T6IZTWJHFBEQLPJS2QQUMOYO2RLXPXZIFQ47WE6JA/target/test-jenkins-base-image-again-83-1.0.1-exec.jar, with classifier: exec
  250. [INFO]
  251. [INFO] --- fabric8-maven-plugin:3.5.38:build (fmp) @ test-jenkins-base-image-again-83 ---
  252. [INFO] F8: Using OpenShift build with strategy S2I
  253. [INFO] F8: Running generator spring-boot
  254. [INFO] F8: spring-boot: Using Docker image registry.access.redhat.com/redhat-openjdk-18/openjdk18-openshift:1.2 as base / builder
  255. [INFO] Copying files to /home/jenkins/workspace/-base-image-again-83_master-IDMCDLVOPH6T6IZTWJHFBEQLPJS2QQUMOYO2RLXPXZIFQ47WE6JA/target/docker/test-jenkins-base-image-again-83/1.0.1/build/maven
  256. [INFO] Building tar: /home/jenkins/workspace/-base-image-again-83_master-IDMCDLVOPH6T6IZTWJHFBEQLPJS2QQUMOYO2RLXPXZIFQ47WE6JA/target/docker/test-jenkins-base-image-again-83/1.0.1/tmp/docker-build.tar
  257. [INFO] F8: [test-jenkins-base-image-again-83:1.0.1] "spring-boot": Created docker source tar /home/jenkins/workspace/-base-image-again-83_master-IDMCDLVOPH6T6IZTWJHFBEQLPJS2QQUMOYO2RLXPXZIFQ47WE6JA/target/docker/test-jenkins-base-image-again-83/1.0.1/tmp/docker-build.tar
  258. [INFO] F8: Creating BuildServiceConfig test-jenkins-base-image-again-83-s2i for Source build
  259. [INFO] F8: Creating ImageStream test-jenkins-base-image-again-83
  260. [INFO] F8: Starting Build test-jenkins-base-image-again-83-s2i
  261. EXITCODE 0[ERROR] F8: Failed to execute the build [Unable to build the image using the OpenShift build service]
  262. [INFO] ------------------------------------------------------------------------
  263. [INFO] BUILD FAILURE
  264. [INFO] ------------------------------------------------------------------------
  265. [INFO] Total time: 07:24 min
  266. [INFO] Finished at: 2018-04-26T15:03:25+00:00
  267. [INFO] Final Memory: 42M/72M
  268. [INFO] ------------------------------------------------------------------------
  269. [ERROR] Failed to execute goal io.fabric8:fabric8-maven-plugin:3.5.38:build (fmp) on project test-jenkins-base-image-again-83: Failed to execute the build: Unable to build the image using the OpenShift build service: An error has occurred. timeout: Socket closed -> [Help 1]
  270. org.apache.maven.lifecycle.LifecycleExecutionException: Failed to execute goal io.fabric8:fabric8-maven-plugin:3.5.38:build (fmp) on project test-jenkins-base-image-again-83: Failed to execute the build
  271. at org.apache.maven.lifecycle.internal.MojoExecutor.execute(MojoExecutor.java:212)
  272. at org.apache.maven.lifecycle.internal.MojoExecutor.execute(MojoExecutor.java:153)
  273. at org.apache.maven.lifecycle.internal.MojoExecutor.execute(MojoExecutor.java:145)
  274. at org.apache.maven.lifecycle.internal.LifecycleModuleBuilder.buildProject(LifecycleModuleBuilder.java:116)
  275. at org.apache.maven.lifecycle.internal.LifecycleModuleBuilder.buildProject(LifecycleModuleBuilder.java:80)
  276. at org.apache.maven.lifecycle.internal.builder.singlethreaded.SingleThreadedBuilder.build(SingleThreadedBuilder.java:51)
  277. at org.apache.maven.lifecycle.internal.LifecycleStarter.execute(LifecycleStarter.java:128)
  278. at org.apache.maven.DefaultMaven.doExecute(DefaultMaven.java:307)
  279. at org.apache.maven.DefaultMaven.doExecute(DefaultMaven.java:193)
  280. at org.apache.maven.DefaultMaven.execute(DefaultMaven.java:106)
  281. at org.apache.maven.cli.MavenCli.execute(MavenCli.java:863)
  282. at org.apache.maven.cli.MavenCli.doMain(MavenCli.java:288)
  283. at org.apache.maven.cli.MavenCli.main(MavenCli.java:199)
  284. at sun.reflect.NativeMethodAccessorImpl.invoke0(Native Method)
  285. at sun.reflect.NativeMethodAccessorImpl.invoke(NativeMethodAccessorImpl.java:62)
  286. at sun.reflect.DelegatingMethodAccessorImpl.invoke(DelegatingMethodAccessorImpl.java:43)
  287. at java.lang.reflect.Method.invoke(Method.java:498)
  288. at org.codehaus.plexus.classworlds.launcher.Launcher.launchEnhanced(Launcher.java:289)
  289. at org.codehaus.plexus.classworlds.launcher.Launcher.launch(Launcher.java:229)
  290. at org.codehaus.plexus.classworlds.launcher.Launcher.mainWithExitCode(Launcher.java:415)
  291. at org.codehaus.plexus.classworlds.launcher.Launcher.main(Launcher.java:356)
  292. Caused by: org.apache.maven.plugin.MojoExecutionException: Failed to execute the build
  293. at io.fabric8.maven.plugin.mojo.build.BuildMojo.buildAndTag(BuildMojo.java:270)
  294. at io.fabric8.maven.docker.BuildMojo.executeInternal(BuildMojo.java:44)
  295. at io.fabric8.maven.plugin.mojo.build.BuildMojo.executeInternal(BuildMojo.java:228)
  296. at io.fabric8.maven.docker.AbstractDockerMojo.execute(AbstractDockerMojo.java:223)
  297. at io.fabric8.maven.plugin.mojo.build.BuildMojo.execute(BuildMojo.java:199)
  298. at org.apache.maven.plugin.DefaultBuildPluginManager.executeMojo(DefaultBuildPluginManager.java:134)
  299. at org.apache.maven.lifecycle.internal.MojoExecutor.execute(MojoExecutor.java:207)
  300. ... 20 more
  301. Caused by: io.fabric8.maven.core.service.Fabric8ServiceException: Unable to build the image using the OpenShift build service
  302. at io.fabric8.maven.core.service.openshift.OpenshiftBuildService.build(OpenshiftBuildService.java:121)
  303. at io.fabric8.maven.plugin.mojo.build.BuildMojo.buildAndTag(BuildMojo.java:267)
  304. ... 26 more
  305. Caused by: io.fabric8.kubernetes.client.KubernetesClientException: An error has occurred.
  306. at io.fabric8.kubernetes.client.KubernetesClientException.launderThrowable(KubernetesClientException.java:62)
  307. at io.fabric8.kubernetes.client.KubernetesClientException.launderThrowable(KubernetesClientException.java:53)
  308. at io.fabric8.openshift.client.dsl.internal.BuildConfigOperationsImpl.fromInputStream(BuildConfigOperationsImpl.java:276)
  309. at io.fabric8.openshift.client.dsl.internal.BuildConfigOperationsImpl.fromFile(BuildConfigOperationsImpl.java:231)
  310. at io.fabric8.openshift.client.dsl.internal.BuildConfigOperationsImpl.fromFile(BuildConfigOperationsImpl.java:68)
  311. at io.fabric8.maven.core.service.openshift.OpenshiftBuildService.startBuild(OpenshiftBuildService.java:361)
  312. at io.fabric8.maven.core.service.openshift.OpenshiftBuildService.build(OpenshiftBuildService.java:111)
  313. ... 27 more
  314. Caused by: java.net.SocketTimeoutException: timeout
  315. at okio.Okio$4.newTimeoutException(Okio.java:230)
  316. at okio.AsyncTimeout.exit(AsyncTimeout.java:285)
  317. at okio.AsyncTimeout$2.read(AsyncTimeout.java:241)
  318. at okio.RealBufferedSource.indexOf(RealBufferedSource.java:345)
  319. at okio.RealBufferedSource.readUtf8LineStrict(RealBufferedSource.java:217)
  320. at okio.RealBufferedSource.readUtf8LineStrict(RealBufferedSource.java:211)
  321. at okhttp3.internal.http1.Http1Codec.readResponseHeaders(Http1Codec.java:187)
  322. at okhttp3.internal.http.CallServerInterceptor.intercept(CallServerInterceptor.java:61)
  323. at okhttp3.internal.http.RealInterceptorChain.proceed(RealInterceptorChain.java:147)
  324. at okhttp3.internal.connection.ConnectInterceptor.intercept(ConnectInterceptor.java:45)
  325. at okhttp3.internal.http.RealInterceptorChain.proceed(RealInterceptorChain.java:147)
  326. at okhttp3.internal.http.RealInterceptorChain.proceed(RealInterceptorChain.java:121)
  327. at okhttp3.internal.cache.CacheInterceptor.intercept(CacheInterceptor.java:93)
  328. at okhttp3.internal.http.RealInterceptorChain.proceed(RealInterceptorChain.java:147)
  329. at okhttp3.internal.http.RealInterceptorChain.proceed(RealInterceptorChain.java:121)
  330. at okhttp3.internal.http.BridgeInterceptor.intercept(BridgeInterceptor.java:93)
  331. at okhttp3.internal.http.RealInterceptorChain.proceed(RealInterceptorChain.java:147)
  332. at okhttp3.internal.http.RetryAndFollowUpInterceptor.intercept(RetryAndFollowUpInterceptor.java:125)
  333. at okhttp3.internal.http.RealInterceptorChain.proceed(RealInterceptorChain.java:147)
  334. at okhttp3.internal.http.RealInterceptorChain.proceed(RealInterceptorChain.java:121)
  335. at io.fabric8.openshift.client.internal.OpenShiftOAuthInterceptor.intercept(OpenShiftOAuthInterceptor.java:66)
  336. at okhttp3.internal.http.RealInterceptorChain.proceed(RealInterceptorChain.java:147)
  337. at okhttp3.internal.http.RealInterceptorChain.proceed(RealInterceptorChain.java:121)
  338. at okhttp3.RealCall.getResponseWithInterceptorChain(RealCall.java:200)
  339. at okhttp3.RealCall.execute(RealCall.java:77)
  340. at io.fabric8.kubernetes.client.dsl.base.OperationSupport.handleResponse(OperationSupport.java:377)
  341. at io.fabric8.kubernetes.client.dsl.base.OperationSupport.handleResponse(OperationSupport.java:359)
  342. at io.fabric8.openshift.client.dsl.internal.BuildConfigOperationsImpl.fromInputStream(BuildConfigOperationsImpl.java:274)
  343. ... 31 more
  344. Caused by: java.net.SocketException: Socket closed
  345. at java.net.SocketInputStream.read(SocketInputStream.java:204)
  346. at java.net.SocketInputStream.read(SocketInputStream.java:141)
  347. at sun.security.ssl.InputRecord.readFully(InputRecord.java:465)
  348. at sun.security.ssl.InputRecord.read(InputRecord.java:503)
  349. at sun.security.ssl.SSLSocketImpl.readRecord(SSLSocketImpl.java:983)
  350. at sun.security.ssl.SSLSocketImpl.readDataRecord(SSLSocketImpl.java:940)
  351. at sun.security.ssl.AppInputStream.read(AppInputStream.java:105)
  352. at okio.Okio$2.read(Okio.java:139)
  353. at okio.AsyncTimeout$2.read(AsyncTimeout.java:237)
  354. ... 56 more
  355. [ERROR]
  356. [ERROR] Re-run Maven using the -X switch to enable full debug logging.
  357. [ERROR]
  358. [ERROR] For more information about the errors and possible solutions, please read the following articles:
  359. [ERROR] [Help 1] http://cwiki.apache.org/confluence/display/MAVEN/MojoExecutionException
  360. [Pipeline] }
  361. [Pipeline] // stage
  362. [Pipeline] }
  363. [Pipeline] // container
  364. [Pipeline] }
  365. [Pipeline] // node
  366. [Pipeline] }
  367. [Pipeline] // podTemplate
  368. [Pipeline] End of Pipeline
  369.  
  370. GitHub has been notified of this commitโ€™s build result
  371.  
  372. ERROR: script returned exit code 1
  373. Finished: FAILURE
Advertisement
Add Comment
Please, Sign In to add comment
Advertisement