Advertisement
Guest User

errors

a guest
Dec 18th, 2017
261
Never
Not a member of Pastebin yet? Sign Up, it unlocks many cool features!
text 23.97 KB | None
  1. /usr/lib/gcc/x86_64-linux-gnu/6/../../../../lib/libgnutls.a(lt15-mpi.o): In function `wrap_nettle_mpi_print':
  2. /home/user/Documents/git_stuff/gnutls/lib/nettle/mpi.c:43: undefined reference to `nettle_mpz_sizeinbase_256_u'
  3. /home/user/Documents/git_stuff/gnutls/lib/nettle/mpi.c:56: undefined reference to `nettle_mpz_get_str_256'
  4. /home/user/Documents/git_stuff/gnutls/lib/nettle/mpi.c:45: undefined reference to `nettle_mpz_sizeinbase_256_s'
  5. /usr/lib/gcc/x86_64-linux-gnu/6/../../../../lib/libgnutls.a(lt15-mpi.o): In function `wrap_nettle_mpi_scan':
  6. /home/user/Documents/git_stuff/gnutls/lib/nettle/mpi.c:136: undefined reference to `nettle_mpz_set_str_256_u'
  7. /home/user/Documents/git_stuff/gnutls/lib/nettle/mpi.c:138: undefined reference to `nettle_mpz_set_str_256_s'
  8. /usr/lib/gcc/x86_64-linux-gnu/6/../../../../lib/libgnutls.a(lt16-pk.o): In function `ecc_scalar_zclear':
  9. /home/user/Documents/git_stuff/gnutls/lib/nettle/pk.c:89: undefined reference to `nettle_ecc_size'
  10. /usr/lib/gcc/x86_64-linux-gnu/6/../../../../lib/libgnutls.a(lt16-pk.o): In function `_rsa_params_to_privkey':
  11. /home/user/Documents/git_stuff/gnutls/lib/nettle/pk.c:124: undefined reference to `nettle_mpz_sizeinbase_256_u'
  12. /usr/lib/gcc/x86_64-linux-gnu/6/../../../../lib/libgnutls.a(lt16-pk.o): In function `wrap_nettle_pk_generate_params':
  13. /home/user/Documents/git_stuff/gnutls/lib/nettle/pk.c:1110: undefined reference to `nettle_dsa_params_init'
  14. /home/user/Documents/git_stuff/gnutls/lib/nettle/pk.c:1168: undefined reference to `nettle_dsa_generate_params'
  15. /home/user/Documents/git_stuff/gnutls/lib/nettle/pk.c:1194: undefined reference to `nettle_dsa_params_clear'
  16. /home/user/Documents/git_stuff/gnutls/lib/nettle/pk.c:1194: undefined reference to `nettle_dsa_params_clear'
  17. /usr/lib/gcc/x86_64-linux-gnu/6/../../../../lib/libgnutls.a(lt16-pk.o): In function `_ecc_params_to_pubkey':
  18. /home/user/Documents/git_stuff/gnutls/lib/nettle/pk.c:159: undefined reference to `nettle_ecc_point_init'
  19. /home/user/Documents/git_stuff/gnutls/lib/nettle/pk.c:160: undefined reference to `nettle_ecc_point_set'
  20. /home/user/Documents/git_stuff/gnutls/lib/nettle/pk.c:162: undefined reference to `nettle_ecc_point_clear'
  21. /usr/lib/gcc/x86_64-linux-gnu/6/../../../../lib/libgnutls.a(lt16-pk.o): In function `get_supported_nist_curve':
  22. /home/user/Documents/git_stuff/gnutls/lib/nettle/pk.c:1066: undefined reference to `nettle_secp_256r1'
  23. /usr/lib/gcc/x86_64-linux-gnu/6/../../../../lib/libgnutls.a(lt16-pk.o): In function `wrap_nettle_pk_verify_pub_params':
  24. /home/user/Documents/git_stuff/gnutls/lib/nettle/pk.c:2220: undefined reference to `nettle_ecc_point_init'
  25. /home/user/Documents/git_stuff/gnutls/lib/nettle/pk.c:2222: undefined reference to `nettle_ecc_point_set'
  26. /home/user/Documents/git_stuff/gnutls/lib/nettle/pk.c:2236: undefined reference to `nettle_ecc_point_clear'
  27. /usr/lib/gcc/x86_64-linux-gnu/6/../../../../lib/libgnutls.a(lt16-pk.o): In function `get_supported_nist_curve':
  28. /home/user/Documents/git_stuff/gnutls/lib/nettle/pk.c:1063: undefined reference to `nettle_secp_224r1'
  29. /home/user/Documents/git_stuff/gnutls/lib/nettle/pk.c:1061: undefined reference to `nettle_secp_192r1'
  30. /home/user/Documents/git_stuff/gnutls/lib/nettle/pk.c:1070: undefined reference to `nettle_secp_521r1'
  31. /home/user/Documents/git_stuff/gnutls/lib/nettle/pk.c:1068: undefined reference to `nettle_secp_384r1'
  32. /usr/lib/gcc/x86_64-linux-gnu/6/../../../../lib/libgnutls.a(lt16-pk.o): In function `wrap_nettle_pk_verify_pub_params':
  33. /home/user/Documents/git_stuff/gnutls/lib/nettle/pk.c:2231: undefined reference to `nettle_ecc_point_clear'
  34. /usr/lib/gcc/x86_64-linux-gnu/6/../../../../lib/libgnutls.a(lt16-pk.o): In function `_ecc_params_to_privkey':
  35. /home/user/Documents/git_stuff/gnutls/lib/nettle/pk.c:146: undefined reference to `nettle_ecc_scalar_init'
  36. /home/user/Documents/git_stuff/gnutls/lib/nettle/pk.c:147: undefined reference to `nettle_ecc_scalar_set'
  37. /home/user/Documents/git_stuff/gnutls/lib/nettle/pk.c:148: undefined reference to `nettle_ecc_scalar_clear'
  38. /usr/lib/gcc/x86_64-linux-gnu/6/../../../../lib/libgnutls.a(lt16-pk.o): In function `_wrap_nettle_pk_derive':
  39. /home/user/Documents/git_stuff/gnutls/lib/nettle/pk.c:329: undefined reference to `nettle_curve25519_mul'
  40. /usr/lib/gcc/x86_64-linux-gnu/6/../../../../lib/libgnutls.a(lt16-pk.o): In function `get_supported_nist_curve':
  41. /home/user/Documents/git_stuff/gnutls/lib/nettle/pk.c:1066: undefined reference to `nettle_secp_256r1'
  42. /usr/lib/gcc/x86_64-linux-gnu/6/../../../../lib/libgnutls.a(lt16-pk.o): In function `ecc_shared_secret':
  43. /home/user/Documents/git_stuff/gnutls/lib/nettle/pk.c:177: undefined reference to `nettle_ecc_point_init'
  44. /home/user/Documents/git_stuff/gnutls/lib/nettle/pk.c:179: undefined reference to `nettle_ecc_point_mul'
  45. /home/user/Documents/git_stuff/gnutls/lib/nettle/pk.c:181: undefined reference to `nettle_ecc_point_get'
  46. /home/user/Documents/git_stuff/gnutls/lib/nettle/pk.c:182: undefined reference to `nettle_mpz_get_str_256'
  47. /home/user/Documents/git_stuff/gnutls/lib/nettle/pk.c:185: undefined reference to `nettle_ecc_point_clear'
  48. /usr/lib/gcc/x86_64-linux-gnu/6/../../../../lib/libgnutls.a(lt16-pk.o): In function `_wrap_nettle_pk_derive':
  49. /home/user/Documents/git_stuff/gnutls/lib/nettle/pk.c:306: undefined reference to `nettle_ecc_point_clear'
  50. /usr/lib/gcc/x86_64-linux-gnu/6/../../../../lib/libgnutls.a(lt16-pk.o): In function `get_supported_nist_curve':
  51. /home/user/Documents/git_stuff/gnutls/lib/nettle/pk.c:1068: undefined reference to `nettle_secp_384r1'
  52. /home/user/Documents/git_stuff/gnutls/lib/nettle/pk.c:1061: undefined reference to `nettle_secp_192r1'
  53. /home/user/Documents/git_stuff/gnutls/lib/nettle/pk.c:1063: undefined reference to `nettle_secp_224r1'
  54. /home/user/Documents/git_stuff/gnutls/lib/nettle/pk.c:1070: undefined reference to `nettle_secp_521r1'
  55. /usr/lib/gcc/x86_64-linux-gnu/6/../../../../lib/libgnutls.a(lt16-pk.o): In function `_wrap_nettle_pk_derive':
  56. /home/user/Documents/git_stuff/gnutls/lib/nettle/pk.c:288: undefined reference to `nettle_ecc_point_clear'
  57. /home/user/Documents/git_stuff/gnutls/lib/nettle/pk.c:306: undefined reference to `nettle_ecc_point_clear'
  58. /usr/lib/gcc/x86_64-linux-gnu/6/../../../../lib/libgnutls.a(lt16-pk.o): In function `get_supported_nist_curve':
  59. /home/user/Documents/git_stuff/gnutls/lib/nettle/pk.c:1066: undefined reference to `nettle_secp_256r1'
  60. /usr/lib/gcc/x86_64-linux-gnu/6/../../../../lib/libgnutls.a(lt16-pk.o): In function `wrap_nettle_pk_verify_priv_params':
  61. /home/user/Documents/git_stuff/gnutls/lib/nettle/pk.c:2118: undefined reference to `nettle_ecc_point_init'
  62. /home/user/Documents/git_stuff/gnutls/lib/nettle/pk.c:2120: undefined reference to `nettle_ecc_point_set'
  63. /home/user/Documents/git_stuff/gnutls/lib/nettle/pk.c:2155: undefined reference to `nettle_ecc_point_clear'
  64. /usr/lib/gcc/x86_64-linux-gnu/6/../../../../lib/libgnutls.a(lt16-pk.o): In function `get_supported_nist_curve':
  65. /home/user/Documents/git_stuff/gnutls/lib/nettle/pk.c:1061: undefined reference to `nettle_secp_192r1'
  66. /home/user/Documents/git_stuff/gnutls/lib/nettle/pk.c:1070: undefined reference to `nettle_secp_521r1'
  67. /home/user/Documents/git_stuff/gnutls/lib/nettle/pk.c:1068: undefined reference to `nettle_secp_384r1'
  68. /home/user/Documents/git_stuff/gnutls/lib/nettle/pk.c:1063: undefined reference to `nettle_secp_224r1'
  69. /usr/lib/gcc/x86_64-linux-gnu/6/../../../../lib/libgnutls.a(lt16-pk.o): In function `wrap_nettle_pk_verify_priv_params':
  70. /home/user/Documents/git_stuff/gnutls/lib/nettle/pk.c:2173: undefined reference to `nettle_ed25519_sha512_public_key'
  71. /home/user/Documents/git_stuff/gnutls/lib/nettle/pk.c:2114: undefined reference to `nettle_ecc_point_clear'
  72. /home/user/Documents/git_stuff/gnutls/lib/nettle/pk.c:2129: undefined reference to `nettle_ecc_point_clear'
  73. /home/user/Documents/git_stuff/gnutls/lib/nettle/pk.c:2131: undefined reference to `nettle_ecc_point_init'
  74. /home/user/Documents/git_stuff/gnutls/lib/nettle/pk.c:2132: undefined reference to `nettle_ecc_point_mul_g'
  75. /home/user/Documents/git_stuff/gnutls/lib/nettle/pk.c:2136: undefined reference to `nettle_ecc_point_get'
  76. /usr/lib/gcc/x86_64-linux-gnu/6/../../../../lib/libgnutls.a(lt16-pk.o): In function `ecc_point_zclear':
  77. /home/user/Documents/git_stuff/gnutls/lib/nettle/pk.c:96: undefined reference to `nettle_ecc_size_a'
  78. /home/user/Documents/git_stuff/gnutls/lib/nettle/pk.c:97: undefined reference to `nettle_ecc_point_clear'
  79. /usr/lib/gcc/x86_64-linux-gnu/6/../../../../lib/libgnutls.a(lt16-pk.o): In function `wrap_nettle_pk_verify_priv_params':
  80. /home/user/Documents/git_stuff/gnutls/lib/nettle/pk.c:2141: undefined reference to `nettle_ecc_point_get'
  81. /usr/lib/gcc/x86_64-linux-gnu/6/../../../../lib/libgnutls.a(lt16-pk.o): In function `wrap_nettle_pk_fixup':
  82. /home/user/Documents/git_stuff/gnutls/lib/nettle/pk.c:2360: undefined reference to `nettle_mpz_sizeinbase_256_u'
  83. /home/user/Documents/git_stuff/gnutls/lib/nettle/pk.c:2353: undefined reference to `nettle_ed25519_sha512_public_key'
  84. /home/user/Documents/git_stuff/gnutls/lib/nettle/pk.c:2335: undefined reference to `nettle_rsa_private_key_prepare'
  85. /usr/lib/gcc/x86_64-linux-gnu/6/../../../../lib/libgnutls.a(lt16-pk.o): In function `wrap_nettle_pk_generate_keys':
  86. /home/user/Documents/git_stuff/gnutls/lib/nettle/pk.c:1746: undefined reference to `nettle_rsa_public_key_init'
  87. /home/user/Documents/git_stuff/gnutls/lib/nettle/pk.c:1747: undefined reference to `nettle_rsa_private_key_init'
  88. /home/user/Documents/git_stuff/gnutls/lib/nettle/pk.c:1806: undefined reference to `nettle_rsa_private_key_clear'
  89. /home/user/Documents/git_stuff/gnutls/lib/nettle/pk.c:1807: undefined reference to `nettle_rsa_public_key_clear'
  90. /home/user/Documents/git_stuff/gnutls/lib/nettle/pk.c:1696: undefined reference to `nettle_mpz_random_size'
  91. /home/user/Documents/git_stuff/gnutls/lib/nettle/pk.c:1690: undefined reference to `nettle_mpz_random'
  92. /home/user/Documents/git_stuff/gnutls/lib/nettle/pk.c:1696: undefined reference to `nettle_mpz_random_size'
  93. /usr/lib/gcc/x86_64-linux-gnu/6/../../../../lib/libgnutls.a(lt16-pk.o): In function `get_supported_nist_curve':
  94. /home/user/Documents/git_stuff/gnutls/lib/nettle/pk.c:1061: undefined reference to `nettle_secp_192r1'
  95. /usr/lib/gcc/x86_64-linux-gnu/6/../../../../lib/libgnutls.a(lt16-pk.o): In function `wrap_nettle_pk_generate_keys':
  96. /home/user/Documents/git_stuff/gnutls/lib/nettle/pk.c:1866: undefined reference to `nettle_ecc_scalar_init'
  97. /home/user/Documents/git_stuff/gnutls/lib/nettle/pk.c:1867: undefined reference to `nettle_ecc_point_init'
  98. /home/user/Documents/git_stuff/gnutls/lib/nettle/pk.c:1869: undefined reference to `nettle_ecdsa_generate_keypair'
  99. /home/user/Documents/git_stuff/gnutls/lib/nettle/pk.c:1885: undefined reference to `nettle_ecc_point_get'
  100. /home/user/Documents/git_stuff/gnutls/lib/nettle/pk.c:1887: undefined reference to `nettle_ecc_scalar_get'
  101. /home/user/Documents/git_stuff/gnutls/lib/nettle/pk.c:1892: undefined reference to `nettle_ecc_point_clear'
  102. /home/user/Documents/git_stuff/gnutls/lib/nettle/pk.c:1893: undefined reference to `nettle_ecc_scalar_clear'
  103. /usr/lib/gcc/x86_64-linux-gnu/6/../../../../lib/libgnutls.a(lt16-pk.o): In function `get_supported_nist_curve':
  104. /home/user/Documents/git_stuff/gnutls/lib/nettle/pk.c:1068: undefined reference to `nettle_secp_384r1'
  105. /home/user/Documents/git_stuff/gnutls/lib/nettle/pk.c:1066: undefined reference to `nettle_secp_256r1'
  106. /home/user/Documents/git_stuff/gnutls/lib/nettle/pk.c:1063: undefined reference to `nettle_secp_224r1'
  107. /home/user/Documents/git_stuff/gnutls/lib/nettle/pk.c:1070: undefined reference to `nettle_secp_521r1'
  108. /usr/lib/gcc/x86_64-linux-gnu/6/../../../../lib/libgnutls.a(lt16-pk.o): In function `wrap_nettle_pk_generate_keys':
  109. /home/user/Documents/git_stuff/gnutls/lib/nettle/pk.c:1927: undefined reference to `nettle_curve25519_mul_g'
  110. /home/user/Documents/git_stuff/gnutls/lib/nettle/pk.c:1773: undefined reference to `nettle_rsa_generate_keypair'
  111. /home/user/Documents/git_stuff/gnutls/lib/nettle/pk.c:1892: undefined reference to `nettle_ecc_point_clear'
  112. /home/user/Documents/git_stuff/gnutls/lib/nettle/pk.c:1893: undefined reference to `nettle_ecc_scalar_clear'
  113. /home/user/Documents/git_stuff/gnutls/lib/nettle/pk.c:1806: undefined reference to `nettle_rsa_private_key_clear'
  114. /home/user/Documents/git_stuff/gnutls/lib/nettle/pk.c:1807: undefined reference to `nettle_rsa_public_key_clear'
  115. /home/user/Documents/git_stuff/gnutls/lib/nettle/pk.c:1847: undefined reference to `nettle_ed25519_sha512_public_key'
  116. /usr/lib/gcc/x86_64-linux-gnu/6/../../../../lib/libgnutls.a(lt16-pk.o): In function `_rsa_params_to_pubkey':
  117. /home/user/Documents/git_stuff/gnutls/lib/nettle/pk.c:135: undefined reference to `nettle_rsa_public_key_prepare'
  118. /usr/lib/gcc/x86_64-linux-gnu/6/../../../../lib/libgnutls.a(lt16-pk.o): In function `_wrap_nettle_pk_verify':
  119. /home/user/Documents/git_stuff/gnutls/lib/nettle/pk.c:962: undefined reference to `nettle_dsa_verify'
  120. /usr/lib/gcc/x86_64-linux-gnu/6/../../../../lib/libgnutls.a(lt16-pk.o): In function `get_supported_nist_curve':
  121. /home/user/Documents/git_stuff/gnutls/lib/nettle/pk.c:1063: undefined reference to `nettle_secp_224r1'
  122. /usr/lib/gcc/x86_64-linux-gnu/6/../../../../lib/libgnutls.a(lt16-pk.o): In function `_wrap_nettle_pk_verify':
  123. /home/user/Documents/git_stuff/gnutls/lib/nettle/pk.c:925: undefined reference to `nettle_ecdsa_verify'
  124. /home/user/Documents/git_stuff/gnutls/lib/nettle/pk.c:934: undefined reference to `nettle_ecc_point_clear'
  125. /usr/lib/gcc/x86_64-linux-gnu/6/../../../../lib/libgnutls.a(lt16-pk.o): In function `get_supported_nist_curve':
  126. /home/user/Documents/git_stuff/gnutls/lib/nettle/pk.c:1068: undefined reference to `nettle_secp_384r1'
  127. /home/user/Documents/git_stuff/gnutls/lib/nettle/pk.c:1066: undefined reference to `nettle_secp_256r1'
  128. /home/user/Documents/git_stuff/gnutls/lib/nettle/pk.c:1061: undefined reference to `nettle_secp_192r1'
  129. /home/user/Documents/git_stuff/gnutls/lib/nettle/pk.c:1070: undefined reference to `nettle_secp_521r1'
  130. /usr/lib/gcc/x86_64-linux-gnu/6/../../../../lib/libgnutls.a(lt16-pk.o): In function `_wrap_nettle_pk_verify':
  131. /home/user/Documents/git_stuff/gnutls/lib/nettle/pk.c:994: undefined reference to `nettle_rsa_pkcs1_verify'
  132. /home/user/Documents/git_stuff/gnutls/lib/nettle/pk.c:882: undefined reference to `nettle_ed25519_sha512_verify'
  133. /usr/lib/gcc/x86_64-linux-gnu/6/../../../../lib/libgnutls.a(lt16-pk.o): In function `_wrap_nettle_pk_decrypt':
  134. /home/user/Documents/git_stuff/gnutls/lib/nettle/pk.c:459: undefined reference to `nettle_rsa_decrypt_tr'
  135. /usr/lib/gcc/x86_64-linux-gnu/6/../../../../lib/libgnutls.a(lt16-pk.o): In function `_wrap_nettle_pk_encrypt':
  136. /home/user/Documents/git_stuff/gnutls/lib/nettle/pk.c:375: undefined reference to `nettle_rsa_encrypt'
  137. /usr/lib/gcc/x86_64-linux-gnu/6/../../../../lib/libgnutls.a(lt16-pk.o): In function `_wrap_nettle_pk_sign':
  138. /home/user/Documents/git_stuff/gnutls/lib/nettle/pk.c:730: undefined reference to `nettle_rsa_pkcs1_sign_tr'
  139. /home/user/Documents/git_stuff/gnutls/lib/nettle/pk.c:681: undefined reference to `nettle_dsa_signature_init'
  140. /home/user/Documents/git_stuff/gnutls/lib/nettle/pk.c:694: undefined reference to `nettle_dsa_sign'
  141. /home/user/Documents/git_stuff/gnutls/lib/nettle/pk.c:708: undefined reference to `nettle_dsa_signature_clear'
  142. /home/user/Documents/git_stuff/gnutls/lib/nettle/pk.c:708: undefined reference to `nettle_dsa_signature_clear'
  143. /usr/lib/gcc/x86_64-linux-gnu/6/../../../../lib/libgnutls.a(lt16-pk.o): In function `get_supported_nist_curve':
  144. /home/user/Documents/git_stuff/gnutls/lib/nettle/pk.c:1063: undefined reference to `nettle_secp_224r1'
  145. /usr/lib/gcc/x86_64-linux-gnu/6/../../../../lib/libgnutls.a(lt16-pk.o): In function `_wrap_nettle_pk_sign':
  146. /home/user/Documents/git_stuff/gnutls/lib/nettle/pk.c:633: undefined reference to `nettle_dsa_signature_init'
  147. /home/user/Documents/git_stuff/gnutls/lib/nettle/pk.c:646: undefined reference to `nettle_ecdsa_sign'
  148. /home/user/Documents/git_stuff/gnutls/lib/nettle/pk.c:660: undefined reference to `nettle_dsa_signature_clear'
  149. /usr/lib/gcc/x86_64-linux-gnu/6/../../../../lib/libgnutls.a(lt16-pk.o): In function `get_supported_nist_curve':
  150. /home/user/Documents/git_stuff/gnutls/lib/nettle/pk.c:1066: undefined reference to `nettle_secp_256r1'
  151. /home/user/Documents/git_stuff/gnutls/lib/nettle/pk.c:1061: undefined reference to `nettle_secp_192r1'
  152. /home/user/Documents/git_stuff/gnutls/lib/nettle/pk.c:1070: undefined reference to `nettle_secp_521r1'
  153. /home/user/Documents/git_stuff/gnutls/lib/nettle/pk.c:1068: undefined reference to `nettle_secp_384r1'
  154. /usr/lib/gcc/x86_64-linux-gnu/6/../../../../lib/libgnutls.a(lt16-pk.o): In function `_wrap_nettle_pk_sign':
  155. /home/user/Documents/git_stuff/gnutls/lib/nettle/pk.c:608: undefined reference to `nettle_ed25519_sha512_sign'
  156. /home/user/Documents/git_stuff/gnutls/lib/nettle/pk.c:660: undefined reference to `nettle_dsa_signature_clear'
  157. /usr/lib/gcc/x86_64-linux-gnu/6/../../../../lib/libgnutls.a(lt16-pk.o): In function `ecc_scalar_zclear':
  158. /home/user/Documents/git_stuff/gnutls/lib/nettle/pk.c:90: undefined reference to `nettle_ecc_scalar_clear'
  159. /usr/lib/gcc/x86_64-linux-gnu/6/../../../../lib/libgnutls.a(rsa-keygen-fips186.o): In function `rsa_provable_prime':
  160. /home/user/Documents/git_stuff/gnutls/lib/nettle/int/rsa-keygen-fips186.c:177: undefined reference to `nettle_mpz_get_str_256'
  161. /home/user/Documents/git_stuff/gnutls/lib/nettle/int/rsa-keygen-fips186.c:184: undefined reference to `nettle_mpz_set_str_256_u'
  162. /home/user/Documents/git_stuff/gnutls/lib/nettle/int/rsa-keygen-fips186.c:213: undefined reference to `nettle_mpz_get_str_256'
  163. /home/user/Documents/git_stuff/gnutls/lib/nettle/int/rsa-keygen-fips186.c:85: undefined reference to `nettle_mpz_set_str_256_u'
  164. /home/user/Documents/git_stuff/gnutls/lib/nettle/int/rsa-keygen-fips186.c:90: undefined reference to `nettle_mpz_get_str_256'
  165. /home/user/Documents/git_stuff/gnutls/lib/nettle/int/rsa-keygen-fips186.c:97: undefined reference to `nettle_mpz_set_str_256_u'
  166. /usr/lib/gcc/x86_64-linux-gnu/6/../../../../lib/libgnutls.a(rsa-pss-sha256-sign-tr.o): In function `rsa_pss_sha256_sign_digest_tr':
  167. /home/user/Documents/git_stuff/gnutls/lib/nettle/int/rsa-pss-sha256-sign-tr.c:58: undefined reference to `nettle_rsa_compute_root_tr'
  168. /usr/lib/gcc/x86_64-linux-gnu/6/../../../../lib/libgnutls.a(rsa-pss-sha512-sign-tr.o): In function `rsa_pss_sha384_sign_digest_tr':
  169. /home/user/Documents/git_stuff/gnutls/lib/nettle/int/rsa-pss-sha512-sign-tr.c:58: undefined reference to `nettle_rsa_compute_root_tr'
  170. /usr/lib/gcc/x86_64-linux-gnu/6/../../../../lib/libgnutls.a(rsa-pss-sha512-sign-tr.o): In function `rsa_pss_sha512_sign_digest_tr':
  171. /home/user/Documents/git_stuff/gnutls/lib/nettle/int/rsa-pss-sha512-sign-tr.c:81: undefined reference to `nettle_rsa_compute_root_tr'
  172. /usr/lib/gcc/x86_64-linux-gnu/6/../../../../lib/libgnutls.a(dsa-keygen-fips186.o): In function `_dsa_generate_dss_g':
  173. /home/user/Documents/git_stuff/gnutls/lib/nettle/int/dsa-keygen-fips186.c:300: undefined reference to `nettle_mpz_set_str_256_u'
  174. /usr/lib/gcc/x86_64-linux-gnu/6/../../../../lib/libgnutls.a(dsa-keygen-fips186.o): In function `_dsa_generate_dss_pq':
  175. /home/user/Documents/git_stuff/gnutls/lib/nettle/int/dsa-keygen-fips186.c:101: undefined reference to `nettle_mpz_set_str_256_u'
  176. /home/user/Documents/git_stuff/gnutls/lib/nettle/int/dsa-keygen-fips186.c:141: undefined reference to `nettle_mpz_set_str_256_u'
  177. /home/user/Documents/git_stuff/gnutls/lib/nettle/int/dsa-keygen-fips186.c:143: undefined reference to `nettle_mpz_sizeinbase_256_u'
  178. /home/user/Documents/git_stuff/gnutls/lib/nettle/int/dsa-keygen-fips186.c:144: undefined reference to `nettle_mpz_get_str_256'
  179. /home/user/Documents/git_stuff/gnutls/lib/nettle/int/dsa-keygen-fips186.c:152: undefined reference to `nettle_mpz_set_str_256_u'
  180. /home/user/Documents/git_stuff/gnutls/lib/nettle/int/dsa-keygen-fips186.c:191: undefined reference to `nettle_mpz_sizeinbase_256_u'
  181. /home/user/Documents/git_stuff/gnutls/lib/nettle/int/dsa-keygen-fips186.c:192: undefined reference to `nettle_mpz_get_str_256'
  182. /home/user/Documents/git_stuff/gnutls/lib/nettle/int/dsa-keygen-fips186.c:200: undefined reference to `nettle_mpz_set_str_256_u'
  183. /home/user/Documents/git_stuff/gnutls/lib/nettle/int/dsa-keygen-fips186.c:203: undefined reference to `nettle_mpz_sizeinbase_256_u'
  184. /home/user/Documents/git_stuff/gnutls/lib/nettle/int/dsa-keygen-fips186.c:204: undefined reference to `nettle_mpz_get_str_256'
  185. /usr/lib/gcc/x86_64-linux-gnu/6/../../../../lib/libgnutls.a(dsa-keygen-fips186.o): In function `_dsa_generate_dss_xy':
  186. /home/user/Documents/git_stuff/gnutls/lib/nettle/int/dsa-keygen-fips186.c:344: undefined reference to `nettle_mpz_random'
  187. /usr/lib/gcc/x86_64-linux-gnu/6/../../../../lib/libgnutls.a(dsa-validate.o): In function `_dsa_validate_dss_g':
  188. /home/user/Documents/git_stuff/gnutls/lib/nettle/int/dsa-validate.c:91: undefined reference to `nettle_dsa_params_init'
  189. /home/user/Documents/git_stuff/gnutls/lib/nettle/int/dsa-validate.c:134: undefined reference to `nettle_dsa_params_clear'
  190. /usr/lib/gcc/x86_64-linux-gnu/6/../../../../lib/libgnutls.a(dsa-validate.o): In function `_dsa_validate_dss_pq':
  191. /home/user/Documents/git_stuff/gnutls/lib/nettle/int/dsa-validate.c:160: undefined reference to `nettle_dsa_params_init'
  192. /home/user/Documents/git_stuff/gnutls/lib/nettle/int/dsa-validate.c:162: undefined reference to `nettle_mpz_set_str_256_u'
  193. /home/user/Documents/git_stuff/gnutls/lib/nettle/int/dsa-validate.c:237: undefined reference to `nettle_dsa_params_clear'
  194. /usr/lib/gcc/x86_64-linux-gnu/6/../../../../lib/libgnutls.a(provable-prime.o): In function `mpz_seed_sizeinbase_256_u':
  195. /home/user/Documents/git_stuff/gnutls/lib/nettle/int/provable-prime.c:1001: undefined reference to `nettle_mpz_sizeinbase_256_u'
  196. /usr/lib/gcc/x86_64-linux-gnu/6/../../../../lib/libgnutls.a(provable-prime.o): In function `st_provable_prime_small':
  197. /home/user/Documents/git_stuff/gnutls/lib/nettle/int/provable-prime.c:1030: undefined reference to `nettle_mpz_set_str_256_u'
  198. /home/user/Documents/git_stuff/gnutls/lib/nettle/int/provable-prime.c:1039: undefined reference to `nettle_mpz_get_str_256'
  199. /home/user/Documents/git_stuff/gnutls/lib/nettle/int/provable-prime.c:1049: undefined reference to `nettle_mpz_get_str_256'
  200. /usr/lib/gcc/x86_64-linux-gnu/6/../../../../lib/libgnutls.a(provable-prime.o): In function `st_provable_prime':
  201. /home/user/Documents/git_stuff/gnutls/lib/nettle/int/provable-prime.c:1161: undefined reference to `nettle_mpz_set_str_256_u'
  202. /home/user/Documents/git_stuff/gnutls/lib/nettle/int/provable-prime.c:1179: undefined reference to `nettle_mpz_get_str_256'
  203. /home/user/Documents/git_stuff/gnutls/lib/nettle/int/provable-prime.c:1187: undefined reference to `nettle_mpz_set_str_256_u'
  204. /home/user/Documents/git_stuff/gnutls/lib/nettle/int/provable-prime.c:1232: undefined reference to `nettle_mpz_get_str_256'
  205. /home/user/Documents/git_stuff/gnutls/lib/nettle/int/provable-prime.c:1241: undefined reference to `nettle_mpz_set_str_256_u'
  206. /home/user/Documents/git_stuff/gnutls/lib/nettle/int/provable-prime.c:1267: undefined reference to `nettle_mpz_get_str_256'
  207. /usr/lib/gcc/x86_64-linux-gnu/6/../../../../lib/libgnutls.a(provable-prime.o): In function `st_provable_prime_small':
  208. /home/user/Documents/git_stuff/gnutls/lib/nettle/int/provable-prime.c:1090: undefined reference to `nettle_mpz_get_str_256'
  209. /usr/lib/gcc/x86_64-linux-gnu/6/../../../../lib/libgnutls.a(pss.o): In function `nettle_pss_encode_mgf1':
  210. /home/user/Documents/git_stuff/gnutls/lib/nettle/int/pss.c:118: undefined reference to `nettle_mpz_set_str_256_u'
  211. /usr/lib/gcc/x86_64-linux-gnu/6/../../../../lib/libgnutls.a(pss.o): In function `nettle_pss_verify_mgf1':
  212. /home/user/Documents/git_stuff/gnutls/lib/nettle/int/pss.c:155: undefined reference to `nettle_mpz_get_str_256'
  213. collect2: error: ld returned 1 exit status
  214. nbproject/Makefile-Debug.mk:69: recipe for target 'dist/Debug/GNU-Linux/checker' failed
  215. make[2]: *** [dist/Debug/GNU-Linux/checker] Error 1
  216. make[2]: Leaving directory '/root/NetBeansProjects/checker'
  217. nbproject/Makefile-Debug.mk:66: recipe for target '.build-conf' failed
  218. make[1]: *** [.build-conf] Error 2
  219. make[1]: Leaving directory '/root/NetBeansProjects/checker'
  220. nbproject/Makefile-impl.mk:39: recipe for target '.build-impl' failed
  221. make: *** [.build-impl] Error 2
Advertisement
RAW Paste Data Copied
Advertisement