daily pastebin goal
90%
SHARE
TWEET

Krusader build log

a guest Jun 24th, 2012 38 Never
Not a member of Pastebin yet? Sign Up, it unlocks many cool features!
  1. -- The C compiler identification is GNU 4.7.1
  2. -- The CXX compiler identification is GNU 4.7.1
  3. -- Check for working C compiler: /usr/bin/gcc
  4. -- Check for working C compiler: /usr/bin/gcc -- works
  5. -- Detecting C compiler ABI info
  6. -- Detecting C compiler ABI info - done
  7. -- Check for working CXX compiler: /usr/bin/c++
  8. -- Check for working CXX compiler: /usr/bin/c++ -- works
  9. -- Detecting CXX compiler ABI info
  10. -- Detecting CXX compiler ABI info - done
  11. -- Looking for Q_WS_X11
  12. -- Looking for Q_WS_X11 - found
  13. -- Looking for Q_WS_WIN
  14. -- Looking for Q_WS_WIN - not found.
  15. -- Looking for Q_WS_QWS
  16. -- Looking for Q_WS_QWS - not found.
  17. -- Looking for Q_WS_MAC
  18. -- Looking for Q_WS_MAC - not found.
  19. -- Found Qt-Version 4.8.2 (using /usr/bin/qmake)
  20. -- Looking for XOpenDisplay in /usr/lib/libX11.so;/usr/lib/libXext.so;/usr/lib/libXft.so;/usr/lib/libXau.so;/usr/lib/libXdmcp.so;/usr/lib/libXpm.so
  21. -- Looking for XOpenDisplay in /usr/lib/libX11.so;/usr/lib/libXext.so;/usr/lib/libXft.so;/usr/lib/libXau.so;/usr/lib/libXdmcp.so;/usr/lib/libXpm.so - found
  22. -- Looking for gethostbyname
  23. -- Looking for gethostbyname - found
  24. -- Looking for connect
  25. -- Looking for connect - found
  26. -- Looking for remove
  27. -- Looking for remove - found
  28. -- Looking for shmat
  29. -- Looking for shmat - found
  30. -- Looking for IceConnectionNumber in ICE
  31. -- Looking for IceConnectionNumber in ICE - found
  32. -- Found X11: /usr/lib/libX11.so
  33. -- Looking for include file pthread.h
  34. -- Looking for include file pthread.h - found
  35. -- Looking for pthread_create
  36. -- Looking for pthread_create - not found.
  37. -- Looking for pthread_create in pthreads
  38. -- Looking for pthread_create in pthreads - not found
  39. -- Looking for pthread_create in pthread
  40. -- Looking for pthread_create in pthread - found
  41. -- Found Threads: TRUE  
  42. -- Found OpenSSL: /usr/lib/libssl.so
  43. -- Looking for _POSIX_TIMERS
  44. -- Looking for _POSIX_TIMERS - found
  45. -- Found Automoc4: /usr/bin/automoc4
  46. -- Found Perl: /usr/bin/perl (found version "5.16.0")
  47. -- Found Phonon: /usr/include
  48. -- Performing Test _OFFT_IS_64BIT
  49. -- Performing Test _OFFT_IS_64BIT - Success
  50. -- Performing Test HAVE_FPIE_SUPPORT
  51. -- Performing Test HAVE_FPIE_SUPPORT - Success
  52. -- Performing Test __KDE_HAVE_W_OVERLOADED_VIRTUAL
  53. -- Performing Test __KDE_HAVE_W_OVERLOADED_VIRTUAL - Success
  54. -- Performing Test __KDE_HAVE_GCC_VISIBILITY
  55. -- Performing Test __KDE_HAVE_GCC_VISIBILITY - Success
  56. -- Found KDE 4.8 include dir: /usr/include
  57. -- Found KDE 4.8 library dir: /usr/lib
  58. -- Found the KDE4 kconfig_compiler preprocessor: /usr/bin/kconfig_compiler
  59. -- Found automoc4: /usr/bin/automoc4
  60. -- Found LIBKONQ: /usr/include
  61. -- libkonq library found
  62. -- /home/eithrial/AUR/krusader/src/krusader-2.4.0-beta1/krusader: skipped subdir $(KRJSDIR)
  63. -- Found ZLIB: /usr/lib/libz.so (found version "1.2.7")
  64. -- /home/eithrial/AUR/krusader/src/krusader-2.4.0-beta1: skipped subdir $(TARDIR)
  65. -- Looking for dgettext
  66. -- Looking for dgettext - found
  67. -- Found Gettext: built in libc
  68. -- Configuring done
  69. -- Generating done
  70. -- Build files have been written to: /home/eithrial/AUR/krusader/src/build
  71. Scanning dependencies of target BookMan_automoc
  72. Scanning dependencies of target krusader_automoc
  73. Scanning dependencies of target DiskUsage_automoc
  74. Generating krbookmark.moc
  75. Generating krslots.moc
  76. Generating dufilelight.moc
  77. Generating krbookmarkhandler.moc
  78. Generating krusader.moc
  79. Generating diskusagegui.moc
  80. Generating krbookmarkbutton.moc
  81. Generating paneltabbar.moc
  82. Generating dulistview.moc
  83. Generating kraddbookmarkdlg.moc
  84. Generating panelmanager.moc
  85. Generating dulines.moc
  86. [  0%] Built target BookMan_automoc
  87. Generating krusaderview.moc
  88. Scanning dependencies of target Dialogs_automoc
  89. Generating krsqueezedtextlabel.moc
  90. Generating diskusage.moc
  91. Generating moc_kractions.cpp
  92. Generating krpleasewait.moc
  93. Generating moc_krusaderapp.cpp
  94. Generating moc_widget.cpp
  95. Generating moc_actionsbase.cpp
  96. Generating krkeydialog.moc
  97. Generating moc_krtrashhandler.cpp
  98. [  0%] Generating newftpgui.moc
  99. Built target DiskUsage_automoc
  100. Scanning dependencies of target ActionMan_automoc
  101. Generating moc_tabactions.cpp
  102. Generating actionman.moc
  103. [  0%] Built target krusader_automoc
  104. Generating krdialogs.moc
  105. Scanning dependencies of target Filter_automoc
  106. Generating generalfilter.moc
  107. Generating addplaceholderpopup.moc
  108. Generating kurllistrequester.moc
  109. Generating useractionpage.moc
  110. Generating advancedfilter.moc
  111. Generating percentalsplitter.moc
  112. Generating actionproperty.moc
  113. Generating moc_useractionlistview.cpp
  114. Generating krmaskchoice.moc
  115. Generating filtertabs.moc
  116. [  0%] Built target ActionMan_automoc
  117. Scanning dependencies of target GUI_automoc
  118. Generating krspecialwidgets.moc
  119. Generating filterdialog.moc
  120. Generating mediabutton.moc
  121. Generating popularurls.moc
  122. Generating syncbrowsebutton.moc
  123. [  0%] Built target Filter_automoc
  124. Scanning dependencies of target Konfigurator_automoc
  125. Generating packgui.moc
  126. Generating profilemanager.moc
  127. Generating kgcolors.moc
  128. Generating kcmdmodebutton.moc
  129. Generating packguibase.moc
  130. Generating krusaderstatus.moc
  131. Generating kgadvanced.moc
  132. [  0%] Built target Dialogs_automoc
  133. Scanning dependencies of target KViewer_automoc
  134. Generating kfnkeys.moc
  135. Generating kguseractions.moc
  136. Generating krviewer.moc
  137. Generating terminaldock.moc
  138. Generating krremoteencodingmenu.moc
  139. Generating kimagefilepreview.moc
  140. Generating konfiguratoritems.moc
  141. Generating dirhistorybutton.moc
  142. Generating panelviewer.moc
  143. Generating kgprotocols.moc
  144. Generating moc_krtreewidget.cpp
  145. Generating diskusageviewer.moc
  146. Generating konfiguratorpage.moc
  147. Generating moc_kcmdline.cpp
  148. Generating moc_lister.cpp
  149. Generating kgdependencies.moc
  150. Generating moc_krlistwidget.cpp
  151. [  0%] [  0%] Built target KViewer_automoc
  152. Built target GUI_automoc
  153. Scanning dependencies of target Locate_automoc
  154. Generating kggeneral.moc
  155. Scanning dependencies of target MountMan_automoc
  156. Generating locate.moc
  157. Generating kmountmangui.moc
  158. Generating kgstartup.moc
  159. [  0%] Generating kmountman.moc
  160. Built target Locate_automoc
  161. Scanning dependencies of target Queue_automoc
  162. Generating moc_queuedialog.cpp
  163. Generating konfigurator.moc
  164. [  0%] Built target MountMan_automoc
  165. Scanning dependencies of target Panel_automoc
  166. Generating moc_queue.cpp
  167. Generating panelpopup.moc
  168. Generating kgarchives.moc
  169. Generating moc_queue_mgr.cpp
  170. Generating krpopupmenu.moc
  171. Generating moc_queuewidget.cpp
  172. Generating moc_krresulttable.cpp
  173. Generating krcalcspacedialog.moc
  174. [  0%] Built target Queue_automoc
  175. Generating moc_kgpanel.cpp
  176. Scanning dependencies of target Search_automoc
  177. Generating krsearchmod.moc
  178. Generating krcolorcache.moc
  179. [  0%] Built target Konfigurator_automoc
  180. Generating krpreviewpopup.moc
  181. Scanning dependencies of target Splitter_automoc
  182. Generating splitter.moc
  183. Generating krsearchdialog.moc
  184. Generating panelfunc.moc
  185. Generating splittergui.moc
  186. Generating moc_viewactions.cpp
  187. [  0%] Built target Search_automoc
  188. Scanning dependencies of target Synchronizer_automoc
  189. Generating combiner.moc
  190. Generating moc_dirhistoryqueue.cpp
  191. Generating synchronizedialog.moc
  192. Generating moc_krerrordisplay.cpp
  193. [  0%] Built target Splitter_automoc
  194. Scanning dependencies of target UserAction_automoc
  195. Generating feedtolistboxdialog.moc
  196. Generating moc_krview.cpp
  197. Generating kraction.moc
  198. Generating synchronizertask.moc
  199. Generating moc_kritemview.cpp
  200. [  0%] Built target UserAction_automoc
  201. Scanning dependencies of target UserMenu_automoc
  202. Generating synchronizergui.moc
  203. [  0%] Built target UserMenu_automoc
  204. Generating moc_quickfilter.cpp
  205. Scanning dependencies of target VFS_automoc
  206. Generating virtualcopyjob.moc
  207. Generating synchronizerdirlist.moc
  208. Generating moc_krpreviews.cpp
  209. Generating krquery.moc
  210. Generating moc_listpanelactions.cpp
  211. Generating synchronizer.moc
  212. Generating normal_vfs.moc
  213. Generating moc_krinterdetailedview.cpp
  214. [  0%] Built target Synchronizer_automoc
  215. Scanning dependencies of target kio_krarc_automoc
  216. Generating krarc.moc
  217. Generating vfile.moc
  218. Generating moc_urlrequester.cpp
  219. Generating vfs.moc
  220. [  0%] Built target kio_krarc_automoc
  221. Generating moc_krvfsmodel.cpp
  222. Scanning dependencies of target kio_iso_automoc
  223. [  0%] Generating krarchandler.moc
  224. Built target kio_iso_automoc
  225. Scanning dependencies of target doc-handbook
  226. [  0%] Generating index.cache.bz2
  227. Generating moc_listpanel.cpp
  228. Generating virt_vfs.moc
  229. Generating ftp_vfs.moc
  230. Generating moc_krmousehandler.cpp
  231. Generating moc_krpreviewjob.cpp
  232. Generating moc_abstractthreadedjob.cpp
  233. Generating moc_krinterbriefview.cpp
  234. Generating moc_packjob.cpp
  235. Generating moc_listpanelframe.cpp
  236. Generating moc_vfilecontainer.cpp
  237. [  0%] Built target Panel_automoc
  238. Scanning dependencies of target doc-manpage-man-krusader
  239. Generating moc_kiojobwrapper.cpp
  240. [  1%] Generating krusader.1
  241. Generating moc_krvfshandler.cpp
  242. [  1%] Built target VFS_automoc
  243. Scanning dependencies of target pofiles
  244. [  2%] Generating krusader.gmo
  245. [  2%] Built target pofiles
  246. Scanning dependencies of target pofiles
  247. [  3%] Generating krusader.gmo
  248. [  3%] Built target pofiles
  249. Scanning dependencies of target pofiles
  250. [  3%] Generating krusader.gmo
  251. [  3%] Built target pofiles
  252. Scanning dependencies of target pofiles
  253. [  3%] Generating krusader.gmo
  254. [  3%] Built target pofiles
  255. Scanning dependencies of target pofiles
  256. [  4%] Generating krusader.gmo
  257. Warn: AUTHOR sect.: no personblurb|contrib for Krusader Krew       krusader
  258. Note: AUTHOR sect.: see see http://docbook.sf.net/el/contrib       krusader
  259. [  4%] Note: AUTHOR sect.: see see http://docbook.sf.net/el/personblurb   krusader
  260. Built target pofiles
  261. Note: Writing krusader.1
  262. Scanning dependencies of target pofiles
  263. [  4%] Generating krusader.gmo
  264. [  4%] Built target doc-manpage-man-krusader
  265. Scanning dependencies of target pofiles
  266. [  4%] Built target pofiles
  267. [  5%] Generating krusader.gmo
  268. Scanning dependencies of target pofiles
  269. [  5%] Generating krusader.gmo
  270. [  5%] Built target pofiles
  271. [  5%] Scanning dependencies of target pofiles
  272. Built target pofiles
  273. [  6%] Generating krusader.gmo
  274. Scanning dependencies of target pofiles
  275. [  6%] Generating krusader.gmo
  276. [  6%] Built target pofiles
  277. [  6%] Built target pofiles
  278. Scanning dependencies of target pofiles
  279. [  7%] Generating krusader.gmo
  280. Scanning dependencies of target pofiles
  281. [  7%] Generating krusader.gmo
  282. [  7%] Built target pofiles
  283. Scanning dependencies of target pofiles
  284. [  7%] [  8%] Built target pofiles
  285. Generating krusader.gmo
  286. Scanning dependencies of target pofiles
  287. [  8%] Generating krusader.gmo
  288. [  8%] Built target pofiles
  289. Scanning dependencies of target pofiles
  290. [  8%] [  8%] Built target pofiles
  291. Generating krusader.gmo
  292. Scanning dependencies of target pofiles
  293. [  8%] Generating krusader.gmo
  294. [  8%] Built target pofiles
  295. Scanning dependencies of target pofiles
  296. [  9%] Generating krusader.gmo
  297. [  9%] Built target pofiles
  298. Scanning dependencies of target pofiles
  299. [ 10%] Generating krusader.gmo
  300. [ 10%] Built target pofiles
  301. Scanning dependencies of target pofiles
  302. [ 10%] Generating krusader.gmo
  303. [ 10%] Built target pofiles
  304. [ 10%] Built target pofiles
  305. Scanning dependencies of target pofiles
  306. [ 10%] Scanning dependencies of target pofiles
  307. Generating krusader.gmo
  308. [ 11%] Generating krusader.gmo
  309. [ 11%] Built target pofiles
  310. [ 11%] Built target pofiles
  311. Scanning dependencies of target pofiles
  312. [ 11%] Scanning dependencies of target pofiles
  313. [ 11%] Generating krusader.gmo
  314. Generating krusader.gmo
  315. [ 11%] [ 11%] Built target pofiles
  316. Built target pofiles
  317. Scanning dependencies of target pofiles
  318. Scanning dependencies of target pofiles
  319. [ 11%] [ 12%] Generating krusader.gmo
  320. Generating krusader.gmo
  321. [ 12%] [ 12%] Built target pofiles
  322. Built target pofiles
  323. Scanning dependencies of target pofiles
  324. [ 12%] Scanning dependencies of target pofiles
  325. Generating krusader.gmo
  326. [ 12%] Generating krusader.gmo
  327. [ 12%] Built target pofiles
  328. [ 12%] Scanning dependencies of target pofiles
  329. [ 12%] Built target pofiles
  330. Generating krusader.gmo
  331. Scanning dependencies of target pofiles
  332. [ 12%] Generating krusader.gmo
  333. [ 12%] Built target pofiles
  334. Scanning dependencies of target pofiles
  335. [ 12%] [ 13%] Built target pofiles
  336. Generating krusader.gmo
  337. Scanning dependencies of target pofiles
  338. [ 14%] Generating krusader.gmo
  339. [ 14%] Built target pofiles
  340. Scanning dependencies of target pofiles
  341. [ 14%] [ 14%] Generating krusader.gmo
  342. Built target pofiles
  343. Scanning dependencies of target pofiles
  344. [ 14%] Generating krusader.gmo
  345. [ 14%] Built target pofiles
  346. Scanning dependencies of target pofiles
  347. [ 15%] Generating krusader.gmo
  348. [ 15%] Built target pofiles
  349. Scanning dependencies of target pofiles
  350. [ 16%] Generating krusader.gmo
  351. [ 16%] Built target pofiles
  352. Scanning dependencies of target pofiles
  353. [ 17%] Generating krusader.gmo
  354. [ 17%] Built target pofiles
  355. Scanning dependencies of target pofiles
  356. [ 17%] Generating krusader.gmo
  357. [ 17%] Built target pofiles
  358. Scanning dependencies of target pofiles
  359. [ 18%] Generating krusader.gmo
  360. [ 18%] Built target pofiles
  361. Scanning dependencies of target BookMan
  362. [ 18%] Building CXX object krusader/BookMan/CMakeFiles/BookMan.dir/BookMan_automoc.o
  363. [ 18%] Built target pofiles
  364. [ 18%] Building CXX object krusader/BookMan/CMakeFiles/BookMan.dir/krbookmark.o
  365. Scanning dependencies of target DiskUsage
  366. [ 19%] Building CXX object krusader/DiskUsage/CMakeFiles/DiskUsage.dir/DiskUsage_automoc.o
  367. [ 19%] Building CXX object krusader/DiskUsage/CMakeFiles/DiskUsage.dir/diskusagegui.o
  368. [ 20%] Building CXX object krusader/BookMan/CMakeFiles/BookMan.dir/krbookmarkbutton.o
  369. In file included from /home/eithrial/AUR/krusader/src/krusader-2.4.0-beta1/krusader/DiskUsage/diskusage.h:50:0,
  370.                  from /home/eithrial/AUR/krusader/src/krusader-2.4.0-beta1/krusader/DiskUsage/diskusagegui.h:42,
  371.                  from /home/eithrial/AUR/krusader/src/krusader-2.4.0-beta1/krusader/DiskUsage/diskusagegui.cpp:31:
  372. /home/eithrial/AUR/krusader/src/krusader-2.4.0-beta1/krusader/DiskUsage/filelightParts/fileTree.h:101:21: warning: type qualifiers ignored on function return type [-Wignored-qualifiers]
  373. /home/eithrial/AUR/krusader/src/krusader-2.4.0-beta1/krusader/DiskUsage/filelightParts/fileTree.h:249:51: warning: type qualifiers ignored on function return type [-Wignored-qualifiers]
  374. /home/eithrial/AUR/krusader/src/krusader-2.4.0-beta1/krusader/DiskUsage/filelightParts/fileTree.h:252:51: warning: type qualifiers ignored on function return type [-Wignored-qualifiers]
  375. /home/eithrial/AUR/krusader/src/krusader-2.4.0-beta1/krusader/DiskUsage/filelightParts/fileTree.h:255:51: warning: type qualifiers ignored on function return type [-Wignored-qualifiers]
  376. /home/eithrial/AUR/krusader/src/krusader-2.4.0-beta1/krusader/DiskUsage/filelightParts/fileTree.h:267:51: warning: type qualifiers ignored on function return type [-Wignored-qualifiers]
  377. /home/eithrial/AUR/krusader/src/krusader-2.4.0-beta1/krusader/DiskUsage/filelightParts/fileTree.h:273:51: warning: type qualifiers ignored on function return type [-Wignored-qualifiers]
  378. /home/eithrial/AUR/krusader/src/krusader-2.4.0-beta1/krusader/DiskUsage/filelightParts/fileTree.h:276:51: warning: type qualifiers ignored on function return type [-Wignored-qualifiers]
  379. /home/eithrial/AUR/krusader/src/krusader-2.4.0-beta1/krusader/DiskUsage/filelightParts/fileTree.h:279:51: warning: type qualifiers ignored on function return type [-Wignored-qualifiers]
  380. /home/eithrial/AUR/krusader/src/krusader-2.4.0-beta1/krusader/DiskUsage/filelightParts/fileTree.h:285:51: warning: type qualifiers ignored on function return type [-Wignored-qualifiers]
  381. /home/eithrial/AUR/krusader/src/krusader-2.4.0-beta1/krusader/DiskUsage/filelightParts/fileTree.h:336:51: warning: type qualifiers ignored on function return type [-Wignored-qualifiers]
  382. [ 20%] Building CXX object krusader/BookMan/CMakeFiles/BookMan.dir/krbookmarkhandler.o
  383. [ 20%] Building CXX object krusader/DiskUsage/CMakeFiles/DiskUsage.dir/diskusage.o
  384. In file included from /home/eithrial/AUR/krusader/src/krusader-2.4.0-beta1/krusader/DiskUsage/diskusage.h:50:0,
  385.                  from /home/eithrial/AUR/krusader/src/krusader-2.4.0-beta1/krusader/DiskUsage/diskusage.cpp:31:
  386. /home/eithrial/AUR/krusader/src/krusader-2.4.0-beta1/krusader/DiskUsage/filelightParts/fileTree.h:101:21: warning: type qualifiers ignored on function return type [-Wignored-qualifiers]
  387. /home/eithrial/AUR/krusader/src/krusader-2.4.0-beta1/krusader/DiskUsage/filelightParts/fileTree.h:249:51: warning: type qualifiers ignored on function return type [-Wignored-qualifiers]
  388. /home/eithrial/AUR/krusader/src/krusader-2.4.0-beta1/krusader/DiskUsage/filelightParts/fileTree.h:252:51: warning: type qualifiers ignored on function return type [-Wignored-qualifiers]
  389. /home/eithrial/AUR/krusader/src/krusader-2.4.0-beta1/krusader/DiskUsage/filelightParts/fileTree.h:255:51: warning: type qualifiers ignored on function return type [-Wignored-qualifiers]
  390. /home/eithrial/AUR/krusader/src/krusader-2.4.0-beta1/krusader/DiskUsage/filelightParts/fileTree.h:267:51: warning: type qualifiers ignored on function return type [-Wignored-qualifiers]
  391. /home/eithrial/AUR/krusader/src/krusader-2.4.0-beta1/krusader/DiskUsage/filelightParts/fileTree.h:273:51: warning: type qualifiers ignored on function return type [-Wignored-qualifiers]
  392. /home/eithrial/AUR/krusader/src/krusader-2.4.0-beta1/krusader/DiskUsage/filelightParts/fileTree.h:276:51: warning: type qualifiers ignored on function return type [-Wignored-qualifiers]
  393. /home/eithrial/AUR/krusader/src/krusader-2.4.0-beta1/krusader/DiskUsage/filelightParts/fileTree.h:279:51: warning: type qualifiers ignored on function return type [-Wignored-qualifiers]
  394. /home/eithrial/AUR/krusader/src/krusader-2.4.0-beta1/krusader/DiskUsage/filelightParts/fileTree.h:285:51: warning: type qualifiers ignored on function return type [-Wignored-qualifiers]
  395. /home/eithrial/AUR/krusader/src/krusader-2.4.0-beta1/krusader/DiskUsage/filelightParts/fileTree.h:336:51: warning: type qualifiers ignored on function return type [-Wignored-qualifiers]
  396. In file included from /home/eithrial/AUR/krusader/src/krusader-2.4.0-beta1/krusader/BookMan/../filemanagerwindow.h:22:0,
  397.                  from /home/eithrial/AUR/krusader/src/krusader-2.4.0-beta1/krusader/BookMan/krbookmarkhandler.cpp:24:
  398. /home/eithrial/AUR/krusader/src/krusader-2.4.0-beta1/krusader/BookMan/../krmainwindow.h:29:7: warning: ‘class KrMainWindow’ has virtual functions and accessible non-virtual destructor [-Wnon-virtual-dtor]
  399. In file included from /home/eithrial/AUR/krusader/src/krusader-2.4.0-beta1/krusader/BookMan/../filemanagerwindow.h:23:0,
  400.                  from /home/eithrial/AUR/krusader/src/krusader-2.4.0-beta1/krusader/BookMan/krbookmarkhandler.cpp:24:
  401. /home/eithrial/AUR/krusader/src/krusader-2.4.0-beta1/krusader/BookMan/../abstractpanelmanager.h:26:7: warning: ‘class AbstractPanelManager’ has virtual functions and accessible non-virtual destructor [-Wnon-virtual-dtor]
  402. In file included from /home/eithrial/AUR/krusader/src/krusader-2.4.0-beta1/krusader/BookMan/krbookmarkhandler.cpp:24:0:
  403. /home/eithrial/AUR/krusader/src/krusader-2.4.0-beta1/krusader/BookMan/../filemanagerwindow.h:31:7: warning: ‘class FileManagerWindow’ has virtual functions and accessible non-virtual destructor [-Wnon-virtual-dtor]
  404. In file included from /home/eithrial/AUR/krusader/src/krusader-2.4.0-beta1/krusader/BookMan/krbookmarkhandler.cpp:27:0:
  405. /home/eithrial/AUR/krusader/src/krusader-2.4.0-beta1/krusader/BookMan/../Panel/krpanel.h:43:7: warning: ‘class KrPanel’ has virtual functions and accessible non-virtual destructor [-Wnon-virtual-dtor]
  406. In file included from /home/eithrial/AUR/krusader/src/krusader-2.4.0-beta1/krusader/DiskUsage/../Panel/krpanel.h:35:0,
  407.                  from /home/eithrial/AUR/krusader/src/krusader-2.4.0-beta1/krusader/DiskUsage/diskusage.cpp:64:
  408. /home/eithrial/AUR/krusader/src/krusader-2.4.0-beta1/krusader/DiskUsage/../Panel/../abstractpanelmanager.h:26:7: warning: ‘class AbstractPanelManager’ has virtual functions and accessible non-virtual destructor [-Wnon-virtual-dtor]
  409. In file included from /home/eithrial/AUR/krusader/src/krusader-2.4.0-beta1/krusader/DiskUsage/diskusage.cpp:64:0:
  410. /home/eithrial/AUR/krusader/src/krusader-2.4.0-beta1/krusader/DiskUsage/../Panel/krpanel.h:43:7: warning: ‘class KrPanel’ has virtual functions and accessible non-virtual destructor [-Wnon-virtual-dtor]
  411. [ 20%] Built target doc-handbook
  412. Scanning dependencies of target Dialogs
  413. [ 20%] Building CXX object krusader/Dialogs/CMakeFiles/Dialogs.dir/Dialogs_automoc.o
  414. [ 21%] Building CXX object krusader/Dialogs/CMakeFiles/Dialogs.dir/krsqueezedtextlabel.o
  415. [ 22%] Building CXX object krusader/BookMan/CMakeFiles/BookMan.dir/kraddbookmarkdlg.o
  416. [ 22%] Building CXX object krusader/Dialogs/CMakeFiles/Dialogs.dir/packgui.o
  417. [ 23%] Building CXX object krusader/DiskUsage/CMakeFiles/DiskUsage.dir/dulistview.o
  418. [ 23%] Building CXX object krusader/Dialogs/CMakeFiles/Dialogs.dir/packguibase.o
  419. Linking CXX static library ../../lib/libBookMan.a
  420. [ 23%] Built target BookMan
  421. [ 23%] Generating ui_actionproperty.h
  422. /home/eithrial/AUR/krusader/src/krusader-2.4.0-beta1/krusader/ActionMan/actionproperty.ui: Warning: The name 'tab' (QWidget) is already in use, defaulting to 'tab1'.
  423. /home/eithrial/AUR/krusader/src/krusader-2.4.0-beta1/krusader/ActionMan/actionproperty.ui: Warning: The name 'tab' (QWidget) is already in use, defaulting to 'tab2'.
  424. /home/eithrial/AUR/krusader/src/krusader-2.4.0-beta1/krusader/ActionMan/actionproperty.ui: Warning: The name 'tab' (QWidget) is already in use, defaulting to 'tab3'.
  425. /home/eithrial/AUR/krusader/src/krusader-2.4.0-beta1/krusader/ActionMan/actionproperty.ui: Warning: The name 'TabPage' (QWidget) is already in use, defaulting to 'TabPage1'.
  426. Scanning dependencies of target ActionMan
  427. [ 23%] Building CXX object krusader/ActionMan/CMakeFiles/ActionMan.dir/ActionMan_automoc.o
  428. In file included from /home/eithrial/AUR/krusader/src/krusader-2.4.0-beta1/krusader/DiskUsage/diskusage.h:50:0,
  429.                  from /home/eithrial/AUR/krusader/src/krusader-2.4.0-beta1/krusader/DiskUsage/dulistview.h:38,
  430.                  from /home/eithrial/AUR/krusader/src/krusader-2.4.0-beta1/krusader/DiskUsage/dulistview.cpp:31:
  431. /home/eithrial/AUR/krusader/src/krusader-2.4.0-beta1/krusader/DiskUsage/filelightParts/fileTree.h:101:21: warning: type qualifiers ignored on function return type [-Wignored-qualifiers]
  432. /home/eithrial/AUR/krusader/src/krusader-2.4.0-beta1/krusader/DiskUsage/filelightParts/fileTree.h:249:51: warning: type qualifiers ignored on function return type [-Wignored-qualifiers]
  433. /home/eithrial/AUR/krusader/src/krusader-2.4.0-beta1/krusader/DiskUsage/filelightParts/fileTree.h:252:51: warning: type qualifiers ignored on function return type [-Wignored-qualifiers]
  434. /home/eithrial/AUR/krusader/src/krusader-2.4.0-beta1/krusader/DiskUsage/filelightParts/fileTree.h:255:51: warning: type qualifiers ignored on function return type [-Wignored-qualifiers]
  435. /home/eithrial/AUR/krusader/src/krusader-2.4.0-beta1/krusader/DiskUsage/filelightParts/fileTree.h:267:51: warning: type qualifiers ignored on function return type [-Wignored-qualifiers]
  436. /home/eithrial/AUR/krusader/src/krusader-2.4.0-beta1/krusader/DiskUsage/filelightParts/fileTree.h:273:51: warning: type qualifiers ignored on function return type [-Wignored-qualifiers]
  437. /home/eithrial/AUR/krusader/src/krusader-2.4.0-beta1/krusader/DiskUsage/filelightParts/fileTree.h:276:51: warning: type qualifiers ignored on function return type [-Wignored-qualifiers]
  438. /home/eithrial/AUR/krusader/src/krusader-2.4.0-beta1/krusader/DiskUsage/filelightParts/fileTree.h:279:51: warning: type qualifiers ignored on function return type [-Wignored-qualifiers]
  439. /home/eithrial/AUR/krusader/src/krusader-2.4.0-beta1/krusader/DiskUsage/filelightParts/fileTree.h:285:51: warning: type qualifiers ignored on function return type [-Wignored-qualifiers]
  440. /home/eithrial/AUR/krusader/src/krusader-2.4.0-beta1/krusader/DiskUsage/filelightParts/fileTree.h:336:51: warning: type qualifiers ignored on function return type [-Wignored-qualifiers]
  441. [ 24%] Building CXX object krusader/ActionMan/CMakeFiles/ActionMan.dir/actionman.o
  442. [ 24%] Building CXX object krusader/DiskUsage/CMakeFiles/DiskUsage.dir/dulines.o
  443. In file included from /home/eithrial/AUR/krusader/src/krusader-2.4.0-beta1/krusader/ActionMan/../filemanagerwindow.h:22:0,
  444.                  from /home/eithrial/AUR/krusader/src/krusader-2.4.0-beta1/krusader/ActionMan/../krusader.h:39,
  445.                  from /home/eithrial/AUR/krusader/src/krusader-2.4.0-beta1/krusader/ActionMan/actionman.cpp:25:
  446. /home/eithrial/AUR/krusader/src/krusader-2.4.0-beta1/krusader/ActionMan/../krmainwindow.h:29:7: warning: ‘class KrMainWindow’ has virtual functions and accessible non-virtual destructor [-Wnon-virtual-dtor]
  447. In file included from /home/eithrial/AUR/krusader/src/krusader-2.4.0-beta1/krusader/ActionMan/../filemanagerwindow.h:23:0,
  448.                  from /home/eithrial/AUR/krusader/src/krusader-2.4.0-beta1/krusader/ActionMan/../krusader.h:39,
  449.                  from /home/eithrial/AUR/krusader/src/krusader-2.4.0-beta1/krusader/ActionMan/actionman.cpp:25:
  450. /home/eithrial/AUR/krusader/src/krusader-2.4.0-beta1/krusader/ActionMan/../abstractpanelmanager.h:26:7: warning: ‘class AbstractPanelManager’ has virtual functions and accessible non-virtual destructor [-Wnon-virtual-dtor]
  451. In file included from /home/eithrial/AUR/krusader/src/krusader-2.4.0-beta1/krusader/ActionMan/../krusader.h:39:0,
  452.                  from /home/eithrial/AUR/krusader/src/krusader-2.4.0-beta1/krusader/ActionMan/actionman.cpp:25:
  453. /home/eithrial/AUR/krusader/src/krusader-2.4.0-beta1/krusader/ActionMan/../filemanagerwindow.h:31:7: warning: ‘class FileManagerWindow’ has virtual functions and accessible non-virtual destructor [-Wnon-virtual-dtor]
  454. [ 25%] Building CXX object krusader/Dialogs/CMakeFiles/Dialogs.dir/newftpgui.o
  455. [ 25%] Building CXX object krusader/ActionMan/CMakeFiles/ActionMan.dir/actionproperty.o
  456. In file included from /home/eithrial/AUR/krusader/src/krusader-2.4.0-beta1/krusader/DiskUsage/diskusage.h:50:0,
  457.                  from /home/eithrial/AUR/krusader/src/krusader-2.4.0-beta1/krusader/DiskUsage/dulines.h:39,
  458.                  from /home/eithrial/AUR/krusader/src/krusader-2.4.0-beta1/krusader/DiskUsage/dulines.cpp:31:
  459. /home/eithrial/AUR/krusader/src/krusader-2.4.0-beta1/krusader/DiskUsage/filelightParts/fileTree.h:101:21: warning: type qualifiers ignored on function return type [-Wignored-qualifiers]
  460. /home/eithrial/AUR/krusader/src/krusader-2.4.0-beta1/krusader/DiskUsage/filelightParts/fileTree.h:249:51: warning: type qualifiers ignored on function return type [-Wignored-qualifiers]
  461. /home/eithrial/AUR/krusader/src/krusader-2.4.0-beta1/krusader/DiskUsage/filelightParts/fileTree.h:252:51: warning: type qualifiers ignored on function return type [-Wignored-qualifiers]
  462. /home/eithrial/AUR/krusader/src/krusader-2.4.0-beta1/krusader/DiskUsage/filelightParts/fileTree.h:255:51: warning: type qualifiers ignored on function return type [-Wignored-qualifiers]
  463. /home/eithrial/AUR/krusader/src/krusader-2.4.0-beta1/krusader/DiskUsage/filelightParts/fileTree.h:267:51: warning: type qualifiers ignored on function return type [-Wignored-qualifiers]
  464. /home/eithrial/AUR/krusader/src/krusader-2.4.0-beta1/krusader/DiskUsage/filelightParts/fileTree.h:273:51: warning: type qualifiers ignored on function return type [-Wignored-qualifiers]
  465. /home/eithrial/AUR/krusader/src/krusader-2.4.0-beta1/krusader/DiskUsage/filelightParts/fileTree.h:276:51: warning: type qualifiers ignored on function return type [-Wignored-qualifiers]
  466. /home/eithrial/AUR/krusader/src/krusader-2.4.0-beta1/krusader/DiskUsage/filelightParts/fileTree.h:279:51: warning: type qualifiers ignored on function return type [-Wignored-qualifiers]
  467. /home/eithrial/AUR/krusader/src/krusader-2.4.0-beta1/krusader/DiskUsage/filelightParts/fileTree.h:285:51: warning: type qualifiers ignored on function return type [-Wignored-qualifiers]
  468. /home/eithrial/AUR/krusader/src/krusader-2.4.0-beta1/krusader/DiskUsage/filelightParts/fileTree.h:336:51: warning: type qualifiers ignored on function return type [-Wignored-qualifiers]
  469. [ 25%] Building CXX object krusader/Dialogs/CMakeFiles/Dialogs.dir/krspwidgets.o
  470. In file included from /home/eithrial/AUR/krusader/src/krusader-2.4.0-beta1/krusader/ActionMan/../filemanagerwindow.h:22:0,
  471.                  from /home/eithrial/AUR/krusader/src/krusader-2.4.0-beta1/krusader/ActionMan/../krusader.h:39,
  472.                  from /home/eithrial/AUR/krusader/src/krusader-2.4.0-beta1/krusader/ActionMan/actionproperty.cpp:24:
  473. /home/eithrial/AUR/krusader/src/krusader-2.4.0-beta1/krusader/ActionMan/../krmainwindow.h:29:7: warning: ‘class KrMainWindow’ has virtual functions and accessible non-virtual destructor [-Wnon-virtual-dtor]
  474. In file included from /home/eithrial/AUR/krusader/src/krusader-2.4.0-beta1/krusader/ActionMan/../filemanagerwindow.h:23:0,
  475.                  from /home/eithrial/AUR/krusader/src/krusader-2.4.0-beta1/krusader/ActionMan/../krusader.h:39,
  476.                  from /home/eithrial/AUR/krusader/src/krusader-2.4.0-beta1/krusader/ActionMan/actionproperty.cpp:24:
  477. /home/eithrial/AUR/krusader/src/krusader-2.4.0-beta1/krusader/ActionMan/../abstractpanelmanager.h:26:7: warning: ‘class AbstractPanelManager’ has virtual functions and accessible non-virtual destructor [-Wnon-virtual-dtor]
  478. In file included from /home/eithrial/AUR/krusader/src/krusader-2.4.0-beta1/krusader/ActionMan/../krusader.h:39:0,
  479.                  from /home/eithrial/AUR/krusader/src/krusader-2.4.0-beta1/krusader/ActionMan/actionproperty.cpp:24:
  480. /home/eithrial/AUR/krusader/src/krusader-2.4.0-beta1/krusader/ActionMan/../filemanagerwindow.h:31:7: warning: ‘class FileManagerWindow’ has virtual functions and accessible non-virtual destructor [-Wnon-virtual-dtor]
  481. [ 26%] Building CXX object krusader/DiskUsage/CMakeFiles/DiskUsage.dir/dufilelight.o
  482. In file included from /home/eithrial/AUR/krusader/src/krusader-2.4.0-beta1/krusader/DiskUsage/diskusage.h:50:0,
  483.                  from /home/eithrial/AUR/krusader/src/krusader-2.4.0-beta1/krusader/DiskUsage/dufilelight.h:36,
  484.                  from /home/eithrial/AUR/krusader/src/krusader-2.4.0-beta1/krusader/DiskUsage/dufilelight.cpp:31:
  485. /home/eithrial/AUR/krusader/src/krusader-2.4.0-beta1/krusader/DiskUsage/filelightParts/fileTree.h:101:21: warning: type qualifiers ignored on function return type [-Wignored-qualifiers]
  486. /home/eithrial/AUR/krusader/src/krusader-2.4.0-beta1/krusader/DiskUsage/filelightParts/fileTree.h:249:51: warning: type qualifiers ignored on function return type [-Wignored-qualifiers]
  487. /home/eithrial/AUR/krusader/src/krusader-2.4.0-beta1/krusader/DiskUsage/filelightParts/fileTree.h:252:51: warning: type qualifiers ignored on function return type [-Wignored-qualifiers]
  488. /home/eithrial/AUR/krusader/src/krusader-2.4.0-beta1/krusader/DiskUsage/filelightParts/fileTree.h:255:51: warning: type qualifiers ignored on function return type [-Wignored-qualifiers]
  489. /home/eithrial/AUR/krusader/src/krusader-2.4.0-beta1/krusader/DiskUsage/filelightParts/fileTree.h:267:51: warning: type qualifiers ignored on function return type [-Wignored-qualifiers]
  490. /home/eithrial/AUR/krusader/src/krusader-2.4.0-beta1/krusader/DiskUsage/filelightParts/fileTree.h:273:51: warning: type qualifiers ignored on function return type [-Wignored-qualifiers]
  491. /home/eithrial/AUR/krusader/src/krusader-2.4.0-beta1/krusader/DiskUsage/filelightParts/fileTree.h:276:51: warning: type qualifiers ignored on function return type [-Wignored-qualifiers]
  492. /home/eithrial/AUR/krusader/src/krusader-2.4.0-beta1/krusader/DiskUsage/filelightParts/fileTree.h:279:51: warning: type qualifiers ignored on function return type [-Wignored-qualifiers]
  493. /home/eithrial/AUR/krusader/src/krusader-2.4.0-beta1/krusader/DiskUsage/filelightParts/fileTree.h:285:51: warning: type qualifiers ignored on function return type [-Wignored-qualifiers]
  494. /home/eithrial/AUR/krusader/src/krusader-2.4.0-beta1/krusader/DiskUsage/filelightParts/fileTree.h:336:51: warning: type qualifiers ignored on function return type [-Wignored-qualifiers]
  495. [ 26%] Building CXX object krusader/DiskUsage/CMakeFiles/DiskUsage.dir/radialMap/widget.o
  496. [ 27%] Building CXX object krusader/Dialogs/CMakeFiles/Dialogs.dir/krspecialwidgets.o
  497. [ 28%] Building CXX object krusader/ActionMan/CMakeFiles/ActionMan.dir/addplaceholderpopup.o
  498. In file included from /home/eithrial/AUR/krusader/src/krusader-2.4.0-beta1/krusader/DiskUsage/radialMap/widget.cpp:33:0:
  499. /home/eithrial/AUR/krusader/src/krusader-2.4.0-beta1/krusader/DiskUsage/filelightParts/fileTree.h:101:21: warning: type qualifiers ignored on function return type [-Wignored-qualifiers]
  500. /home/eithrial/AUR/krusader/src/krusader-2.4.0-beta1/krusader/DiskUsage/filelightParts/fileTree.h:249:51: warning: type qualifiers ignored on function return type [-Wignored-qualifiers]
  501. /home/eithrial/AUR/krusader/src/krusader-2.4.0-beta1/krusader/DiskUsage/filelightParts/fileTree.h:252:51: warning: type qualifiers ignored on function return type [-Wignored-qualifiers]
  502. /home/eithrial/AUR/krusader/src/krusader-2.4.0-beta1/krusader/DiskUsage/filelightParts/fileTree.h:255:51: warning: type qualifiers ignored on function return type [-Wignored-qualifiers]
  503. /home/eithrial/AUR/krusader/src/krusader-2.4.0-beta1/krusader/DiskUsage/filelightParts/fileTree.h:267:51: warning: type qualifiers ignored on function return type [-Wignored-qualifiers]
  504. /home/eithrial/AUR/krusader/src/krusader-2.4.0-beta1/krusader/DiskUsage/filelightParts/fileTree.h:273:51: warning: type qualifiers ignored on function return type [-Wignored-qualifiers]
  505. /home/eithrial/AUR/krusader/src/krusader-2.4.0-beta1/krusader/DiskUsage/filelightParts/fileTree.h:276:51: warning: type qualifiers ignored on function return type [-Wignored-qualifiers]
  506. /home/eithrial/AUR/krusader/src/krusader-2.4.0-beta1/krusader/DiskUsage/filelightParts/fileTree.h:279:51: warning: type qualifiers ignored on function return type [-Wignored-qualifiers]
  507. /home/eithrial/AUR/krusader/src/krusader-2.4.0-beta1/krusader/DiskUsage/filelightParts/fileTree.h:285:51: warning: type qualifiers ignored on function return type [-Wignored-qualifiers]
  508. /home/eithrial/AUR/krusader/src/krusader-2.4.0-beta1/krusader/DiskUsage/filelightParts/fileTree.h:336:51: warning: type qualifiers ignored on function return type [-Wignored-qualifiers]
  509. [ 29%] Building CXX object krusader/DiskUsage/CMakeFiles/DiskUsage.dir/radialMap/builder.o
  510. In file included from /home/eithrial/AUR/krusader/src/krusader-2.4.0-beta1/krusader/DiskUsage/radialMap/builder.h:23:0,
  511.                  from /home/eithrial/AUR/krusader/src/krusader-2.4.0-beta1/krusader/DiskUsage/radialMap/builder.cpp:19:
  512. /home/eithrial/AUR/krusader/src/krusader-2.4.0-beta1/krusader/DiskUsage/filelightParts/fileTree.h:101:21: warning: type qualifiers ignored on function return type [-Wignored-qualifiers]
  513. /home/eithrial/AUR/krusader/src/krusader-2.4.0-beta1/krusader/DiskUsage/filelightParts/fileTree.h:249:51: warning: type qualifiers ignored on function return type [-Wignored-qualifiers]
  514. /home/eithrial/AUR/krusader/src/krusader-2.4.0-beta1/krusader/DiskUsage/filelightParts/fileTree.h:252:51: warning: type qualifiers ignored on function return type [-Wignored-qualifiers]
  515. /home/eithrial/AUR/krusader/src/krusader-2.4.0-beta1/krusader/DiskUsage/filelightParts/fileTree.h:255:51: warning: type qualifiers ignored on function return type [-Wignored-qualifiers]
  516. /home/eithrial/AUR/krusader/src/krusader-2.4.0-beta1/krusader/DiskUsage/filelightParts/fileTree.h:267:51: warning: type qualifiers ignored on function return type [-Wignored-qualifiers]
  517. /home/eithrial/AUR/krusader/src/krusader-2.4.0-beta1/krusader/DiskUsage/filelightParts/fileTree.h:273:51: warning: type qualifiers ignored on function return type [-Wignored-qualifiers]
  518. /home/eithrial/AUR/krusader/src/krusader-2.4.0-beta1/krusader/DiskUsage/filelightParts/fileTree.h:276:51: warning: type qualifiers ignored on function return type [-Wignored-qualifiers]
  519. /home/eithrial/AUR/krusader/src/krusader-2.4.0-beta1/krusader/DiskUsage/filelightParts/fileTree.h:279:51: warning: type qualifiers ignored on function return type [-Wignored-qualifiers]
  520. /home/eithrial/AUR/krusader/src/krusader-2.4.0-beta1/krusader/DiskUsage/filelightParts/fileTree.h:285:51: warning: type qualifiers ignored on function return type [-Wignored-qualifiers]
  521. /home/eithrial/AUR/krusader/src/krusader-2.4.0-beta1/krusader/DiskUsage/filelightParts/fileTree.h:336:51: warning: type qualifiers ignored on function return type [-Wignored-qualifiers]
  522. [ 29%] Building CXX object krusader/DiskUsage/CMakeFiles/DiskUsage.dir/radialMap/map.o
  523. [ 29%] Building CXX object krusader/Dialogs/CMakeFiles/Dialogs.dir/krpleasewait.o
  524. In file included from /home/eithrial/AUR/krusader/src/krusader-2.4.0-beta1/krusader/DiskUsage/radialMap/builder.h:23:0,
  525.                  from /home/eithrial/AUR/krusader/src/krusader-2.4.0-beta1/krusader/DiskUsage/radialMap/map.cpp:29:
  526. /home/eithrial/AUR/krusader/src/krusader-2.4.0-beta1/krusader/DiskUsage/filelightParts/fileTree.h:101:21: warning: type qualifiers ignored on function return type [-Wignored-qualifiers]
  527. /home/eithrial/AUR/krusader/src/krusader-2.4.0-beta1/krusader/DiskUsage/filelightParts/fileTree.h:249:51: warning: type qualifiers ignored on function return type [-Wignored-qualifiers]
  528. /home/eithrial/AUR/krusader/src/krusader-2.4.0-beta1/krusader/DiskUsage/filelightParts/fileTree.h:252:51: warning: type qualifiers ignored on function return type [-Wignored-qualifiers]
  529. /home/eithrial/AUR/krusader/src/krusader-2.4.0-beta1/krusader/DiskUsage/filelightParts/fileTree.h:255:51: warning: type qualifiers ignored on function return type [-Wignored-qualifiers]
  530. /home/eithrial/AUR/krusader/src/krusader-2.4.0-beta1/krusader/DiskUsage/filelightParts/fileTree.h:267:51: warning: type qualifiers ignored on function return type [-Wignored-qualifiers]
  531. /home/eithrial/AUR/krusader/src/krusader-2.4.0-beta1/krusader/DiskUsage/filelightParts/fileTree.h:273:51: warning: type qualifiers ignored on function return type [-Wignored-qualifiers]
  532. /home/eithrial/AUR/krusader/src/krusader-2.4.0-beta1/krusader/DiskUsage/filelightParts/fileTree.h:276:51: warning: type qualifiers ignored on function return type [-Wignored-qualifiers]
  533. /home/eithrial/AUR/krusader/src/krusader-2.4.0-beta1/krusader/DiskUsage/filelightParts/fileTree.h:279:51: warning: type qualifiers ignored on function return type [-Wignored-qualifiers]
  534. /home/eithrial/AUR/krusader/src/krusader-2.4.0-beta1/krusader/DiskUsage/filelightParts/fileTree.h:285:51: warning: type qualifiers ignored on function return type [-Wignored-qualifiers]
  535. /home/eithrial/AUR/krusader/src/krusader-2.4.0-beta1/krusader/DiskUsage/filelightParts/fileTree.h:336:51: warning: type qualifiers ignored on function return type [-Wignored-qualifiers]
  536. /home/eithrial/AUR/krusader/src/krusader-2.4.0-beta1/krusader/DiskUsage/radialMap/map.cpp: In member function ‘void RadialMap::Map::colorise()’:
  537. /home/eithrial/AUR/krusader/src/krusader-2.4.0-beta1/krusader/DiskUsage/radialMap/map.cpp:180:13: warning: case value ‘2000’ not in enumerated type ‘Filelight::MapScheme’ [-Wswitch]
  538. /home/eithrial/AUR/krusader/src/krusader-2.4.0-beta1/krusader/DiskUsage/radialMap/map.cpp: In member function ‘void RadialMap::Map::paint(unsigned int)’:
  539. /home/eithrial/AUR/krusader/src/krusader-2.4.0-beta1/krusader/DiskUsage/radialMap/map.cpp:324:42: warning: narrowing conversion of ‘it.ConstIterator<T>::operator*<RadialMap::Segment>()->RadialMap::Segment::start()’ from ‘uint {aka unsigned int}’ to ‘int’ inside { } is ill-formed in C++11 [-Wnarrowing]
  540. /home/eithrial/AUR/krusader/src/krusader-2.4.0-beta1/krusader/DiskUsage/radialMap/map.cpp:324:59: warning: narrowing conversion of ‘it.ConstIterator<T>::operator*<RadialMap::Segment>()->RadialMap::Segment::length()’ from ‘uint {aka unsigned int}’ to ‘int’ inside { } is ill-formed in C++11 [-Wnarrowing]
  541. [ 30%] [ 30%] [ 31%] Building CXX object krusader/ActionMan/CMakeFiles/ActionMan.dir/useractionlistview.o
  542. Building CXX object krusader/Dialogs/CMakeFiles/Dialogs.dir/krmaskchoice.o
  543. Building CXX object krusader/DiskUsage/CMakeFiles/DiskUsage.dir/radialMap/widgetEvents.o
  544. In file included from /home/eithrial/AUR/krusader/src/krusader-2.4.0-beta1/krusader/DiskUsage/radialMap/widgetEvents.cpp:19:0:
  545. /home/eithrial/AUR/krusader/src/krusader-2.4.0-beta1/krusader/DiskUsage/filelightParts/fileTree.h:101:21: warning: type qualifiers ignored on function return type [-Wignored-qualifiers]
  546. /home/eithrial/AUR/krusader/src/krusader-2.4.0-beta1/krusader/DiskUsage/filelightParts/fileTree.h:249:51: warning: type qualifiers ignored on function return type [-Wignored-qualifiers]
  547. /home/eithrial/AUR/krusader/src/krusader-2.4.0-beta1/krusader/DiskUsage/filelightParts/fileTree.h:252:51: warning: type qualifiers ignored on function return type [-Wignored-qualifiers]
  548. /home/eithrial/AUR/krusader/src/krusader-2.4.0-beta1/krusader/DiskUsage/filelightParts/fileTree.h:255:51: warning: type qualifiers ignored on function return type [-Wignored-qualifiers]
  549. /home/eithrial/AUR/krusader/src/krusader-2.4.0-beta1/krusader/DiskUsage/filelightParts/fileTree.h:267:51: warning: type qualifiers ignored on function return type [-Wignored-qualifiers]
  550. /home/eithrial/AUR/krusader/src/krusader-2.4.0-beta1/krusader/DiskUsage/filelightParts/fileTree.h:273:51: warning: type qualifiers ignored on function return type [-Wignored-qualifiers]
  551. /home/eithrial/AUR/krusader/src/krusader-2.4.0-beta1/krusader/DiskUsage/filelightParts/fileTree.h:276:51: warning: type qualifiers ignored on function return type [-Wignored-qualifiers]
  552. /home/eithrial/AUR/krusader/src/krusader-2.4.0-beta1/krusader/DiskUsage/filelightParts/fileTree.h:279:51: warning: type qualifiers ignored on function return type [-Wignored-qualifiers]
  553. /home/eithrial/AUR/krusader/src/krusader-2.4.0-beta1/krusader/DiskUsage/filelightParts/fileTree.h:285:51: warning: type qualifiers ignored on function return type [-Wignored-qualifiers]
  554. /home/eithrial/AUR/krusader/src/krusader-2.4.0-beta1/krusader/DiskUsage/filelightParts/fileTree.h:336:51: warning: type qualifiers ignored on function return type [-Wignored-qualifiers]
  555. [ 31%] Building CXX object krusader/Dialogs/CMakeFiles/Dialogs.dir/krdialogs.o
  556. [ 31%] Building CXX object krusader/DiskUsage/CMakeFiles/DiskUsage.dir/radialMap/labels.o
  557. [ 32%] Building CXX object krusader/ActionMan/CMakeFiles/ActionMan.dir/useractionpage.o
  558. In file included from /home/eithrial/AUR/krusader/src/krusader-2.4.0-beta1/krusader/DiskUsage/radialMap/labels.cpp:26:0:
  559. /home/eithrial/AUR/krusader/src/krusader-2.4.0-beta1/krusader/DiskUsage/filelightParts/fileTree.h:101:21: warning: type qualifiers ignored on function return type [-Wignored-qualifiers]
  560. /home/eithrial/AUR/krusader/src/krusader-2.4.0-beta1/krusader/DiskUsage/filelightParts/fileTree.h:249:51: warning: type qualifiers ignored on function return type [-Wignored-qualifiers]
  561. /home/eithrial/AUR/krusader/src/krusader-2.4.0-beta1/krusader/DiskUsage/filelightParts/fileTree.h:252:51: warning: type qualifiers ignored on function return type [-Wignored-qualifiers]
  562. /home/eithrial/AUR/krusader/src/krusader-2.4.0-beta1/krusader/DiskUsage/filelightParts/fileTree.h:255:51: warning: type qualifiers ignored on function return type [-Wignored-qualifiers]
  563. /home/eithrial/AUR/krusader/src/krusader-2.4.0-beta1/krusader/DiskUsage/filelightParts/fileTree.h:267:51: warning: type qualifiers ignored on function return type [-Wignored-qualifiers]
  564. /home/eithrial/AUR/krusader/src/krusader-2.4.0-beta1/krusader/DiskUsage/filelightParts/fileTree.h:273:51: warning: type qualifiers ignored on function return type [-Wignored-qualifiers]
  565. /home/eithrial/AUR/krusader/src/krusader-2.4.0-beta1/krusader/DiskUsage/filelightParts/fileTree.h:276:51: warning: type qualifiers ignored on function return type [-Wignored-qualifiers]
  566. /home/eithrial/AUR/krusader/src/krusader-2.4.0-beta1/krusader/DiskUsage/filelightParts/fileTree.h:279:51: warning: type qualifiers ignored on function return type [-Wignored-qualifiers]
  567. /home/eithrial/AUR/krusader/src/krusader-2.4.0-beta1/krusader/DiskUsage/filelightParts/fileTree.h:285:51: warning: type qualifiers ignored on function return type [-Wignored-qualifiers]
  568. /home/eithrial/AUR/krusader/src/krusader-2.4.0-beta1/krusader/DiskUsage/filelightParts/fileTree.h:336:51: warning: type qualifiers ignored on function return type [-Wignored-qualifiers]
  569. [ 32%] Building CXX object krusader/DiskUsage/CMakeFiles/DiskUsage.dir/radialMap/segmentTip.o
  570. /home/eithrial/AUR/krusader/src/krusader-2.4.0-beta1/krusader/Dialogs/krdialogs.cpp:168:1: warning: unused parameter ‘presAttrs’ [-Wunused-parameter]
  571. In file included from /home/eithrial/AUR/krusader/src/krusader-2.4.0-beta1/krusader/ActionMan/../filemanagerwindow.h:22:0,
  572.                  from /home/eithrial/AUR/krusader/src/krusader-2.4.0-beta1/krusader/ActionMan/../krusader.h:39,
  573.                  from /home/eithrial/AUR/krusader/src/krusader-2.4.0-beta1/krusader/ActionMan/useractionpage.cpp:40:
  574. /home/eithrial/AUR/krusader/src/krusader-2.4.0-beta1/krusader/ActionMan/../krmainwindow.h:29:7: warning: ‘class KrMainWindow’ has virtual functions and accessible non-virtual destructor [-Wnon-virtual-dtor]
  575. In file included from /home/eithrial/AUR/krusader/src/krusader-2.4.0-beta1/krusader/ActionMan/../filemanagerwindow.h:23:0,
  576.                  from /home/eithrial/AUR/krusader/src/krusader-2.4.0-beta1/krusader/ActionMan/../krusader.h:39,
  577.                  from /home/eithrial/AUR/krusader/src/krusader-2.4.0-beta1/krusader/ActionMan/useractionpage.cpp:40:
  578. /home/eithrial/AUR/krusader/src/krusader-2.4.0-beta1/krusader/ActionMan/../abstractpanelmanager.h:26:7: warning: ‘class AbstractPanelManager’ has virtual functions and accessible non-virtual destructor [-Wnon-virtual-dtor]
  579. In file included from /home/eithrial/AUR/krusader/src/krusader-2.4.0-beta1/krusader/ActionMan/../krusader.h:39:0,
  580.                  from /home/eithrial/AUR/krusader/src/krusader-2.4.0-beta1/krusader/ActionMan/useractionpage.cpp:40:
  581. /home/eithrial/AUR/krusader/src/krusader-2.4.0-beta1/krusader/ActionMan/../filemanagerwindow.h:31:7: warning: ‘class FileManagerWindow’ has virtual functions and accessible non-virtual destructor [-Wnon-virtual-dtor]
  582. [ 32%] Building CXX object krusader/Dialogs/CMakeFiles/Dialogs.dir/kurllistrequester.o
  583. In file included from /home/eithrial/AUR/krusader/src/krusader-2.4.0-beta1/krusader/DiskUsage/radialMap/segmentTip.cpp:30:0:
  584. /home/eithrial/AUR/krusader/src/krusader-2.4.0-beta1/krusader/DiskUsage/filelightParts/fileTree.h:101:21: warning: type qualifiers ignored on function return type [-Wignored-qualifiers]
  585. /home/eithrial/AUR/krusader/src/krusader-2.4.0-beta1/krusader/DiskUsage/filelightParts/fileTree.h:249:51: warning: type qualifiers ignored on function return type [-Wignored-qualifiers]
  586. /home/eithrial/AUR/krusader/src/krusader-2.4.0-beta1/krusader/DiskUsage/filelightParts/fileTree.h:252:51: warning: type qualifiers ignored on function return type [-Wignored-qualifiers]
  587. /home/eithrial/AUR/krusader/src/krusader-2.4.0-beta1/krusader/DiskUsage/filelightParts/fileTree.h:255:51: warning: type qualifiers ignored on function return type [-Wignored-qualifiers]
  588. /home/eithrial/AUR/krusader/src/krusader-2.4.0-beta1/krusader/DiskUsage/filelightParts/fileTree.h:267:51: warning: type qualifiers ignored on function return type [-Wignored-qualifiers]
  589. /home/eithrial/AUR/krusader/src/krusader-2.4.0-beta1/krusader/DiskUsage/filelightParts/fileTree.h:273:51: warning: type qualifiers ignored on function return type [-Wignored-qualifiers]
  590. /home/eithrial/AUR/krusader/src/krusader-2.4.0-beta1/krusader/DiskUsage/filelightParts/fileTree.h:276:51: warning: type qualifiers ignored on function return type [-Wignored-qualifiers]
  591. /home/eithrial/AUR/krusader/src/krusader-2.4.0-beta1/krusader/DiskUsage/filelightParts/fileTree.h:279:51: warning: type qualifiers ignored on function return type [-Wignored-qualifiers]
  592. /home/eithrial/AUR/krusader/src/krusader-2.4.0-beta1/krusader/DiskUsage/filelightParts/fileTree.h:285:51: warning: type qualifiers ignored on function return type [-Wignored-qualifiers]
  593. /home/eithrial/AUR/krusader/src/krusader-2.4.0-beta1/krusader/DiskUsage/filelightParts/fileTree.h:336:51: warning: type qualifiers ignored on function return type [-Wignored-qualifiers]
  594. [ 33%] Building CXX object krusader/DiskUsage/CMakeFiles/DiskUsage.dir/filelightParts/Config.o
  595. Linking CXX static library ../../lib/libActionMan.a
  596. [ 33%] Built target ActionMan
  597. Scanning dependencies of target GUI
  598. [ 33%] Building CXX object krusader/GUI/CMakeFiles/GUI.dir/GUI_automoc.o
  599. [ 33%] Building CXX object krusader/DiskUsage/CMakeFiles/DiskUsage.dir/filelightParts/fileTree.o
  600. In file included from /home/eithrial/AUR/krusader/src/krusader-2.4.0-beta1/krusader/DiskUsage/filelightParts/fileTree.cpp:19:0:
  601. /home/eithrial/AUR/krusader/src/krusader-2.4.0-beta1/krusader/DiskUsage/filelightParts/fileTree.h:101:21: warning: type qualifiers ignored on function return type [-Wignored-qualifiers]
  602. /home/eithrial/AUR/krusader/src/krusader-2.4.0-beta1/krusader/DiskUsage/filelightParts/fileTree.h:249:51: warning: type qualifiers ignored on function return type [-Wignored-qualifiers]
  603. /home/eithrial/AUR/krusader/src/krusader-2.4.0-beta1/krusader/DiskUsage/filelightParts/fileTree.h:252:51: warning: type qualifiers ignored on function return type [-Wignored-qualifiers]
  604. /home/eithrial/AUR/krusader/src/krusader-2.4.0-beta1/krusader/DiskUsage/filelightParts/fileTree.h:255:51: warning: type qualifiers ignored on function return type [-Wignored-qualifiers]
  605. /home/eithrial/AUR/krusader/src/krusader-2.4.0-beta1/krusader/DiskUsage/filelightParts/fileTree.h:267:51: warning: type qualifiers ignored on function return type [-Wignored-qualifiers]
  606. /home/eithrial/AUR/krusader/src/krusader-2.4.0-beta1/krusader/DiskUsage/filelightParts/fileTree.h:273:51: warning: type qualifiers ignored on function return type [-Wignored-qualifiers]
  607. /home/eithrial/AUR/krusader/src/krusader-2.4.0-beta1/krusader/DiskUsage/filelightParts/fileTree.h:276:51: warning: type qualifiers ignored on function return type [-Wignored-qualifiers]
  608. /home/eithrial/AUR/krusader/src/krusader-2.4.0-beta1/krusader/DiskUsage/filelightParts/fileTree.h:279:51: warning: type qualifiers ignored on function return type [-Wignored-qualifiers]
  609. /home/eithrial/AUR/krusader/src/krusader-2.4.0-beta1/krusader/DiskUsage/filelightParts/fileTree.h:285:51: warning: type qualifiers ignored on function return type [-Wignored-qualifiers]
  610. /home/eithrial/AUR/krusader/src/krusader-2.4.0-beta1/krusader/DiskUsage/filelightParts/fileTree.h:336:51: warning: type qualifiers ignored on function return type [-Wignored-qualifiers]
  611. [ 34%] Linking CXX static library ../../lib/libDiskUsage.a
  612. Building CXX object krusader/Dialogs/CMakeFiles/Dialogs.dir/popularurls.o
  613. [ 34%] Built target DiskUsage
  614. Scanning dependencies of target Konfigurator
  615. [ 34%] Building CXX object krusader/Konfigurator/CMakeFiles/Konfigurator.dir/Konfigurator_automoc.o
  616. [ 35%] Building CXX object krusader/GUI/CMakeFiles/GUI.dir/dirhistorybutton.o
  617. In file included from /home/eithrial/AUR/krusader/src/build/krusader/Konfigurator/../../../krusader-2.4.0-beta1/krusader/Konfigurator/krresulttable.h:36:0,
  618.                  from /home/eithrial/AUR/krusader/src/build/krusader/Konfigurator/moc_krresulttable.cpp:10,
  619.                  from /home/eithrial/AUR/krusader/src/build/krusader/Konfigurator/Konfigurator_automoc.cpp:4:
  620. /home/eithrial/AUR/krusader/src/build/krusader/Konfigurator/../../../krusader-2.4.0-beta1/krusader/Konfigurator/searchobject.h:39:27: warning: type qualifiers ignored on function return type [-Wignored-qualifiers]
  621. In file included from /home/eithrial/AUR/krusader/src/build/krusader/Konfigurator/../../../krusader-2.4.0-beta1/krusader/Konfigurator/krresulttable.h:36:0,
  622.                  from /home/eithrial/AUR/krusader/src/build/krusader/Konfigurator/moc_krresulttable.cpp:10,
  623.                  from /home/eithrial/AUR/krusader/src/build/krusader/Konfigurator/Konfigurator_automoc.cpp:4:
  624. /home/eithrial/AUR/krusader/src/build/krusader/Konfigurator/../../../krusader-2.4.0-beta1/krusader/Konfigurator/searchobject.h:104:30: warning: type qualifiers ignored on function return type [-Wignored-qualifiers]
  625. /home/eithrial/AUR/krusader/src/build/krusader/Konfigurator/../../../krusader-2.4.0-beta1/krusader/Konfigurator/searchobject.h:107:32: warning: type qualifiers ignored on function return type [-Wignored-qualifiers]
  626. /home/eithrial/AUR/krusader/src/build/krusader/Konfigurator/../../../krusader-2.4.0-beta1/krusader/Konfigurator/searchobject.h:134:32: warning: type qualifiers ignored on function return type [-Wignored-qualifiers]
  627. [ 35%] Building CXX object krusader/GUI/CMakeFiles/GUI.dir/krusaderstatus.o
  628. [ 35%] Building CXX object krusader/Konfigurator/CMakeFiles/Konfigurator.dir/kgcolors.o
  629. [ 35%] Building CXX object krusader/Dialogs/CMakeFiles/Dialogs.dir/checksumdlg.o
  630. [ 36%] Building CXX object krusader/GUI/CMakeFiles/GUI.dir/kfnkeys.o
  631. In file included from /home/eithrial/AUR/krusader/src/krusader-2.4.0-beta1/krusader/Dialogs/../filemanagerwindow.h:22:0,
  632.                  from /home/eithrial/AUR/krusader/src/krusader-2.4.0-beta1/krusader/Dialogs/../krusader.h:39,
  633.                  from /home/eithrial/AUR/krusader/src/krusader-2.4.0-beta1/krusader/Dialogs/checksumdlg.cpp:22:
  634. /home/eithrial/AUR/krusader/src/krusader-2.4.0-beta1/krusader/Dialogs/../krmainwindow.h:29:7: warning: ‘class KrMainWindow’ has virtual functions and accessible non-virtual destructor [-Wnon-virtual-dtor]
  635. In file included from /home/eithrial/AUR/krusader/src/krusader-2.4.0-beta1/krusader/Dialogs/../filemanagerwindow.h:23:0,
  636.                  from /home/eithrial/AUR/krusader/src/krusader-2.4.0-beta1/krusader/Dialogs/../krusader.h:39,
  637.                  from /home/eithrial/AUR/krusader/src/krusader-2.4.0-beta1/krusader/Dialogs/checksumdlg.cpp:22:
  638. /home/eithrial/AUR/krusader/src/krusader-2.4.0-beta1/krusader/Dialogs/../abstractpanelmanager.h:26:7: warning: ‘class AbstractPanelManager’ has virtual functions and accessible non-virtual destructor [-Wnon-virtual-dtor]
  639. In file included from /home/eithrial/AUR/krusader/src/krusader-2.4.0-beta1/krusader/Dialogs/../krusader.h:39:0,
  640.                  from /home/eithrial/AUR/krusader/src/krusader-2.4.0-beta1/krusader/Dialogs/checksumdlg.cpp:22:
  641. /home/eithrial/AUR/krusader/src/krusader-2.4.0-beta1/krusader/Dialogs/../filemanagerwindow.h:31:7: warning: ‘class FileManagerWindow’ has virtual functions and accessible non-virtual destructor [-Wnon-virtual-dtor]
  642. In file included from /home/eithrial/AUR/krusader/src/krusader-2.4.0-beta1/krusader/GUI/../filemanagerwindow.h:22:0,
  643.                  from /home/eithrial/AUR/krusader/src/krusader-2.4.0-beta1/krusader/GUI/kfnkeys.cpp:40:
  644. /home/eithrial/AUR/krusader/src/krusader-2.4.0-beta1/krusader/GUI/../krmainwindow.h:29:7: warning: ‘class KrMainWindow’ has virtual functions and accessible non-virtual destructor [-Wnon-virtual-dtor]
  645. In file included from /home/eithrial/AUR/krusader/src/krusader-2.4.0-beta1/krusader/GUI/../filemanagerwindow.h:23:0,
  646.                  from /home/eithrial/AUR/krusader/src/krusader-2.4.0-beta1/krusader/GUI/kfnkeys.cpp:40:
  647. /home/eithrial/AUR/krusader/src/krusader-2.4.0-beta1/krusader/GUI/../abstractpanelmanager.h:26:7: warning: ‘class AbstractPanelManager’ has virtual functions and accessible non-virtual destructor [-Wnon-virtual-dtor]
  648. In file included from /home/eithrial/AUR/krusader/src/krusader-2.4.0-beta1/krusader/GUI/kfnkeys.cpp:40:0:
  649. /home/eithrial/AUR/krusader/src/krusader-2.4.0-beta1/krusader/GUI/../filemanagerwindow.h:31:7: warning: ‘class FileManagerWindow’ has virtual functions and accessible non-virtual destructor [-Wnon-virtual-dtor]
  650. [ 36%] Building CXX object krusader/GUI/CMakeFiles/GUI.dir/kcmdline.o
  651. /home/eithrial/AUR/krusader/src/krusader-2.4.0-beta1/krusader/Dialogs/checksumdlg.cpp:80:6: warning: unused parameter ‘recursive’ [-Wunused-parameter]
  652. /home/eithrial/AUR/krusader/src/krusader-2.4.0-beta1/krusader/Dialogs/checksumdlg.cpp:88:6: warning: unused parameter ‘recursive’ [-Wunused-parameter]
  653. In file included from /home/eithrial/AUR/krusader/src/krusader-2.4.0-beta1/krusader/GUI/../Panel/krpanel.h:35:0,
  654.                  from /home/eithrial/AUR/krusader/src/krusader-2.4.0-beta1/krusader/GUI/../krusaderview.h:51,
  655.                  from /home/eithrial/AUR/krusader/src/krusader-2.4.0-beta1/krusader/GUI/kcmdline.cpp:57:
  656. /home/eithrial/AUR/krusader/src/krusader-2.4.0-beta1/krusader/GUI/../Panel/../abstractpanelmanager.h:26:7: warning: ‘class AbstractPanelManager’ has virtual functions and accessible non-virtual destructor [-Wnon-virtual-dtor]
  657. In file included from /home/eithrial/AUR/krusader/src/krusader-2.4.0-beta1/krusader/GUI/../krusaderview.h:51:0,
  658.                  from /home/eithrial/AUR/krusader/src/krusader-2.4.0-beta1/krusader/GUI/kcmdline.cpp:57:
  659. /home/eithrial/AUR/krusader/src/krusader-2.4.0-beta1/krusader/GUI/../Panel/krpanel.h:43:7: warning: ‘class KrPanel’ has virtual functions and accessible non-virtual destructor [-Wnon-virtual-dtor]
  660. [ 37%] Building CXX object krusader/Dialogs/CMakeFiles/Dialogs.dir/percentalsplitter.o
  661. [ 37%] Building CXX object krusader/GUI/CMakeFiles/GUI.dir/syncbrowsebutton.o
  662. [ 38%] Building CXX object krusader/Konfigurator/CMakeFiles/Konfigurator.dir/kgdependencies.o
  663. [ 39%] Building CXX object krusader/GUI/CMakeFiles/GUI.dir/profilemanager.o
  664. [ 39%] Building CXX object krusader/Dialogs/CMakeFiles/Dialogs.dir/krkeydialog.o
  665. In file included from /home/eithrial/AUR/krusader/src/krusader-2.4.0-beta1/krusader/Dialogs/../filemanagerwindow.h:22:0,
  666.                  from /home/eithrial/AUR/krusader/src/krusader-2.4.0-beta1/krusader/Dialogs/../krusader.h:39,
  667.                  from /home/eithrial/AUR/krusader/src/krusader-2.4.0-beta1/krusader/Dialogs/krkeydialog.cpp:33:
  668. /home/eithrial/AUR/krusader/src/krusader-2.4.0-beta1/krusader/Dialogs/../krmainwindow.h:29:7: warning: ‘class KrMainWindow’ has virtual functions and accessible non-virtual destructor [-Wnon-virtual-dtor]
  669. In file included from /home/eithrial/AUR/krusader/src/krusader-2.4.0-beta1/krusader/Dialogs/../filemanagerwindow.h:23:0,
  670.                  from /home/eithrial/AUR/krusader/src/krusader-2.4.0-beta1/krusader/Dialogs/../krusader.h:39,
  671.                  from /home/eithrial/AUR/krusader/src/krusader-2.4.0-beta1/krusader/Dialogs/krkeydialog.cpp:33:
  672. /home/eithrial/AUR/krusader/src/krusader-2.4.0-beta1/krusader/Dialogs/../abstractpanelmanager.h:26:7: warning: ‘class AbstractPanelManager’ has virtual functions and accessible non-virtual destructor [-Wnon-virtual-dtor]
  673. In file included from /home/eithrial/AUR/krusader/src/krusader-2.4.0-beta1/krusader/Dialogs/../krusader.h:39:0,
  674.                  from /home/eithrial/AUR/krusader/src/krusader-2.4.0-beta1/krusader/Dialogs/krkeydialog.cpp:33:
  675. /home/eithrial/AUR/krusader/src/krusader-2.4.0-beta1/krusader/Dialogs/../filemanagerwindow.h:31:7: warning: ‘class FileManagerWindow’ has virtual functions and accessible non-virtual destructor [-Wnon-virtual-dtor]
  676. [ 39%] Building CXX object krusader/Konfigurator/CMakeFiles/Konfigurator.dir/konfiguratorpage.o
  677. [ 39%] Building CXX object krusader/GUI/CMakeFiles/GUI.dir/krremoteencodingmenu.o
  678. Linking CXX static library ../../lib/libDialogs.a
  679. [ 39%] Built target Dialogs
  680. Scanning dependencies of target KViewer
  681. [ 39%] Building CXX object krusader/KViewer/CMakeFiles/KViewer.dir/KViewer_automoc.o
  682. In file included from /home/eithrial/AUR/krusader/src/krusader-2.4.0-beta1/krusader/GUI/../Panel/krpanel.h:35:0,
  683.                  from /home/eithrial/AUR/krusader/src/krusader-2.4.0-beta1/krusader/GUI/krremoteencodingmenu.cpp:30:
  684. /home/eithrial/AUR/krusader/src/krusader-2.4.0-beta1/krusader/GUI/../Panel/../abstractpanelmanager.h:26:7: warning: ‘class AbstractPanelManager’ has virtual functions and accessible non-virtual destructor [-Wnon-virtual-dtor]
  685. In file included from /home/eithrial/AUR/krusader/src/krusader-2.4.0-beta1/krusader/GUI/krremoteencodingmenu.cpp:30:0:
  686. /home/eithrial/AUR/krusader/src/krusader-2.4.0-beta1/krusader/GUI/../Panel/krpanel.h:43:7: warning: ‘class KrPanel’ has virtual functions and accessible non-virtual destructor [-Wnon-virtual-dtor]
  687. [ 40%] Building CXX object krusader/KViewer/CMakeFiles/KViewer.dir/krviewer.o
  688. [ 41%] Building CXX object krusader/Konfigurator/CMakeFiles/Konfigurator.dir/konfiguratoritems.o
  689. [ 42%] Building CXX object krusader/GUI/CMakeFiles/GUI.dir/krtreewidget.o
  690. [ 42%] Building CXX object krusader/GUI/CMakeFiles/GUI.dir/krstyleproxy.o
  691. /home/eithrial/AUR/krusader/src/krusader-2.4.0-beta1/krusader/KViewer/krviewer.cpp: In static member function ‘static KrViewer* KrViewer::getViewer(bool)’:
  692. /home/eithrial/AUR/krusader/src/krusader-2.4.0-beta1/krusader/KViewer/krviewer.cpp:250:109: warning: suggest parentheses around arithmetic in operand of ‘|’ [-Wparentheses]
  693. /home/eithrial/AUR/krusader/src/krusader-2.4.0-beta1/krusader/KViewer/krviewer.cpp: At global scope:
  694. /home/eithrial/AUR/krusader/src/krusader-2.4.0-beta1/krusader/KViewer/krviewer.cpp:626:6: warning: unused parameter ‘pvb’ [-Wunused-parameter]
  695. /home/eithrial/AUR/krusader/src/krusader-2.4.0-beta1/krusader/KViewer/krviewer.cpp:647:6: warning: unused parameter ‘pvb’ [-Wunused-parameter]
  696. [ 43%] Building CXX object krusader/GUI/CMakeFiles/GUI.dir/krlistwidget.o
  697. [ 43%] Building CXX object krusader/KViewer/CMakeFiles/KViewer.dir/kimagefilepreview.o
  698. [ 43%] Building CXX object krusader/GUI/CMakeFiles/GUI.dir/mediabutton.o
  699. [ 43%] Building CXX object krusader/Konfigurator/CMakeFiles/Konfigurator.dir/konfigurator.o
  700. /home/eithrial/AUR/krusader/src/krusader-2.4.0-beta1/krusader/KViewer/kimagefilepreview.cpp: In member function ‘virtual KIO::PreviewJob* KrusaderImageFilePreview::createJob(const KUrl&, int, int)’:
  701. /home/eithrial/AUR/krusader/src/krusader-2.4.0-beta1/krusader/KViewer/kimagefilepreview.cpp:112:58: warning: ‘KIO::PreviewJob* KIO::filePreview(const KUrl::List&, int, int, int, int, bool, bool, const QStringList*)’ is deprecated (declared at /usr/include/kio/previewjob.h:286) [-Wdeprecated-declarations]
  702. [ 44%] Building CXX object krusader/KViewer/CMakeFiles/KViewer.dir/panelviewer.o
  703. /home/eithrial/AUR/krusader/src/krusader-2.4.0-beta1/krusader/GUI/mediabutton.cpp:469:6: warning: unused parameter ‘accessible’ [-Wunused-parameter]
  704. In file included from /home/eithrial/AUR/krusader/src/krusader-2.4.0-beta1/krusader/Konfigurator/../Panel/krpanel.h:35:0,
  705.                  from /home/eithrial/AUR/krusader/src/krusader-2.4.0-beta1/krusader/Konfigurator/../krusaderview.h:51,
  706.                  from /home/eithrial/AUR/krusader/src/krusader-2.4.0-beta1/krusader/Konfigurator/konfigurator.cpp:47:
  707. /home/eithrial/AUR/krusader/src/krusader-2.4.0-beta1/krusader/Konfigurator/../Panel/../abstractpanelmanager.h:26:7: warning: ‘class AbstractPanelManager’ has virtual functions and accessible non-virtual destructor [-Wnon-virtual-dtor]
  708. In file included from /home/eithrial/AUR/krusader/src/krusader-2.4.0-beta1/krusader/Konfigurator/../krusaderview.h:51:0,
  709.                  from /home/eithrial/AUR/krusader/src/krusader-2.4.0-beta1/krusader/Konfigurator/konfigurator.cpp:47:
  710. /home/eithrial/AUR/krusader/src/krusader-2.4.0-beta1/krusader/Konfigurator/../Panel/krpanel.h:43:7: warning: ‘class KrPanel’ has virtual functions and accessible non-virtual destructor [-Wnon-virtual-dtor]
  711. [ 45%] Building CXX object krusader/Konfigurator/CMakeFiles/Konfigurator.dir/kgstartup.o
  712. /home/eithrial/AUR/krusader/src/krusader-2.4.0-beta1/krusader/KViewer/panelviewer.cpp: In member function ‘KParts::ReadOnlyPart* PanelViewer::getHexPart()’:
  713. /home/eithrial/AUR/krusader/src/krusader-2.4.0-beta1/krusader/KViewer/panelviewer.cpp:143:52: warning: ‘static KLibLoader* KLibLoader::self()’ is deprecated (declared at /usr/include/klibloader.h:144) [-Wdeprecated-declarations]
  714. /home/eithrial/AUR/krusader/src/krusader-2.4.0-beta1/krusader/KViewer/panelviewer.cpp:146:89: warning: ‘QObject* KPluginFactory::create(QObject*, const char*, const QStringList&)’ is deprecated (declared at /usr/include/kpluginfactory.h:353) [-Wdeprecated-declarations]
  715. /home/eithrial/AUR/krusader/src/krusader-2.4.0-beta1/krusader/KViewer/panelviewer.cpp: In member function ‘KParts::ReadOnlyPart* PanelViewer::getDefaultPart(const KUrl&, QString, bool)’:
  716. /home/eithrial/AUR/krusader/src/krusader-2.4.0-beta1/krusader/KViewer/panelviewer.cpp:192:43: warning: suggest parentheses around assignment used as truth value [-Wparentheses]
  717. /home/eithrial/AUR/krusader/src/krusader-2.4.0-beta1/krusader/KViewer/panelviewer.cpp: In member function ‘virtual KParts::ReadOnlyPart* PanelViewer::createPart(QString)’:
  718. /home/eithrial/AUR/krusader/src/krusader-2.4.0-beta1/krusader/KViewer/panelviewer.cpp:286:40: warning: ‘static KLibLoader* KLibLoader::self()’ is deprecated (declared at /usr/include/klibloader.h:144) [-Wdeprecated-declarations]
  719. /home/eithrial/AUR/krusader/src/krusader-2.4.0-beta1/krusader/KViewer/panelviewer.cpp:290:69: warning: ‘QObject* KPluginFactory::create(QObject*, const char*, const QStringList&)’ is deprecated (declared at /usr/include/kpluginfactory.h:353) [-Wdeprecated-declarations]
  720. /home/eithrial/AUR/krusader/src/krusader-2.4.0-beta1/krusader/KViewer/panelviewer.cpp:293:77: warning: ‘QObject* KPluginFactory::create(QObject*, const char*, const QStringList&)’ is deprecated (declared at /usr/include/kpluginfactory.h:353) [-Wdeprecated-declarations]
  721. /home/eithrial/AUR/krusader/src/krusader-2.4.0-beta1/krusader/KViewer/panelviewer.cpp: In member function ‘virtual KParts::ReadOnlyPart* PanelEditor::createPart(QString)’:
  722. /home/eithrial/AUR/krusader/src/krusader-2.4.0-beta1/krusader/KViewer/panelviewer.cpp:401:40: warning: ‘static KLibLoader* KLibLoader::self()’ is deprecated (declared at /usr/include/klibloader.h:144) [-Wdeprecated-declarations]
  723. /home/eithrial/AUR/krusader/src/krusader-2.4.0-beta1/krusader/KViewer/panelviewer.cpp:404:74: warning: ‘QObject* KPluginFactory::create(QObject*, const char*, const QStringList&)’ is deprecated (declared at /usr/include/kpluginfactory.h:353) [-Wdeprecated-declarations]
  724. [ 45%] Building CXX object krusader/GUI/CMakeFiles/GUI.dir/kcmdmodebutton.o
  725. [ 45%] Building CXX object krusader/KViewer/CMakeFiles/KViewer.dir/diskusageviewer.o
  726. [ 46%] Building CXX object krusader/GUI/CMakeFiles/GUI.dir/terminaldock.o
  727. [ 46%] Building CXX object krusader/Konfigurator/CMakeFiles/Konfigurator.dir/kgpanel.o
  728. In file included from /home/eithrial/AUR/krusader/src/krusader-2.4.0-beta1/krusader/KViewer/../DiskUsage/diskusage.h:50:0,
  729.                  from /home/eithrial/AUR/krusader/src/krusader-2.4.0-beta1/krusader/KViewer/diskusageviewer.h:34,
  730.                  from /home/eithrial/AUR/krusader/src/krusader-2.4.0-beta1/krusader/KViewer/diskusageviewer.cpp:31:
  731. /home/eithrial/AUR/krusader/src/krusader-2.4.0-beta1/krusader/KViewer/../DiskUsage/filelightParts/fileTree.h:101:21: warning: type qualifiers ignored on function return type [-Wignored-qualifiers]
  732. /home/eithrial/AUR/krusader/src/krusader-2.4.0-beta1/krusader/KViewer/../DiskUsage/filelightParts/fileTree.h:249:51: warning: type qualifiers ignored on function return type [-Wignored-qualifiers]
  733. /home/eithrial/AUR/krusader/src/krusader-2.4.0-beta1/krusader/KViewer/../DiskUsage/filelightParts/fileTree.h:252:51: warning: type qualifiers ignored on function return type [-Wignored-qualifiers]
  734. /home/eithrial/AUR/krusader/src/krusader-2.4.0-beta1/krusader/KViewer/../DiskUsage/filelightParts/fileTree.h:255:51: warning: type qualifiers ignored on function return type [-Wignored-qualifiers]
  735. /home/eithrial/AUR/krusader/src/krusader-2.4.0-beta1/krusader/KViewer/../DiskUsage/filelightParts/fileTree.h:267:51: warning: type qualifiers ignored on function return type [-Wignored-qualifiers]
  736. /home/eithrial/AUR/krusader/src/krusader-2.4.0-beta1/krusader/KViewer/../DiskUsage/filelightParts/fileTree.h:273:51: warning: type qualifiers ignored on function return type [-Wignored-qualifiers]
  737. /home/eithrial/AUR/krusader/src/krusader-2.4.0-beta1/krusader/KViewer/../DiskUsage/filelightParts/fileTree.h:276:51: warning: type qualifiers ignored on function return type [-Wignored-qualifiers]
  738. /home/eithrial/AUR/krusader/src/krusader-2.4.0-beta1/krusader/KViewer/../DiskUsage/filelightParts/fileTree.h:279:51: warning: type qualifiers ignored on function return type [-Wignored-qualifiers]
  739. /home/eithrial/AUR/krusader/src/krusader-2.4.0-beta1/krusader/KViewer/../DiskUsage/filelightParts/fileTree.h:285:51: warning: type qualifiers ignored on function return type [-Wignored-qualifiers]
  740. /home/eithrial/AUR/krusader/src/krusader-2.4.0-beta1/krusader/KViewer/../DiskUsage/filelightParts/fileTree.h:336:51: warning: type qualifiers ignored on function return type [-Wignored-qualifiers]
  741. In file included from /home/eithrial/AUR/krusader/src/krusader-2.4.0-beta1/krusader/GUI/../Panel/krpanel.h:35:0,
  742.                  from /home/eithrial/AUR/krusader/src/krusader-2.4.0-beta1/krusader/GUI/../krusaderview.h:51,
  743.                  from /home/eithrial/AUR/krusader/src/krusader-2.4.0-beta1/krusader/GUI/terminaldock.cpp:40:
  744. /home/eithrial/AUR/krusader/src/krusader-2.4.0-beta1/krusader/GUI/../Panel/../abstractpanelmanager.h:26:7: warning: ‘class AbstractPanelManager’ has virtual functions and accessible non-virtual destructor [-Wnon-virtual-dtor]
  745. In file included from /home/eithrial/AUR/krusader/src/krusader-2.4.0-beta1/krusader/GUI/../krusaderview.h:51:0,
  746.                  from /home/eithrial/AUR/krusader/src/krusader-2.4.0-beta1/krusader/GUI/terminaldock.cpp:40:
  747. /home/eithrial/AUR/krusader/src/krusader-2.4.0-beta1/krusader/GUI/../Panel/krpanel.h:43:7: warning: ‘class KrPanel’ has virtual functions and accessible non-virtual destructor [-Wnon-virtual-dtor]
  748. In file included from /home/eithrial/AUR/krusader/src/krusader-2.4.0-beta1/krusader/KViewer/../Panel/krpanel.h:35:0,
  749.                  from /home/eithrial/AUR/krusader/src/krusader-2.4.0-beta1/krusader/KViewer/diskusageviewer.cpp:37:
  750. /home/eithrial/AUR/krusader/src/krusader-2.4.0-beta1/krusader/KViewer/../Panel/../abstractpanelmanager.h:26:7: warning: ‘class AbstractPanelManager’ has virtual functions and accessible non-virtual destructor [-Wnon-virtual-dtor]
  751. In file included from /home/eithrial/AUR/krusader/src/krusader-2.4.0-beta1/krusader/KViewer/diskusageviewer.cpp:37:0:
  752. /home/eithrial/AUR/krusader/src/krusader-2.4.0-beta1/krusader/KViewer/../Panel/krpanel.h:43:7: warning: ‘class KrPanel’ has virtual functions and accessible non-virtual destructor [-Wnon-virtual-dtor]
  753. In file included from /home/eithrial/AUR/krusader/src/krusader-2.4.0-beta1/krusader/GUI/../filemanagerwindow.h:22:0,
  754.                  from /home/eithrial/AUR/krusader/src/krusader-2.4.0-beta1/krusader/GUI/terminaldock.cpp:41:
  755. /home/eithrial/AUR/krusader/src/krusader-2.4.0-beta1/krusader/GUI/../krmainwindow.h:29:7: warning: ‘class KrMainWindow’ has virtual functions and accessible non-virtual destructor [-Wnon-virtual-dtor]
  756. In file included from /home/eithrial/AUR/krusader/src/krusader-2.4.0-beta1/krusader/GUI/terminaldock.cpp:41:0:
  757. /home/eithrial/AUR/krusader/src/krusader-2.4.0-beta1/krusader/GUI/../filemanagerwindow.h:31:7: warning: ‘class FileManagerWindow’ has virtual functions and accessible non-virtual destructor [-Wnon-virtual-dtor]
  758. [ 47%] Building CXX object krusader/KViewer/CMakeFiles/KViewer.dir/lister.o
  759. In file included from /home/eithrial/AUR/krusader/src/krusader-2.4.0-beta1/krusader/GUI/terminaldock.cpp:19:0:
  760. /home/eithrial/AUR/krusader/src/krusader-2.4.0-beta1/krusader/GUI/terminaldock.h: In constructor ‘TerminalDock::TerminalDock(QWidget*, FileManagerWindow*)’:
  761. /home/eithrial/AUR/krusader/src/krusader-2.4.0-beta1/krusader/GUI/terminaldock.h:65:10: warning: ‘TerminalDock::initialised’ will be initialized after [-Wreorder]
  762. /home/eithrial/AUR/krusader/src/krusader-2.4.0-beta1/krusader/GUI/terminaldock.h:64:24: warning:   ‘TerminalInterface* TerminalDock::t’ [-Wreorder]
  763. /home/eithrial/AUR/krusader/src/krusader-2.4.0-beta1/krusader/GUI/terminaldock.cpp:52:1: warning:   when initialized here [-Wreorder]
  764. In file included from /home/eithrial/AUR/krusader/src/krusader-2.4.0-beta1/krusader/GUI/terminaldock.cpp:19:0:
  765. /home/eithrial/AUR/krusader/src/krusader-2.4.0-beta1/krusader/GUI/terminaldock.h:64:24: warning: ‘TerminalDock::t’ will be initialized after [-Wreorder]
  766. /home/eithrial/AUR/krusader/src/krusader-2.4.0-beta1/krusader/GUI/terminaldock.h:63:27: warning:   ‘KParts::ReadOnlyPart* TerminalDock::konsole_part’ [-Wreorder]
  767. /home/eithrial/AUR/krusader/src/krusader-2.4.0-beta1/krusader/GUI/terminaldock.cpp:52:1: warning:   when initialized here [-Wreorder]
  768. In file included from /home/eithrial/AUR/krusader/src/krusader-2.4.0-beta1/krusader/Konfigurator/kgpanel.cpp:49:0:
  769. /home/eithrial/AUR/krusader/src/krusader-2.4.0-beta1/krusader/Konfigurator/../Panel/krviewfactory.h:42:7: warning: ‘class KrViewInstance’ has virtual functions and accessible non-virtual destructor [-Wnon-virtual-dtor]
  770. Linking CXX static library ../../lib/libGUI.a
  771. [ 47%] Built target GUI
  772. Scanning dependencies of target Locate
  773. [ 48%] Building CXX object krusader/Locate/CMakeFiles/Locate.dir/Locate_automoc.o
  774. [ 48%] Building CXX object krusader/Locate/CMakeFiles/Locate.dir/locate.o
  775. [ 48%] /home/eithrial/AUR/krusader/src/krusader-2.4.0-beta1/krusader/KViewer/lister.cpp: In member function ‘QStringList Lister::readHexLines(qint64&, qint64, int, int)’:
  776. /home/eithrial/AUR/krusader/src/krusader-2.4.0-beta1/krusader/KViewer/lister.cpp:2108:36: warning: comparison is always false due to limited range of data type [-Wtype-limits]
  777. Building CXX object krusader/Konfigurator/CMakeFiles/Konfigurator.dir/kggeneral.o
  778. In file included from /home/eithrial/AUR/krusader/src/krusader-2.4.0-beta1/krusader/Locate/../Panel/krpanel.h:35:0,
  779.                  from /home/eithrial/AUR/krusader/src/krusader-2.4.0-beta1/krusader/Locate/../krusaderview.h:51,
  780.                  from /home/eithrial/AUR/krusader/src/krusader-2.4.0-beta1/krusader/Locate/locate.cpp:35:
  781. /home/eithrial/AUR/krusader/src/krusader-2.4.0-beta1/krusader/Locate/../Panel/../abstractpanelmanager.h:26:7: warning: ‘class AbstractPanelManager’ has virtual functions and accessible non-virtual destructor [-Wnon-virtual-dtor]
  782. In file included from /home/eithrial/AUR/krusader/src/krusader-2.4.0-beta1/krusader/Locate/../krusaderview.h:51:0,
  783.                  from /home/eithrial/AUR/krusader/src/krusader-2.4.0-beta1/krusader/Locate/locate.cpp:35:
  784. /home/eithrial/AUR/krusader/src/krusader-2.4.0-beta1/krusader/Locate/../Panel/krpanel.h:43:7: warning: ‘class KrPanel’ has virtual functions and accessible non-virtual destructor [-Wnon-virtual-dtor]
  785. /home/eithrial/AUR/krusader/src/krusader-2.4.0-beta1/krusader/Locate/locate.cpp:89:10: warning: unused parameter ‘supportedActs’ [-Wunused-parameter]
  786. In file included from /home/eithrial/AUR/krusader/src/krusader-2.4.0-beta1/krusader/Konfigurator/../Konfigurator/krresulttable.h:36:0,
  787.                  from /home/eithrial/AUR/krusader/src/krusader-2.4.0-beta1/krusader/Konfigurator/krresulttabledialog.h:32,
  788.                  from /home/eithrial/AUR/krusader/src/krusader-2.4.0-beta1/krusader/Konfigurator/kggeneral.cpp:44:
  789. /home/eithrial/AUR/krusader/src/krusader-2.4.0-beta1/krusader/Konfigurator/../Konfigurator/searchobject.h:39:27: warning: type qualifiers ignored on function return type [-Wignored-qualifiers]
  790. In file included from /home/eithrial/AUR/krusader/src/krusader-2.4.0-beta1/krusader/Konfigurator/../Konfigurator/krresulttable.h:36:0,
  791.                  from /home/eithrial/AUR/krusader/src/krusader-2.4.0-beta1/krusader/Konfigurator/krresulttabledialog.h:32,
  792.                  from /home/eithrial/AUR/krusader/src/krusader-2.4.0-beta1/krusader/Konfigurator/kggeneral.cpp:44:
  793. /home/eithrial/AUR/krusader/src/krusader-2.4.0-beta1/krusader/Konfigurator/../Konfigurator/searchobject.h:104:30: warning: type qualifiers ignored on function return type [-Wignored-qualifiers]
  794. /home/eithrial/AUR/krusader/src/krusader-2.4.0-beta1/krusader/Konfigurator/../Konfigurator/searchobject.h:107:32: warning: type qualifiers ignored on function return type [-Wignored-qualifiers]
  795. /home/eithrial/AUR/krusader/src/krusader-2.4.0-beta1/krusader/Konfigurator/../Konfigurator/searchobject.h:134:32: warning: type qualifiers ignored on function return type [-Wignored-qualifiers]
  796. [ 49%] Building CXX object krusader/Konfigurator/CMakeFiles/Konfigurator.dir/kgarchives.o
  797. Linking CXX static library ../../lib/libLocate.a
  798. [ 49%] Built target Locate
  799. Scanning dependencies of target MountMan
  800. [ 50%] Building CXX object krusader/MountMan/CMakeFiles/MountMan.dir/MountMan_automoc.o
  801. [ 50%] Building CXX object krusader/MountMan/CMakeFiles/MountMan.dir/kmountmangui.o
  802. Linking CXX static library ../../lib/libKViewer.a
  803. [ 50%] Built target KViewer
  804. Scanning dependencies of target Queue
  805. [ 50%] Building CXX object krusader/Queue/CMakeFiles/Queue.dir/Queue_automoc.o
  806. In file included from /home/eithrial/AUR/krusader/src/krusader-2.4.0-beta1/krusader/Konfigurator/krresulttable.h:36:0,
  807.                  from /home/eithrial/AUR/krusader/src/krusader-2.4.0-beta1/krusader/Konfigurator/kgarchives.cpp:37:
  808. /home/eithrial/AUR/krusader/src/krusader-2.4.0-beta1/krusader/Konfigurator/searchobject.h:39:27: warning: type qualifiers ignored on function return type [-Wignored-qualifiers]
  809. In file included from /home/eithrial/AUR/krusader/src/krusader-2.4.0-beta1/krusader/Konfigurator/krresulttable.h:36:0,
  810.                  from /home/eithrial/AUR/krusader/src/krusader-2.4.0-beta1/krusader/Konfigurator/kgarchives.cpp:37:
  811. /home/eithrial/AUR/krusader/src/krusader-2.4.0-beta1/krusader/Konfigurator/searchobject.h:104:30: warning: type qualifiers ignored on function return type [-Wignored-qualifiers]
  812. /home/eithrial/AUR/krusader/src/krusader-2.4.0-beta1/krusader/Konfigurator/searchobject.h:107:32: warning: type qualifiers ignored on function return type [-Wignored-qualifiers]
  813. /home/eithrial/AUR/krusader/src/krusader-2.4.0-beta1/krusader/Konfigurator/searchobject.h:134:32: warning: type qualifiers ignored on function return type [-Wignored-qualifiers]
  814. [ 50%] Building CXX object krusader/Konfigurator/CMakeFiles/Konfigurator.dir/kgadvanced.o
  815. /home/eithrial/AUR/krusader/src/krusader-2.4.0-beta1/krusader/MountMan/kmountmangui.cpp: In member function ‘void KMountManGUI::getSpaceData()’:
  816. /home/eithrial/AUR/krusader/src/krusader-2.4.0-beta1/krusader/MountMan/kmountmangui.cpp:248:25: warning: ‘KDiskFreeSpace’ is deprecated (declared at /usr/include/kdiskfreespace.h:34) [-Wdeprecated-declarations]
  817. [ 51%] Building CXX object krusader/Queue/CMakeFiles/Queue.dir/queue.o
  818. [ 52%] Building CXX object krusader/MountMan/CMakeFiles/MountMan.dir/kmountman.o
  819. [ 53%] Building CXX object krusader/Konfigurator/CMakeFiles/Konfigurator.dir/kguseractions.o
  820. [ 53%] Building CXX object krusader/Queue/CMakeFiles/Queue.dir/queue_mgr.o
  821. /home/eithrial/AUR/krusader/src/krusader-2.4.0-beta1/krusader/Queue/queue_mgr.cpp: In member function ‘void QueueManager::slotQueueEmptied()’:
  822. /home/eithrial/AUR/krusader/src/krusader-2.4.0-beta1/krusader/Queue/queue_mgr.cpp:132:10: warning: variable ‘empty’ set but not used [-Wunused-but-set-variable]
  823. In file included from /home/eithrial/AUR/krusader/src/krusader-2.4.0-beta1/krusader/MountMan/kmountman.cpp:29:0:
  824. /home/eithrial/AUR/krusader/src/krusader-2.4.0-beta1/krusader/MountMan/kmountman.h: In constructor ‘KMountMan::KMountMan(QWidget*)’:
  825. /home/eithrial/AUR/krusader/src/krusader-2.4.0-beta1/krusader/MountMan/kmountman.h:128:23: warning: ‘KMountMan::parentWindow’ will be initialized after [-Wreorder]
  826. /home/eithrial/AUR/krusader/src/krusader-2.4.0-beta1/krusader/MountMan/kmountman.h:119:10: warning:   ‘bool KMountMan::Operational’ [-Wreorder]
  827. /home/eithrial/AUR/krusader/src/krusader-2.4.0-beta1/krusader/MountMan/kmountman.cpp:68:1: warning:   when initialized here [-Wreorder]
  828. /home/eithrial/AUR/krusader/src/krusader-2.4.0-beta1/krusader/MountMan/kmountman.cpp: In member function ‘void KMountMan::mount(QString, bool)’:
  829. /home/eithrial/AUR/krusader/src/krusader-2.4.0-beta1/krusader/MountMan/kmountman.cpp:198:119: warning: converting ‘false’ to pointer type for argument 1 of ‘QFlags<Enum>::QFlags(QFlags<Enum>::Zero) [with Enum = KIO::JobFlag; QFlags<Enum>::Zero = void**]’ [-Wconversion-null]
  830. /home/eithrial/AUR/krusader/src/krusader-2.4.0-beta1/krusader/MountMan/kmountman.cpp: In member function ‘void KMountMan::unmount(QString, bool)’:
  831. /home/eithrial/AUR/krusader/src/krusader-2.4.0-beta1/krusader/MountMan/kmountman.cpp:241:59: warning: converting ‘false’ to pointer type for argument 1 of ‘QFlags<Enum>::QFlags(QFlags<Enum>::Zero) [with Enum = KIO::JobFlag; QFlags<Enum>::Zero = void**]’ [-Wconversion-null]
  832. /home/eithrial/AUR/krusader/src/krusader-2.4.0-beta1/krusader/MountMan/kmountman.cpp: At global scope:
  833. /home/eithrial/AUR/krusader/src/krusader-2.4.0-beta1/krusader/MountMan/kmountman.cpp:513:6: warning: unused parameter ‘udi’ [-Wunused-parameter]
  834. /home/eithrial/AUR/krusader/src/krusader-2.4.0-beta1/krusader/MountMan/kmountman.cpp:521:6: warning: unused parameter ‘udi’ [-Wunused-parameter]
  835. [ 53%] Building CXX object krusader/Konfigurator/CMakeFiles/Konfigurator.dir/kgprotocols.o
  836. [ 54%] Building CXX object krusader/Queue/CMakeFiles/Queue.dir/queuewidget.o
  837. Linking CXX static library ../../lib/libMountMan.a
  838. [ 54%] Built target MountMan
  839. Scanning dependencies of target Panel
  840. [ 54%] Building CXX object krusader/Panel/CMakeFiles/Panel.dir/Panel_automoc.o
  841. [ 54%] Building CXX object krusader/Queue/CMakeFiles/Queue.dir/queuedialog.o
  842. [ 55%] Building CXX object krusader/Konfigurator/CMakeFiles/Konfigurator.dir/krresulttable.o
  843. In file included from /home/eithrial/AUR/krusader/src/build/krusader/Panel/../../../krusader-2.4.0-beta1/krusader/Panel/kritemview.h:22:0,
  844.                  from /home/eithrial/AUR/krusader/src/build/krusader/Panel/moc_kritemview.cpp:10,
  845.                  from /home/eithrial/AUR/krusader/src/build/krusader/Panel/Panel_automoc.cpp:8:
  846. /home/eithrial/AUR/krusader/src/build/krusader/Panel/../../../krusader-2.4.0-beta1/krusader/Panel/krinterview.h:83:22: warning: unused parameter ‘index’ [-Wunused-parameter]
  847. /home/eithrial/AUR/krusader/src/build/krusader/Panel/../../../krusader-2.4.0-beta1/krusader/Panel/krinterview.h:83:22: warning: unused parameter ‘command’ [-Wunused-parameter]
  848. /home/eithrial/AUR/krusader/src/build/krusader/Panel/../../../krusader-2.4.0-beta1/krusader/Panel/krinterview.h:84:22: warning: unused parameter ‘selection’ [-Wunused-parameter]
  849. /home/eithrial/AUR/krusader/src/build/krusader/Panel/../../../krusader-2.4.0-beta1/krusader/Panel/krinterview.h:84:22: warning: unused parameter ‘command’ [-Wunused-parameter]
  850. /home/eithrial/AUR/krusader/src/build/krusader/Panel/../../../krusader-2.4.0-beta1/krusader/Panel/krinterview.h:48:18: warning: ‘virtual void KrInterView::setSelection(KUrl::List)’ was hidden [-Woverloaded-virtual]
  851. In file included from /home/eithrial/AUR/krusader/src/build/krusader/Panel/moc_kritemview.cpp:10:0,
  852.                  from /home/eithrial/AUR/krusader/src/build/krusader/Panel/Panel_automoc.cpp:8:
  853. /home/eithrial/AUR/krusader/src/build/krusader/Panel/../../../krusader-2.4.0-beta1/krusader/Panel/kritemview.h:35:18: warning:   by ‘virtual void KrItemView::setSelection(const QRect&, QItemSelectionModel::SelectionFlags)’ [-Woverloaded-virtual]
  854. /home/eithrial/AUR/krusader/src/build/krusader/Panel/../../../krusader-2.4.0-beta1/krusader/Panel/kritemview.h:35:18: warning: unused parameter ‘rect’ [-Wunused-parameter]
  855. /home/eithrial/AUR/krusader/src/build/krusader/Panel/../../../krusader-2.4.0-beta1/krusader/Panel/kritemview.h:35:18: warning: unused parameter ‘command’ [-Wunused-parameter]
  856. In file included from /home/eithrial/AUR/krusader/src/build/krusader/Panel/../../../krusader-2.4.0-beta1/krusader/Panel/kritemview.h:22:0,
  857.                  from /home/eithrial/AUR/krusader/src/build/krusader/Panel/moc_kritemview.cpp:10,
  858.                  from /home/eithrial/AUR/krusader/src/build/krusader/Panel/Panel_automoc.cpp:8:
  859. /home/eithrial/AUR/krusader/src/build/krusader/Panel/../../../krusader-2.4.0-beta1/krusader/Panel/krinterview.h:48:18: warning: ‘virtual void KrInterView::setSelection(KUrl::List)’ was hidden [-Woverloaded-virtual]
  860. In file included from /home/eithrial/AUR/krusader/src/build/krusader/Panel/moc_krinterdetailedview.cpp:10:0,
  861.                  from /home/eithrial/AUR/krusader/src/build/krusader/Panel/Panel_automoc.cpp:12:
  862. /home/eithrial/AUR/krusader/src/build/krusader/Panel/../../../krusader-2.4.0-beta1/krusader/Panel/krinterdetailedview.h:63:18: warning:   by ‘virtual void KrInterDetailedView::setSelection(const QRect&, QItemSelectionModel::SelectionFlags)’ [-Woverloaded-virtual]
  863. In file included from /home/eithrial/AUR/krusader/src/build/krusader/Panel/../../../krusader-2.4.0-beta1/krusader/Panel/kritemview.h:22:0,
  864.                  from /home/eithrial/AUR/krusader/src/build/krusader/Panel/moc_kritemview.cpp:10,
  865.                  from /home/eithrial/AUR/krusader/src/build/krusader/Panel/Panel_automoc.cpp:8:
  866. /home/eithrial/AUR/krusader/src/build/krusader/Panel/../../../krusader-2.4.0-beta1/krusader/Panel/krinterview.h:67:18: warning: ‘virtual void KrInterView::showContextMenu()’ was hidden [-Woverloaded-virtual]
  867. In file included from /home/eithrial/AUR/krusader/src/build/krusader/Panel/moc_krinterdetailedview.cpp:10:0,
  868.                  from /home/eithrial/AUR/krusader/src/build/krusader/Panel/Panel_automoc.cpp:12:
  869. /home/eithrial/AUR/krusader/src/build/krusader/Panel/../../../krusader-2.4.0-beta1/krusader/Panel/krinterdetailedview.h:82:18: warning:   by ‘virtual void KrInterDetailedView::showContextMenu(const QPoint&)’ [-Woverloaded-virtual]
  870. /home/eithrial/AUR/krusader/src/build/krusader/Panel/../../../krusader-2.4.0-beta1/krusader/Panel/krinterdetailedview.h:63:18: warning: unused parameter ‘rect’ [-Wunused-parameter]
  871. /home/eithrial/AUR/krusader/src/build/krusader/Panel/../../../krusader-2.4.0-beta1/krusader/Panel/krinterdetailedview.h:63:18: warning: unused parameter ‘command’ [-Wunused-parameter]
  872. In file included from /home/eithrial/AUR/krusader/src/build/krusader/Panel/moc_krvfsmodel.cpp:10:0,
  873.                  from /home/eithrial/AUR/krusader/src/build/krusader/Panel/Panel_automoc.cpp:14:
  874. /home/eithrial/AUR/krusader/src/build/krusader/Panel/../../../krusader-2.4.0-beta1/krusader/Panel/krvfsmodel.h:98:22: warning: unused parameter ‘vf’ [-Wunused-parameter]
  875. In file included from /home/eithrial/AUR/krusader/src/build/krusader/Panel/../../../krusader-2.4.0-beta1/krusader/Panel/krpanel.h:35:0,
  876.                  from /home/eithrial/AUR/krusader/src/build/krusader/Panel/../../../krusader-2.4.0-beta1/krusader/Panel/listpanel.h:58,
  877.                  from /home/eithrial/AUR/krusader/src/build/krusader/Panel/moc_listpanel.cpp:10,
  878.                  from /home/eithrial/AUR/krusader/src/build/krusader/Panel/Panel_automoc.cpp:15:
  879. /home/eithrial/AUR/krusader/src/build/krusader/Panel/../../../krusader-2.4.0-beta1/krusader/Panel/../abstractpanelmanager.h:26:7: warning: ‘class AbstractPanelManager’ has virtual functions and accessible non-virtual destructor [-Wnon-virtual-dtor]
  880. In file included from /home/eithrial/AUR/krusader/src/build/krusader/Panel/../../../krusader-2.4.0-beta1/krusader/Panel/listpanel.h:58:0,
  881.                  from /home/eithrial/AUR/krusader/src/build/krusader/Panel/moc_listpanel.cpp:10,
  882.                  from /home/eithrial/AUR/krusader/src/build/krusader/Panel/Panel_automoc.cpp:15:
  883. /home/eithrial/AUR/krusader/src/build/krusader/Panel/../../../krusader-2.4.0-beta1/krusader/Panel/krpanel.h:43:7: warning: ‘class KrPanel’ has virtual functions and accessible non-virtual destructor [-Wnon-virtual-dtor]
  884. In file included from /home/eithrial/AUR/krusader/src/build/krusader/Panel/../../../krusader-2.4.0-beta1/krusader/Panel/kritemview.h:22:0,
  885.                  from /home/eithrial/AUR/krusader/src/build/krusader/Panel/moc_kritemview.cpp:10,
  886.                  from /home/eithrial/AUR/krusader/src/build/krusader/Panel/Panel_automoc.cpp:8:
  887. /home/eithrial/AUR/krusader/src/build/krusader/Panel/../../../krusader-2.4.0-beta1/krusader/Panel/krinterview.h:67:18: warning: ‘virtual void KrInterView::showContextMenu()’ was hidden [-Woverloaded-virtual]
  888. In file included from /home/eithrial/AUR/krusader/src/build/krusader/Panel/moc_krinterbriefview.cpp:10:0,
  889.                  from /home/eithrial/AUR/krusader/src/build/krusader/Panel/Panel_automoc.cpp:18:
  890. /home/eithrial/AUR/krusader/src/build/krusader/Panel/../../../krusader-2.4.0-beta1/krusader/Panel/krinterbriefview.h:72:18: warning:   by ‘virtual void KrInterBriefView::showContextMenu(const QPoint&)’ [-Woverloaded-virtual]
  891. In file included from /home/eithrial/AUR/krusader/src/krusader-2.4.0-beta1/krusader/Konfigurator/krresulttable.h:36:0,
  892.                  from /home/eithrial/AUR/krusader/src/krusader-2.4.0-beta1/krusader/Konfigurator/krresulttable.cpp:19:
  893. /home/eithrial/AUR/krusader/src/krusader-2.4.0-beta1/krusader/Konfigurator/searchobject.h:39:27: warning: type qualifiers ignored on function return type [-Wignored-qualifiers]
  894. In file included from /home/eithrial/AUR/krusader/src/krusader-2.4.0-beta1/krusader/Konfigurator/krresulttable.h:36:0,
  895.                  from /home/eithrial/AUR/krusader/src/krusader-2.4.0-beta1/krusader/Konfigurator/krresulttable.cpp:19:
  896. /home/eithrial/AUR/krusader/src/krusader-2.4.0-beta1/krusader/Konfigurator/searchobject.h:104:30: warning: type qualifiers ignored on function return type [-Wignored-qualifiers]
  897. /home/eithrial/AUR/krusader/src/krusader-2.4.0-beta1/krusader/Konfigurator/searchobject.h:107:32: warning: type qualifiers ignored on function return type [-Wignored-qualifiers]
  898. /home/eithrial/AUR/krusader/src/krusader-2.4.0-beta1/krusader/Konfigurator/searchobject.h:134:32: warning: type qualifiers ignored on function return type [-Wignored-qualifiers]
  899. In file included from /home/eithrial/AUR/krusader/src/krusader-2.4.0-beta1/krusader/Konfigurator/../filemanagerwindow.h:22:0,
  900.                  from /home/eithrial/AUR/krusader/src/krusader-2.4.0-beta1/krusader/Konfigurator/../krusader.h:39,
  901.                  from /home/eithrial/AUR/krusader/src/krusader-2.4.0-beta1/krusader/Konfigurator/krresulttable.cpp:26:
  902. /home/eithrial/AUR/krusader/src/krusader-2.4.0-beta1/krusader/Konfigurator/../krmainwindow.h:29:7: warning: ‘class KrMainWindow’ has virtual functions and accessible non-virtual destructor [-Wnon-virtual-dtor]
  903. In file included from /home/eithrial/AUR/krusader/src/krusader-2.4.0-beta1/krusader/Konfigurator/../filemanagerwindow.h:23:0,
  904.                  from /home/eithrial/AUR/krusader/src/krusader-2.4.0-beta1/krusader/Konfigurator/../krusader.h:39,
  905.                  from /home/eithrial/AUR/krusader/src/krusader-2.4.0-beta1/krusader/Konfigurator/krresulttable.cpp:26:
  906. /home/eithrial/AUR/krusader/src/krusader-2.4.0-beta1/krusader/Konfigurator/../abstractpanelmanager.h:26:7: warning: ‘class AbstractPanelManager’ has virtual functions and accessible non-virtual destructor [-Wnon-virtual-dtor]
  907. In file included from /home/eithrial/AUR/krusader/src/krusader-2.4.0-beta1/krusader/Konfigurator/../krusader.h:39:0,
  908.                  from /home/eithrial/AUR/krusader/src/krusader-2.4.0-beta1/krusader/Konfigurator/krresulttable.cpp:26:
  909. /home/eithrial/AUR/krusader/src/krusader-2.4.0-beta1/krusader/Konfigurator/../filemanagerwindow.h:31:7: warning: ‘class FileManagerWindow’ has virtual functions and accessible non-virtual destructor [-Wnon-virtual-dtor]
  910. [ 55%] Building CXX object krusader/Panel/CMakeFiles/Panel.dir/urlrequester.o
  911. Linking CXX static library ../../lib/libQueue.a
  912. [ 55%] Built target Queue
  913. Scanning dependencies of target Search
  914. [ 56%] Building CXX object krusader/Search/CMakeFiles/Search.dir/Search_automoc.o
  915. [ 56%] Building CXX object krusader/Search/CMakeFiles/Search.dir/krsearchmod.o
  916. [ 56%] /home/eithrial/AUR/krusader/src/krusader-2.4.0-beta1/krusader/Panel/urlrequester.cpp:35:18: warning: unused parameter ‘event’ [-Wunused-parameter]
  917. /home/eithrial/AUR/krusader/src/krusader-2.4.0-beta1/krusader/Panel/urlrequester.cpp:41:18: warning: unused parameter ‘event’ [-Wunused-parameter]
  918. /home/eithrial/AUR/krusader/src/krusader-2.4.0-beta1/krusader/Panel/urlrequester.cpp:45:18: warning: unused parameter ‘event’ [-Wunused-parameter]
  919. /home/eithrial/AUR/krusader/src/krusader-2.4.0-beta1/krusader/Panel/urlrequester.cpp:49:18: warning: unused parameter ‘event’ [-Wunused-parameter]
  920. Building CXX object krusader/Konfigurator/CMakeFiles/Konfigurator.dir/krresulttabledialog.o
  921. [ 57%] Building CXX object krusader/Panel/CMakeFiles/Panel.dir/kritemview.o
  922. In file included from /home/eithrial/AUR/krusader/src/krusader-2.4.0-beta1/krusader/Konfigurator/../Konfigurator/krresulttable.h:36:0,
  923.                  from /home/eithrial/AUR/krusader/src/krusader-2.4.0-beta1/krusader/Konfigurator/krresulttabledialog.h:32,
  924.                  from /home/eithrial/AUR/krusader/src/krusader-2.4.0-beta1/krusader/Konfigurator/krresulttabledialog.cpp:19:
  925. /home/eithrial/AUR/krusader/src/krusader-2.4.0-beta1/krusader/Konfigurator/../Konfigurator/searchobject.h:39:27: warning: type qualifiers ignored on function return type [-Wignored-qualifiers]
  926. In file included from /home/eithrial/AUR/krusader/src/krusader-2.4.0-beta1/krusader/Konfigurator/../Konfigurator/krresulttable.h:36:0,
  927.                  from /home/eithrial/AUR/krusader/src/krusader-2.4.0-beta1/krusader/Konfigurator/krresulttabledialog.h:32,
  928.                  from /home/eithrial/AUR/krusader/src/krusader-2.4.0-beta1/krusader/Konfigurator/krresulttabledialog.cpp:19:
  929. /home/eithrial/AUR/krusader/src/krusader-2.4.0-beta1/krusader/Konfigurator/../Konfigurator/searchobject.h:104:30: warning: type qualifiers ignored on function return type [-Wignored-qualifiers]
  930. /home/eithrial/AUR/krusader/src/krusader-2.4.0-beta1/krusader/Konfigurator/../Konfigurator/searchobject.h:107:32: warning: type qualifiers ignored on function return type [-Wignored-qualifiers]
  931. /home/eithrial/AUR/krusader/src/krusader-2.4.0-beta1/krusader/Konfigurator/../Konfigurator/searchobject.h:134:32: warning: type qualifiers ignored on function return type [-Wignored-qualifiers]
  932. [ 57%] Building CXX object krusader/Konfigurator/CMakeFiles/Konfigurator.dir/searchobject.o
  933. In file included from /home/eithrial/AUR/krusader/src/krusader-2.4.0-beta1/krusader/Panel/kritemview.h:22:0,
  934.                  from /home/eithrial/AUR/krusader/src/krusader-2.4.0-beta1/krusader/Panel/kritemview.cpp:19:
  935. /home/eithrial/AUR/krusader/src/krusader-2.4.0-beta1/krusader/Panel/krinterview.h:83:22: warning: unused parameter ‘index’ [-Wunused-parameter]
  936. /home/eithrial/AUR/krusader/src/krusader-2.4.0-beta1/krusader/Panel/krinterview.h:83:22: warning: unused parameter ‘command’ [-Wunused-parameter]
  937. /home/eithrial/AUR/krusader/src/krusader-2.4.0-beta1/krusader/Panel/krinterview.h:84:22: warning: unused parameter ‘selection’ [-Wunused-parameter]
  938. /home/eithrial/AUR/krusader/src/krusader-2.4.0-beta1/krusader/Panel/krinterview.h:84:22: warning: unused parameter ‘command’ [-Wunused-parameter]
  939. /home/eithrial/AUR/krusader/src/krusader-2.4.0-beta1/krusader/Panel/krinterview.h:48:18: warning: ‘virtual void KrInterView::setSelection(KUrl::List)’ was hidden [-Woverloaded-virtual]
  940. In file included from /home/eithrial/AUR/krusader/src/krusader-2.4.0-beta1/krusader/Panel/kritemview.cpp:19:0:
  941. /home/eithrial/AUR/krusader/src/krusader-2.4.0-beta1/krusader/Panel/kritemview.h:35:18: warning:   by ‘virtual void KrItemView::setSelection(const QRect&, QItemSelectionModel::SelectionFlags)’ [-Woverloaded-virtual]
  942. /home/eithrial/AUR/krusader/src/krusader-2.4.0-beta1/krusader/Panel/kritemview.h:35:18: warning: unused parameter ‘rect’ [-Wunused-parameter]
  943. /home/eithrial/AUR/krusader/src/krusader-2.4.0-beta1/krusader/Panel/kritemview.h:35:18: warning: unused parameter ‘command’ [-Wunused-parameter]
  944. In file included from /home/eithrial/AUR/krusader/src/krusader-2.4.0-beta1/krusader/Panel/kritemview.cpp:21:0:
  945. /home/eithrial/AUR/krusader/src/krusader-2.4.0-beta1/krusader/Panel/krvfsmodel.h:98:22: warning: unused parameter ‘vf’ [-Wunused-parameter]
  946. In file included from /home/eithrial/AUR/krusader/src/krusader-2.4.0-beta1/krusader/Konfigurator/searchobject.cpp:19:0:
  947. /home/eithrial/AUR/krusader/src/krusader-2.4.0-beta1/krusader/Konfigurator/searchobject.h:39:27: warning: type qualifiers ignored on function return type [-Wignored-qualifiers]
  948. In file included from /home/eithrial/AUR/krusader/src/krusader-2.4.0-beta1/krusader/Konfigurator/searchobject.cpp:19:0:
  949. /home/eithrial/AUR/krusader/src/krusader-2.4.0-beta1/krusader/Konfigurator/searchobject.h:104:30: warning: type qualifiers ignored on function return type [-Wignored-qualifiers]
  950. /home/eithrial/AUR/krusader/src/krusader-2.4.0-beta1/krusader/Konfigurator/searchobject.h:107:32: warning: type qualifiers ignored on function return type [-Wignored-qualifiers]
  951. /home/eithrial/AUR/krusader/src/krusader-2.4.0-beta1/krusader/Konfigurator/searchobject.h:134:32: warning: type qualifiers ignored on function return type [-Wignored-qualifiers]
  952. [ 57%] Building CXX object krusader/Search/CMakeFiles/Search.dir/krsearchdialog.o
  953. Linking CXX static library ../../lib/libKonfigurator.a
  954. [ 57%] Building CXX object krusader/Panel/CMakeFiles/Panel.dir/quickfilter.o
  955. [ 57%] Built target Konfigurator
  956. Scanning dependencies of target Splitter
  957. [ 58%] Building CXX object krusader/Splitter/CMakeFiles/Splitter.dir/Splitter_automoc.o
  958. [ 58%] Building CXX object krusader/Splitter/CMakeFiles/Splitter.dir/crc32.o
  959. [ 59%] Building CXX object krusader/Splitter/CMakeFiles/Splitter.dir/splittergui.o
  960. /home/eithrial/AUR/krusader/src/krusader-2.4.0-beta1/krusader/Panel/quickfilter.cpp:48:6: warning: unused parameter ‘match’ [-Wunused-parameter]
  961. [ 60%] Building CXX object krusader/Panel/CMakeFiles/Panel.dir/viewactions.o
  962. In file included from /home/eithrial/AUR/krusader/src/krusader-2.4.0-beta1/krusader/Search/../panelmanager.h:23:0,
  963.                  from /home/eithrial/AUR/krusader/src/krusader-2.4.0-beta1/krusader/Search/krsearchdialog.cpp:62:
  964. /home/eithrial/AUR/krusader/src/krusader-2.4.0-beta1/krusader/Search/../abstractpanelmanager.h:26:7: warning: ‘class AbstractPanelManager’ has virtual functions and accessible non-virtual destructor [-Wnon-virtual-dtor]
  965. In file included from /home/eithrial/AUR/krusader/src/krusader-2.4.0-beta1/krusader/Search/../krusaderview.h:51:0,
  966.                  from /home/eithrial/AUR/krusader/src/krusader-2.4.0-beta1/krusader/Search/krsearchdialog.cpp:64:
  967. /home/eithrial/AUR/krusader/src/krusader-2.4.0-beta1/krusader/Search/../Panel/krpanel.h:43:7: warning: ‘class KrPanel’ has virtual functions and accessible non-virtual destructor [-Wnon-virtual-dtor]
  968. In file included from /home/eithrial/AUR/krusader/src/krusader-2.4.0-beta1/krusader/Panel/viewactions.cpp:34:0:
  969. /home/eithrial/AUR/krusader/src/krusader-2.4.0-beta1/krusader/Panel/../krmainwindow.h:29:7: warning: ‘class KrMainWindow’ has virtual functions and accessible non-virtual destructor [-Wnon-virtual-dtor]
  970. In file included from /home/eithrial/AUR/krusader/src/krusader-2.4.0-beta1/krusader/Search/krsearchdialog.cpp:72:0:
  971. /home/eithrial/AUR/krusader/src/krusader-2.4.0-beta1/krusader/Search/../Panel/krviewfactory.h:42:7: warning: ‘class KrViewInstance’ has virtual functions and accessible non-virtual destructor [-Wnon-virtual-dtor]
  972. [ 60%] Building CXX object krusader/Splitter/CMakeFiles/Splitter.dir/splitter.o
  973. [ 60%] Building CXX object krusader/Panel/CMakeFiles/Panel.dir/listpanelactions.o
  974. In file included from /home/eithrial/AUR/krusader/src/krusader-2.4.0-beta1/krusader/Panel/krpanel.h:35:0,
  975.                  from /home/eithrial/AUR/krusader/src/krusader-2.4.0-beta1/krusader/Panel/listpanel.h:58,
  976.                  from /home/eithrial/AUR/krusader/src/krusader-2.4.0-beta1/krusader/Panel/listpanelactions.cpp:34:
  977. /home/eithrial/AUR/krusader/src/krusader-2.4.0-beta1/krusader/Panel/../abstractpanelmanager.h:26:7: warning: ‘class AbstractPanelManager’ has virtual functions and accessible non-virtual destructor [-Wnon-virtual-dtor]
  978. In file included from /home/eithrial/AUR/krusader/src/krusader-2.4.0-beta1/krusader/Panel/listpanel.h:58:0,
  979.                  from /home/eithrial/AUR/krusader/src/krusader-2.4.0-beta1/krusader/Panel/listpanelactions.cpp:34:
  980. /home/eithrial/AUR/krusader/src/krusader-2.4.0-beta1/krusader/Panel/krpanel.h:43:7: warning: ‘class KrPanel’ has virtual functions and accessible non-virtual destructor [-Wnon-virtual-dtor]
  981. [ 61%] Building CXX object krusader/Splitter/CMakeFiles/Splitter.dir/combiner.o
  982. Linking CXX static library ../../lib/libSearch.a
  983. [ 61%] Built target Search
  984. Scanning dependencies of target Synchronizer
  985. [ 61%] Building CXX object krusader/Synchronizer/CMakeFiles/Synchronizer.dir/Synchronizer_automoc.o
  986. In file included from /home/eithrial/AUR/krusader/src/krusader-2.4.0-beta1/krusader/Panel/listpanelactions.cpp:36:0:
  987. /home/eithrial/AUR/krusader/src/krusader-2.4.0-beta1/krusader/Panel/krviewfactory.h:42:7: warning: ‘class KrViewInstance’ has virtual functions and accessible non-virtual destructor [-Wnon-virtual-dtor]
  988. In file included from /home/eithrial/AUR/krusader/src/krusader-2.4.0-beta1/krusader/Panel/../filemanagerwindow.h:22:0,
  989.                  from /home/eithrial/AUR/krusader/src/krusader-2.4.0-beta1/krusader/Panel/listpanelactions.cpp:37:
  990. /home/eithrial/AUR/krusader/src/krusader-2.4.0-beta1/krusader/Panel/../krmainwindow.h:29:7: warning: ‘class KrMainWindow’ has virtual functions and accessible non-virtual destructor [-Wnon-virtual-dtor]
  991. In file included from /home/eithrial/AUR/krusader/src/krusader-2.4.0-beta1/krusader/Panel/listpanelactions.cpp:37:0:
  992. /home/eithrial/AUR/krusader/src/krusader-2.4.0-beta1/krusader/Panel/../filemanagerwindow.h:31:7: warning: ‘class FileManagerWindow’ has virtual functions and accessible non-virtual destructor [-Wnon-virtual-dtor]
  993. [ 62%] Building CXX object krusader/Synchronizer/CMakeFiles/Synchronizer.dir/synchronizedialog.o
  994. Linking CXX static library ../../lib/libSplitter.a
  995. [ 62%] Built target Splitter
  996. [ 63%] Building CXX object krusader/Panel/CMakeFiles/Panel.dir/dirhistoryqueue.o
  997. Scanning dependencies of target UserAction
  998. [ 63%] Building CXX object krusader/UserAction/CMakeFiles/UserAction.dir/UserAction_automoc.o
  999. [ 64%] Building CXX object krusader/UserAction/CMakeFiles/UserAction.dir/kraction.o
  1000. [ 64%] Building CXX object krusader/Synchronizer/CMakeFiles/Synchronizer.dir/synchronizer.o
  1001. In file included from /home/eithrial/AUR/krusader/src/krusader-2.4.0-beta1/krusader/Panel/krpanel.h:35:0,
  1002.                  from /home/eithrial/AUR/krusader/src/krusader-2.4.0-beta1/krusader/Panel/dirhistoryqueue.cpp:23:
  1003. /home/eithrial/AUR/krusader/src/krusader-2.4.0-beta1/krusader/Panel/../abstractpanelmanager.h:26:7: warning: ‘class AbstractPanelManager’ has virtual functions and accessible non-virtual destructor [-Wnon-virtual-dtor]
  1004. In file included from /home/eithrial/AUR/krusader/src/krusader-2.4.0-beta1/krusader/Panel/dirhistoryqueue.cpp:23:0:
  1005. /home/eithrial/AUR/krusader/src/krusader-2.4.0-beta1/krusader/Panel/krpanel.h:43:7: warning: ‘class KrPanel’ has virtual functions and accessible non-virtual destructor [-Wnon-virtual-dtor]
  1006. In file included from /home/eithrial/AUR/krusader/src/krusader-2.4.0-beta1/krusader/Panel/dirhistoryqueue.cpp:21:0:
  1007. /home/eithrial/AUR/krusader/src/krusader-2.4.0-beta1/krusader/Panel/dirhistoryqueue.h: In constructor ‘DirHistoryQueue::DirHistoryQueue(KrPanel*)’:
  1008. /home/eithrial/AUR/krusader/src/krusader-2.4.0-beta1/krusader/Panel/dirhistoryqueue.h:75:9: warning: ‘DirHistoryQueue::_currentPos’ will be initialized after [-Wreorder]
  1009. /home/eithrial/AUR/krusader/src/krusader-2.4.0-beta1/krusader/Panel/dirhistoryqueue.h:74:9: warning:   ‘int DirHistoryQueue::_state’ [-Wreorder]
  1010. /home/eithrial/AUR/krusader/src/krusader-2.4.0-beta1/krusader/Panel/dirhistoryqueue.cpp:29:1: warning:   when initialized here [-Wreorder]
  1011. /home/eithrial/AUR/krusader/src/krusader-2.4.0-beta1/krusader/Panel/dirhistoryqueue.cpp: At global scope:
  1012. /home/eithrial/AUR/krusader/src/krusader-2.4.0-beta1/krusader/Panel/dirhistoryqueue.cpp:111:6: warning: unused parameter ‘url’ [-Wunused-parameter]
  1013. In file included from /home/eithrial/AUR/krusader/src/krusader-2.4.0-beta1/krusader/UserAction/../Panel/krpanel.h:35:0,
  1014.                  from /home/eithrial/AUR/krusader/src/krusader-2.4.0-beta1/krusader/UserAction/../krusaderview.h:51,
  1015.                  from /home/eithrial/AUR/krusader/src/krusader-2.4.0-beta1/krusader/UserAction/kraction.cpp:54:
  1016. /home/eithrial/AUR/krusader/src/krusader-2.4.0-beta1/krusader/UserAction/../Panel/../abstractpanelmanager.h:26:7: warning: ‘class AbstractPanelManager’ has virtual functions and accessible non-virtual destructor [-Wnon-virtual-dtor]
  1017. In file included from /home/eithrial/AUR/krusader/src/krusader-2.4.0-beta1/krusader/UserAction/../krusaderview.h:51:0,
  1018.                  from /home/eithrial/AUR/krusader/src/krusader-2.4.0-beta1/krusader/UserAction/kraction.cpp:54:
  1019. /home/eithrial/AUR/krusader/src/krusader-2.4.0-beta1/krusader/UserAction/../Panel/krpanel.h:43:7: warning: ‘class KrPanel’ has virtual functions and accessible non-virtual destructor [-Wnon-virtual-dtor]
  1020. [ 64%] /home/eithrial/AUR/krusader/src/krusader-2.4.0-beta1/krusader/UserAction/kraction.cpp:302:6: warning: unused parameter ‘exitCode’ [-Wunused-parameter]
  1021. /home/eithrial/AUR/krusader/src/krusader-2.4.0-beta1/krusader/UserAction/kraction.cpp:302:6: warning: unused parameter ‘exitStatus’ [-Wunused-parameter]
  1022. Building CXX object krusader/Panel/CMakeFiles/Panel.dir/krsort.o
  1023. /home/eithrial/AUR/krusader/src/krusader-2.4.0-beta1/krusader/Synchronizer/synchronizer.cpp: In member function ‘void Synchronizer::setScrolling(bool)’:
  1024. /home/eithrial/AUR/krusader/src/krusader-2.4.0-beta1/krusader/Synchronizer/synchronizer.cpp:845:28: warning: suggest parentheses around assignment used as truth value [-Wparentheses]
  1025. /home/eithrial/AUR/krusader/src/krusader-2.4.0-beta1/krusader/Synchronizer/synchronizer.cpp: In member function ‘void Synchronizer::executeTask(SynchronizerFileItem*)’:
  1026. /home/eithrial/AUR/krusader/src/krusader-2.4.0-beta1/krusader/Synchronizer/synchronizer.cpp:991:54: warning: converting ‘false’ to pointer type for argument 1 of ‘QFlags<Enum>::QFlags(QFlags<Enum>::Zero) [with Enum = KIO::JobFlag; QFlags<Enum>::Zero = void**]’ [-Wconversion-null]
  1027. /home/eithrial/AUR/krusader/src/krusader-2.4.0-beta1/krusader/Synchronizer/synchronizer.cpp: In member function ‘void Synchronizer::slotTaskFinished(KJob*)’:
  1028. /home/eithrial/AUR/krusader/src/krusader-2.4.0-beta1/krusader/Synchronizer/synchronizer.cpp:1047:122: warning: ignoring return value of ‘int chown(const char*, __uid_t, __gid_t)’, declared with attribute warn_unused_result [-Wunused-result]
  1029. /home/eithrial/AUR/krusader/src/krusader-2.4.0-beta1/krusader/Synchronizer/synchronizer.cpp:1048:122: warning: ignoring return value of ‘int chown(const char*, __uid_t, __gid_t)’, declared with attribute warn_unused_result [-Wunused-result]
  1030. /home/eithrial/AUR/krusader/src/krusader-2.4.0-beta1/krusader/Synchronizer/synchronizer.cpp:1084:123: warning: ignoring return value of ‘int chown(const char*, __uid_t, __gid_t)’, declared with attribute warn_unused_result [-Wunused-result]
  1031. /home/eithrial/AUR/krusader/src/krusader-2.4.0-beta1/krusader/Synchronizer/synchronizer.cpp:1085:123: warning: ignoring return value of ‘int chown(const char*, __uid_t, __gid_t)’, declared with attribute warn_unused_result [-Wunused-result]
  1032. /home/eithrial/AUR/krusader/src/krusader-2.4.0-beta1/krusader/Panel/krsort.cpp:179:6: warning: unused parameter ‘_viewProperties’ [-Wunused-parameter]
  1033. /home/eithrial/AUR/krusader/src/krusader-2.4.0-beta1/krusader/Panel/krsort.cpp: In function ‘bool KrSort::itemLessThan(KrSort::SortProps*, KrSort::SortProps*)’:
  1034. /home/eithrial/AUR/krusader/src/krusader-2.4.0-beta1/krusader/Panel/krsort.cpp:273:9: warning: variable ‘column’ set but not used [-Wunused-but-set-variable]
  1035. [ 64%] Building CXX object krusader/UserAction/CMakeFiles/UserAction.dir/expander.o
  1036. [ 64%] Building CXX object krusader/Panel/CMakeFiles/Panel.dir/krlayoutfactory.o
  1037. In file included from /home/eithrial/AUR/krusader/src/krusader-2.4.0-beta1/krusader/UserAction/../filemanagerwindow.h:22:0,
  1038.                  from /home/eithrial/AUR/krusader/src/krusader-2.4.0-beta1/krusader/UserAction/../krusader.h:39,
  1039.                  from /home/eithrial/AUR/krusader/src/krusader-2.4.0-beta1/krusader/UserAction/expander.cpp:22:
  1040. /home/eithrial/AUR/krusader/src/krusader-2.4.0-beta1/krusader/UserAction/../krmainwindow.h:29:7: warning: ‘class KrMainWindow’ has virtual functions and accessible non-virtual destructor [-Wnon-virtual-dtor]
  1041. In file included from /home/eithrial/AUR/krusader/src/krusader-2.4.0-beta1/krusader/UserAction/../filemanagerwindow.h:23:0,
  1042.                  from /home/eithrial/AUR/krusader/src/krusader-2.4.0-beta1/krusader/UserAction/../krusader.h:39,
  1043.                  from /home/eithrial/AUR/krusader/src/krusader-2.4.0-beta1/krusader/UserAction/expander.cpp:22:
  1044. /home/eithrial/AUR/krusader/src/krusader-2.4.0-beta1/krusader/UserAction/../abstractpanelmanager.h:26:7: warning: ‘class AbstractPanelManager’ has virtual functions and accessible non-virtual destructor [-Wnon-virtual-dtor]
  1045. In file included from /home/eithrial/AUR/krusader/src/krusader-2.4.0-beta1/krusader/UserAction/../krusader.h:39:0,
  1046.                  from /home/eithrial/AUR/krusader/src/krusader-2.4.0-beta1/krusader/UserAction/expander.cpp:22:
  1047. /home/eithrial/AUR/krusader/src/krusader-2.4.0-beta1/krusader/UserAction/../filemanagerwindow.h:31:7: warning: ‘class FileManagerWindow’ has virtual functions and accessible non-virtual destructor [-Wnon-virtual-dtor]
  1048. [ 64%] Building CXX object krusader/Synchronizer/CMakeFiles/Synchronizer.dir/synchronizergui.o
  1049. In file included from /home/eithrial/AUR/krusader/src/krusader-2.4.0-beta1/krusader/UserAction/../krusaderview.h:51:0,
  1050.                  from /home/eithrial/AUR/krusader/src/krusader-2.4.0-beta1/krusader/UserAction/expander.cpp:23:
  1051. /home/eithrial/AUR/krusader/src/krusader-2.4.0-beta1/krusader/UserAction/../Panel/krpanel.h:43:7: warning: ‘class KrPanel’ has virtual functions and accessible non-virtual destructor [-Wnon-virtual-dtor]
  1052. [ 65%] Building CXX object krusader/Panel/CMakeFiles/Panel.dir/krerrordisplay.o
  1053. /home/eithrial/AUR/krusader/src/krusader-2.4.0-beta1/krusader/UserAction/expander.cpp:110:5: warning: ‘virtual TagString {anonymous}::exp_simpleplaceholder::expFunc(const KrPanel*, const TagStringList&, const bool&, Expander&) const’ was hidden [-Woverloaded-virtual]
  1054. /home/eithrial/AUR/krusader/src/krusader-2.4.0-beta1/krusader/UserAction/expander.cpp:133:1: warning:   by ‘virtual TagString {anonymous}::exp_Path::expFunc(const KrPanel*, const QStringList&, const bool&, Expander&) const’ [-Woverloaded-virtual]
  1055. /home/eithrial/AUR/krusader/src/krusader-2.4.0-beta1/krusader/UserAction/expander.cpp:110:5: warning: ‘virtual TagString {anonymous}::exp_simpleplaceholder::expFunc(const KrPanel*, const TagStringList&, const bool&, Expander&) const’ was hidden [-Woverloaded-virtual]
  1056. /home/eithrial/AUR/krusader/src/krusader-2.4.0-beta1/krusader/UserAction/expander.cpp:138:1: warning:   by ‘virtual TagString {anonymous}::exp_Count::expFunc(const KrPanel*, const QStringList&, const bool&, Expander&) const’ [-Woverloaded-virtual]
  1057. /home/eithrial/AUR/krusader/src/krusader-2.4.0-beta1/krusader/UserAction/expander.cpp:110:5: warning: ‘virtual TagString {anonymous}::exp_simpleplaceholder::expFunc(const KrPanel*, const TagStringList&, const bool&, Expander&) const’ was hidden [-Woverloaded-virtual]
  1058. /home/eithrial/AUR/krusader/src/krusader-2.4.0-beta1/krusader/UserAction/expander.cpp:143:1: warning:   by ‘virtual TagString {anonymous}::exp_Filter::expFunc(const KrPanel*, const QStringList&, const bool&, Expander&) const’ [-Woverloaded-virtual]
  1059. /home/eithrial/AUR/krusader/src/krusader-2.4.0-beta1/krusader/UserAction/expander.cpp:110:5: warning: ‘virtual TagString {anonymous}::exp_simpleplaceholder::expFunc(const KrPanel*, const TagStringList&, const bool&, Expander&) const’ was hidden [-Woverloaded-virtual]
  1060. /home/eithrial/AUR/krusader/src/krusader-2.4.0-beta1/krusader/UserAction/expander.cpp:148:1: warning:   by ‘virtual TagString {anonymous}::exp_Current::expFunc(const KrPanel*, const QStringList&, const bool&, Expander&) const’ [-Woverloaded-virtual]
  1061. /home/eithrial/AUR/krusader/src/krusader-2.4.0-beta1/krusader/UserAction/expander.cpp:110:5: warning: ‘virtual TagString {anonymous}::exp_simpleplaceholder::expFunc(const KrPanel*, const TagStringList&, const bool&, Expander&) const’ was hidden [-Woverloaded-virtual]
  1062. /home/eithrial/AUR/krusader/src/krusader-2.4.0-beta1/krusader/UserAction/expander.cpp:153:1: warning:   by ‘virtual TagString {anonymous}::exp_List::expFunc(const KrPanel*, const QStringList&, const bool&, Expander&) const’ [-Woverloaded-virtual]
  1063. /home/eithrial/AUR/krusader/src/krusader-2.4.0-beta1/krusader/UserAction/expander.cpp:110:5: warning: ‘virtual TagString {anonymous}::exp_simpleplaceholder::expFunc(const KrPanel*, const TagStringList&, const bool&, Expander&) const’ was hidden [-Woverloaded-virtual]
  1064. /home/eithrial/AUR/krusader/src/krusader-2.4.0-beta1/krusader/UserAction/expander.cpp:160:1: warning:   by ‘virtual TagString {anonymous}::exp_ListFile::expFunc(const KrPanel*, const QStringList&, const bool&, Expander&) const’ [-Woverloaded-virtual]
  1065. /home/eithrial/AUR/krusader/src/krusader-2.4.0-beta1/krusader/UserAction/expander.cpp:110:5: warning: ‘virtual TagString {anonymous}::exp_simpleplaceholder::expFunc(const KrPanel*, const TagStringList&, const bool&, Expander&) const’ was hidden [-Woverloaded-virtual]
  1066. /home/eithrial/AUR/krusader/src/krusader-2.4.0-beta1/krusader/UserAction/expander.cpp:166:1: warning:   by ‘virtual TagString {anonymous}::exp_Ask::expFunc(const KrPanel*, const QStringList&, const bool&, Expander&) const’ [-Woverloaded-virtual]
  1067. /home/eithrial/AUR/krusader/src/krusader-2.4.0-beta1/krusader/UserAction/expander.cpp:110:5: warning: ‘virtual TagString {anonymous}::exp_simpleplaceholder::expFunc(const KrPanel*, const TagStringList&, const bool&, Expander&) const’ was hidden [-Woverloaded-virtual]
  1068. /home/eithrial/AUR/krusader/src/krusader-2.4.0-beta1/krusader/UserAction/expander.cpp:176:1: warning:   by ‘virtual TagString {anonymous}::exp_Select::expFunc(const KrPanel*, const QStringList&, const bool&, Expander&) const’ [-Woverloaded-virtual]
  1069. /home/eithrial/AUR/krusader/src/krusader-2.4.0-beta1/krusader/UserAction/expander.cpp:110:5: warning: ‘virtual TagString {anonymous}::exp_simpleplaceholder::expFunc(const KrPanel*, const TagStringList&, const bool&, Expander&) const’ was hidden [-Woverloaded-virtual]
  1070. /home/eithrial/AUR/krusader/src/krusader-2.4.0-beta1/krusader/UserAction/expander.cpp:181:1: warning:   by ‘virtual TagString {anonymous}::exp_Goto::expFunc(const KrPanel*, const QStringList&, const bool&, Expander&) const’ [-Woverloaded-virtual]
  1071. /home/eithrial/AUR/krusader/src/krusader-2.4.0-beta1/krusader/UserAction/expander.cpp:110:5: warning: ‘virtual TagString {anonymous}::exp_simpleplaceholder::expFunc(const KrPanel*, const TagStringList&, const bool&, Expander&) const’ was hidden [-Woverloaded-virtual]
  1072. /home/eithrial/AUR/krusader/src/krusader-2.4.0-beta1/krusader/UserAction/expander.cpp:196:1: warning:   by ‘virtual TagString {anonymous}::exp_Sync::expFunc(const KrPanel*, const QStringList&, const bool&, Expander&) const’ [-Woverloaded-virtual]
  1073. /home/eithrial/AUR/krusader/src/krusader-2.4.0-beta1/krusader/UserAction/expander.cpp:110:5: warning: ‘virtual TagString {anonymous}::exp_simpleplaceholder::expFunc(const KrPanel*, const TagStringList&, const bool&, Expander&) const’ was hidden [-Woverloaded-virtual]
  1074. /home/eithrial/AUR/krusader/src/krusader-2.4.0-beta1/krusader/UserAction/expander.cpp:201:1: warning:   by ‘virtual TagString {anonymous}::exp_NewSearch::expFunc(const KrPanel*, const QStringList&, const bool&, Expander&) const’ [-Woverloaded-virtual]
  1075. /home/eithrial/AUR/krusader/src/krusader-2.4.0-beta1/krusader/UserAction/expander.cpp:110:5: warning: ‘virtual TagString {anonymous}::exp_simpleplaceholder::expFunc(const KrPanel*, const TagStringList&, const bool&, Expander&) const’ was hidden [-Woverloaded-virtual]
  1076. /home/eithrial/AUR/krusader/src/krusader-2.4.0-beta1/krusader/UserAction/expander.cpp:206:1: warning:   by ‘virtual TagString {anonymous}::exp_Profile::expFunc(const KrPanel*, const QStringList&, const bool&, Expander&) const’ [-Woverloaded-virtual]
  1077. /home/eithrial/AUR/krusader/src/krusader-2.4.0-beta1/krusader/UserAction/expander.cpp:110:5: warning: ‘virtual TagString {anonymous}::exp_simpleplaceholder::expFunc(const KrPanel*, const TagStringList&, const bool&, Expander&) const’ was hidden [-Woverloaded-virtual]
  1078. /home/eithrial/AUR/krusader/src/krusader-2.4.0-beta1/krusader/UserAction/expander.cpp:211:1: warning:   by ‘virtual TagString {anonymous}::exp_Each::expFunc(const KrPanel*, const QStringList&, const bool&, Expander&) const’ [-Woverloaded-virtual]
  1079. /home/eithrial/AUR/krusader/src/krusader-2.4.0-beta1/krusader/UserAction/expander.cpp:110:5: warning: ‘virtual TagString {anonymous}::exp_simpleplaceholder::expFunc(const KrPanel*, const TagStringList&, const bool&, Expander&) const’ was hidden [-Woverloaded-virtual]
  1080. /home/eithrial/AUR/krusader/src/krusader-2.4.0-beta1/krusader/UserAction/expander.cpp:216:1: warning:   by ‘virtual TagString {anonymous}::exp_ColSort::expFunc(const KrPanel*, const QStringList&, const bool&, Expander&) const’ [-Woverloaded-virtual]
  1081. /home/eithrial/AUR/krusader/src/krusader-2.4.0-beta1/krusader/UserAction/expander.cpp:110:5: warning: ‘virtual TagString {anonymous}::exp_simpleplaceholder::expFunc(const KrPanel*, const TagStringList&, const bool&, Expander&) const’ was hidden [-Woverloaded-virtual]
  1082. /home/eithrial/AUR/krusader/src/krusader-2.4.0-beta1/krusader/UserAction/expander.cpp:221:1: warning:   by ‘virtual TagString {anonymous}::exp_PanelSize::expFunc(const KrPanel*, const QStringList&, const bool&, Expander&) const’ [-Woverloaded-virtual]
  1083. /home/eithrial/AUR/krusader/src/krusader-2.4.0-beta1/krusader/UserAction/expander.cpp:110:5: warning: ‘virtual TagString {anonymous}::exp_simpleplaceholder::expFunc(const KrPanel*, const TagStringList&, const bool&, Expander&) const’ was hidden [-Woverloaded-virtual]
  1084. /home/eithrial/AUR/krusader/src/krusader-2.4.0-beta1/krusader/UserAction/expander.cpp:234:1: warning:   by ‘virtual TagString {anonymous}::exp_View::expFunc(const KrPanel*, const QStringList&, const bool&, Expander&) const’ [-Woverloaded-virtual]
  1085. In file included from /home/eithrial/AUR/krusader/src/krusader-2.4.0-beta1/krusader/Synchronizer/../Panel/krpanel.h:35:0,
  1086.                  from /home/eithrial/AUR/krusader/src/krusader-2.4.0-beta1/krusader/Synchronizer/../krusaderview.h:51,
  1087.                  from /home/eithrial/AUR/krusader/src/krusader-2.4.0-beta1/krusader/Synchronizer/synchronizergui.cpp:34:
  1088. /home/eithrial/AUR/krusader/src/krusader-2.4.0-beta1/krusader/Synchronizer/../Panel/../abstractpanelmanager.h:26:7: warning: ‘class AbstractPanelManager’ has virtual functions and accessible non-virtual destructor [-Wnon-virtual-dtor]
  1089. In file included from /home/eithrial/AUR/krusader/src/krusader-2.4.0-beta1/krusader/Synchronizer/../krusaderview.h:51:0,
  1090.                  from /home/eithrial/AUR/krusader/src/krusader-2.4.0-beta1/krusader/Synchronizer/synchronizergui.cpp:34:
  1091. /home/eithrial/AUR/krusader/src/krusader-2.4.0-beta1/krusader/Synchronizer/../Panel/krpanel.h:43:7: warning: ‘class KrPanel’ has virtual functions and accessible non-virtual destructor [-Wnon-virtual-dtor]
  1092. In file included from /home/eithrial/AUR/krusader/src/krusader-2.4.0-beta1/krusader/UserAction/expander.h:27:0,
  1093.                  from /home/eithrial/AUR/krusader/src/krusader-2.4.0-beta1/krusader/UserAction/expander.cpp:20:
  1094. /home/eithrial/AUR/krusader/src/krusader-2.4.0-beta1/krusader/UserAction/tstring.h: In instantiation of ‘void TagString_t<T>::insertTag(uint, const T&) [with T = QStringList; uint = unsigned int]’:
  1095. /home/eithrial/AUR/krusader/src/krusader-2.4.0-beta1/krusader/UserAction/expander.cpp:768:23:   required from here
  1096. /home/eithrial/AUR/krusader/src/krusader-2.4.0-beta1/krusader/UserAction/tstring.h:137:5: error: ‘make_pair’ was not declared in this scope, and no declarations were found by argument-dependent lookup at the point of instantiation [-fpermissive]
  1097. In file included from /usr/lib/gcc/x86_64-unknown-linux-gnu/4.7.1/../../../../include/c++/4.7.1/utility:72:0,
  1098.                  from /home/eithrial/AUR/krusader/src/krusader-2.4.0-beta1/krusader/UserAction/tstring.h:22,
  1099.                  from /home/eithrial/AUR/krusader/src/krusader-2.4.0-beta1/krusader/UserAction/expander.h:27,
  1100.                  from /home/eithrial/AUR/krusader/src/krusader-2.4.0-beta1/krusader/UserAction/expander.cpp:20:
  1101. /usr/lib/gcc/x86_64-unknown-linux-gnu/4.7.1/../../../../include/c++/4.7.1/bits/stl_pair.h:284:5: note: ‘template<class _T1, class _T2> std::pair<_T1, _T2> std::make_pair(_T1, _T2)’ declared here, later in the translation unit
  1102. In file included from /home/eithrial/AUR/krusader/src/krusader-2.4.0-beta1/krusader/UserAction/expander.h:27:0,
  1103.                  from /home/eithrial/AUR/krusader/src/krusader-2.4.0-beta1/krusader/UserAction/expander.cpp:20:
  1104. /home/eithrial/AUR/krusader/src/krusader-2.4.0-beta1/krusader/UserAction/tstring.h: In instantiation of ‘TagString_t<T>& TagString_t<T>::operator+=(const TagString_t<T>&) [with T = QStringList; TagString_t<T> = TagString_t<QStringList>]’:
  1105. /home/eithrial/AUR/krusader/src/krusader-2.4.0-beta1/krusader/UserAction/expander.cpp:1045:54:   required from here
  1106. /home/eithrial/AUR/krusader/src/krusader-2.4.0-beta1/krusader/UserAction/tstring.h:128:9: error: ‘make_pair’ was not declared in this scope, and no declarations were found by argument-dependent lookup at the point of instantiation [-fpermissive]
  1107. In file included from /usr/lib/gcc/x86_64-unknown-linux-gnu/4.7.1/../../../../include/c++/4.7.1/utility:72:0,
  1108.                  from /home/eithrial/AUR/krusader/src/krusader-2.4.0-beta1/krusader/UserAction/tstring.h:22,
  1109.                  from /home/eithrial/AUR/krusader/src/krusader-2.4.0-beta1/krusader/UserAction/expander.h:27,
  1110.                  from /home/eithrial/AUR/krusader/src/krusader-2.4.0-beta1/krusader/UserAction/expander.cpp:20:
  1111. /usr/lib/gcc/x86_64-unknown-linux-gnu/4.7.1/../../../../include/c++/4.7.1/bits/stl_pair.h:284:5: note: ‘template<class _T1, class _T2> std::pair<_T1, _T2> std::make_pair(_T1, _T2)’ declared here, later in the translation unit
  1112. [ 65%] Building CXX object krusader/Panel/CMakeFiles/Panel.dir/krpreviews.o
  1113. make[2]: *** [krusader/UserAction/CMakeFiles/UserAction.dir/expander.o] Error 1
  1114. make[1]: *** [krusader/UserAction/CMakeFiles/UserAction.dir/all] Error 2
  1115. make[1]: *** Waiting for unfinished jobs....
  1116. [ 66%] Building CXX object krusader/Synchronizer/CMakeFiles/Synchronizer.dir/feedtolistboxdialog.o
  1117. In file included from /home/eithrial/AUR/krusader/src/krusader-2.4.0-beta1/krusader/Panel/krpreviews.cpp:31:0:
  1118. /home/eithrial/AUR/krusader/src/krusader-2.4.0-beta1/krusader/Panel/krpreviews.h: In constructor ‘KrPreviews::KrPreviews(KrView*)’:
  1119. /home/eithrial/AUR/krusader/src/krusader-2.4.0-beta1/krusader/Panel/krpreviews.h:76:13: warning: ‘KrPreviews::_view’ will be initialized after [-Wreorder]
  1120. /home/eithrial/AUR/krusader/src/krusader-2.4.0-beta1/krusader/Panel/krpreviews.h:70:19: warning:   ‘KrPreviewJob* KrPreviews::_job’ [-Wreorder]
  1121. /home/eithrial/AUR/krusader/src/krusader-2.4.0-beta1/krusader/Panel/krpreviews.cpp:45:1: warning:   when initialized here [-Wreorder]
  1122. [ 67%] Building CXX object krusader/Panel/CMakeFiles/Panel.dir/krpreviewjob.o
  1123. In file included from /home/eithrial/AUR/krusader/src/krusader-2.4.0-beta1/krusader/Synchronizer/../Panel/krpanel.h:35:0,
  1124.                  from /home/eithrial/AUR/krusader/src/krusader-2.4.0-beta1/krusader/Synchronizer/../krusaderview.h:51,
  1125.                  from /home/eithrial/AUR/krusader/src/krusader-2.4.0-beta1/krusader/Synchronizer/feedtolistboxdialog.cpp:37:
  1126. /home/eithrial/AUR/krusader/src/krusader-2.4.0-beta1/krusader/Synchronizer/../Panel/../abstractpanelmanager.h:26:7: warning: ‘class AbstractPanelManager’ has virtual functions and accessible non-virtual destructor [-Wnon-virtual-dtor]
  1127. In file included from /home/eithrial/AUR/krusader/src/krusader-2.4.0-beta1/krusader/Synchronizer/../krusaderview.h:51:0,
  1128.                  from /home/eithrial/AUR/krusader/src/krusader-2.4.0-beta1/krusader/Synchronizer/feedtolistboxdialog.cpp:37:
  1129. /home/eithrial/AUR/krusader/src/krusader-2.4.0-beta1/krusader/Synchronizer/../Panel/krpanel.h:43:7: warning: ‘class KrPanel’ has virtual functions and accessible non-virtual destructor [-Wnon-virtual-dtor]
  1130. /home/eithrial/AUR/krusader/src/krusader-2.4.0-beta1/krusader/Panel/krpreviewjob.cpp: In member function ‘void KrPreviewJob::slotStartJob()’:
  1131. /home/eithrial/AUR/krusader/src/krusader-2.4.0-beta1/krusader/Panel/krpreviewjob.cpp:121:72: warning: ‘KIO::PreviewJob::PreviewJob(const KFileItemList&, int, int, int, int, bool, bool, const QStringList*)’ is deprecated (declared at /usr/include/kio/previewjob.h:86) [-Wdeprecated-declarations]
  1132. [ 67%] Building CXX object krusader/Synchronizer/CMakeFiles/Synchronizer.dir/synchronizertask.o
  1133. [ 67%] Building CXX object krusader/Panel/CMakeFiles/Panel.dir/krcolorcache.o
  1134. [ 68%] Building CXX object krusader/Synchronizer/CMakeFiles/Synchronizer.dir/synchronizerdirlist.o
  1135. /home/eithrial/AUR/krusader/src/krusader-2.4.0-beta1/krusader/Panel/krcolorcache.cpp: In member function ‘bool KrColorCache::getDimSettings(QColor&, int&)’:
  1136. /home/eithrial/AUR/krusader/src/krusader-2.4.0-beta1/krusader/Panel/krcolorcache.cpp:718:13: warning: unused variable ‘dimBackground’ [-Wunused-variable]
  1137. [ 69%] Building CXX object krusader/Panel/CMakeFiles/Panel.dir/krcalcspacedialog.o
  1138. In file included from /home/eithrial/AUR/krusader/src/krusader-2.4.0-beta1/krusader/Panel/krpanel.h:35:0,
  1139.                  from /home/eithrial/AUR/krusader/src/krusader-2.4.0-beta1/krusader/Panel/krcalcspacedialog.cpp:43:
  1140. /home/eithrial/AUR/krusader/src/krusader-2.4.0-beta1/krusader/Panel/../abstractpanelmanager.h:26:7: warning: ‘class AbstractPanelManager’ has virtual functions and accessible non-virtual destructor [-Wnon-virtual-dtor]
  1141. In file included from /home/eithrial/AUR/krusader/src/krusader-2.4.0-beta1/krusader/Panel/krcalcspacedialog.cpp:43:0:
  1142. /home/eithrial/AUR/krusader/src/krusader-2.4.0-beta1/krusader/Panel/krpanel.h:43:7: warning: ‘class KrPanel’ has virtual functions and accessible non-virtual destructor [-Wnon-virtual-dtor]
  1143. Linking CXX static library ../../lib/libSynchronizer.a
  1144. [ 69%] Built target Synchronizer
  1145. [ 69%] Building CXX object krusader/Panel/CMakeFiles/Panel.dir/krpopupmenu.o
  1146. [ 70%] Building CXX object krusader/Panel/CMakeFiles/Panel.dir/krpreviewpopup.o
  1147. [ 70%] Building CXX object krusader/Panel/CMakeFiles/Panel.dir/krview.o
  1148. In file included from /home/eithrial/AUR/krusader/src/krusader-2.4.0-beta1/krusader/Panel/krpanel.h:35:0,
  1149.                  from /home/eithrial/AUR/krusader/src/krusader-2.4.0-beta1/krusader/Panel/listpanel.h:58,
  1150.                  from /home/eithrial/AUR/krusader/src/krusader-2.4.0-beta1/krusader/Panel/krpopupmenu.cpp:33:
  1151. /home/eithrial/AUR/krusader/src/krusader-2.4.0-beta1/krusader/Panel/../abstractpanelmanager.h:26:7: warning: ‘class AbstractPanelManager’ has virtual functions and accessible non-virtual destructor [-Wnon-virtual-dtor]
  1152. In file included from /home/eithrial/AUR/krusader/src/krusader-2.4.0-beta1/krusader/Panel/listpanel.h:58:0,
  1153.                  from /home/eithrial/AUR/krusader/src/krusader-2.4.0-beta1/krusader/Panel/krpopupmenu.cpp:33:
  1154. /home/eithrial/AUR/krusader/src/krusader-2.4.0-beta1/krusader/Panel/krpanel.h:43:7: warning: ‘class KrPanel’ has virtual functions and accessible non-virtual destructor [-Wnon-virtual-dtor]
  1155. In file included from /home/eithrial/AUR/krusader/src/krusader-2.4.0-beta1/krusader/Panel/../filemanagerwindow.h:22:0,
  1156.                  from /home/eithrial/AUR/krusader/src/krusader-2.4.0-beta1/krusader/Panel/../krusader.h:39,
  1157.                  from /home/eithrial/AUR/krusader/src/krusader-2.4.0-beta1/krusader/Panel/krpopupmenu.cpp:41:
  1158. /home/eithrial/AUR/krusader/src/krusader-2.4.0-beta1/krusader/Panel/../krmainwindow.h:29:7: warning: ‘class KrMainWindow’ has virtual functions and accessible non-virtual destructor [-Wnon-virtual-dtor]
  1159. In file included from /home/eithrial/AUR/krusader/src/krusader-2.4.0-beta1/krusader/Panel/../krusader.h:39:0,
  1160.                  from /home/eithrial/AUR/krusader/src/krusader-2.4.0-beta1/krusader/Panel/krpopupmenu.cpp:41:
  1161. /home/eithrial/AUR/krusader/src/krusader-2.4.0-beta1/krusader/Panel/../filemanagerwindow.h:31:7: warning: ‘class FileManagerWindow’ has virtual functions and accessible non-virtual destructor [-Wnon-virtual-dtor]
  1162. In file included from /home/eithrial/AUR/krusader/src/krusader-2.4.0-beta1/krusader/Panel/krview.cpp:34:0:
  1163. /home/eithrial/AUR/krusader/src/krusader-2.4.0-beta1/krusader/Panel/krviewfactory.h:42:7: warning: ‘class KrViewInstance’ has virtual functions and accessible non-virtual destructor [-Wnon-virtual-dtor]
  1164. /home/eithrial/AUR/krusader/src/krusader-2.4.0-beta1/krusader/Panel/krpopupmenu.cpp: In constructor ‘KrPopupMenu::KrPopupMenu(KrPanel*, QWidget*)’:
  1165. /home/eithrial/AUR/krusader/src/krusader-2.4.0-beta1/krusader/Panel/krpopupmenu.cpp:164:25: warning: ‘void KonqPopupMenuInformation::setItems(const KFileItemList&)’ is deprecated (declared at /usr/include/konq_popupmenuinformation.h:67) [-Wdeprecated-declarations]
  1166. /home/eithrial/AUR/krusader/src/krusader-2.4.0-beta1/krusader/Panel/krpopupmenu.cpp:169:43: warning: ‘void KonqMenuActions::setPopupMenuInfo(const KonqPopupMenuInformation&)’ is deprecated (declared at /usr/include/konq_menuactions.h:62) [-Wdeprecated-declarations]
  1167. In file included from /home/eithrial/AUR/krusader/src/krusader-2.4.0-beta1/krusader/Panel/krview.cpp:31:0:
  1168. /home/eithrial/AUR/krusader/src/krusader-2.4.0-beta1/krusader/Panel/krview.h: In constructor ‘KrView::KrView(KrViewInstance&, KConfig*)’:
  1169. /home/eithrial/AUR/krusader/src/krusader-2.4.0-beta1/krusader/Panel/krview.h:539:18: warning: ‘KrView::_numDirs’ will be initialized after [-Wreorder]
  1170. /home/eithrial/AUR/krusader/src/krusader-2.4.0-beta1/krusader/Panel/krview.h:530:23: warning:   ‘KrViewProperties* KrView::_properties’ [-Wreorder]
  1171. /home/eithrial/AUR/krusader/src/krusader-2.4.0-beta1/krusader/Panel/krview.cpp:321:1: warning:   when initialized here [-Wreorder]
  1172. /home/eithrial/AUR/krusader/src/krusader-2.4.0-beta1/krusader/Panel/krpreviewpopup.cpp: In member function ‘void KrPreviewPopup::setUrls(const KUrl::List*)’:
  1173. /home/eithrial/AUR/krusader/src/krusader-2.4.0-beta1/krusader/Panel/krpreviewpopup.cpp:116:95: warning: ‘KIO::PreviewJob::PreviewJob(const KFileItemList&, int, int, int, int, bool, bool, const QStringList*)’ is deprecated (declared at /usr/include/kio/previewjob.h:86) [-Wdeprecated-declarations]
  1174. [ 70%] Building CXX object krusader/Panel/CMakeFiles/Panel.dir/krviewitem.o
  1175. [ 71%] Building CXX object krusader/Panel/CMakeFiles/Panel.dir/panelfunc.o
  1176. /home/eithrial/AUR/krusader/src/krusader-2.4.0-beta1/krusader/Panel/krviewitem.cpp:31:12: warning: ‘int compareNumbers(QString&, int&, QString&, int&)’ declared ‘static’ but never defined [-Wunused-function]
  1177. [ 71%] Building CXX object krusader/Panel/CMakeFiles/Panel.dir/krpanel.o
  1178. [ 72%] Building CXX object krusader/Panel/CMakeFiles/Panel.dir/listpanel.o
  1179. In file included from /home/eithrial/AUR/krusader/src/krusader-2.4.0-beta1/krusader/Panel/krpanel.h:35:0,
  1180.                  from /home/eithrial/AUR/krusader/src/krusader-2.4.0-beta1/krusader/Panel/krpanel.cpp:32:
  1181. /home/eithrial/AUR/krusader/src/krusader-2.4.0-beta1/krusader/Panel/../abstractpanelmanager.h:26:7: warning: ‘class AbstractPanelManager’ has virtual functions and accessible non-virtual destructor [-Wnon-virtual-dtor]
  1182. In file included from /home/eithrial/AUR/krusader/src/krusader-2.4.0-beta1/krusader/Panel/krpanel.cpp:32:0:
  1183. /home/eithrial/AUR/krusader/src/krusader-2.4.0-beta1/krusader/Panel/krpanel.h:43:7: warning: ‘class KrPanel’ has virtual functions and accessible non-virtual destructor [-Wnon-virtual-dtor]
  1184. In file included from /home/eithrial/AUR/krusader/src/krusader-2.4.0-beta1/krusader/Panel/krpanel.h:35:0,
  1185.                  from /home/eithrial/AUR/krusader/src/krusader-2.4.0-beta1/krusader/Panel/listpanel.h:58,
  1186.                  from /home/eithrial/AUR/krusader/src/krusader-2.4.0-beta1/krusader/Panel/panelfunc.cpp:68:
  1187. /home/eithrial/AUR/krusader/src/krusader-2.4.0-beta1/krusader/Panel/../abstractpanelmanager.h:26:7: warning: ‘class AbstractPanelManager’ has virtual functions and accessible non-virtual destructor [-Wnon-virtual-dtor]
  1188. In file included from /home/eithrial/AUR/krusader/src/krusader-2.4.0-beta1/krusader/Panel/listpanel.h:58:0,
  1189.                  from /home/eithrial/AUR/krusader/src/krusader-2.4.0-beta1/krusader/Panel/panelfunc.cpp:68:
  1190. /home/eithrial/AUR/krusader/src/krusader-2.4.0-beta1/krusader/Panel/krpanel.h:43:7: warning: ‘class KrPanel’ has virtual functions and accessible non-virtual destructor [-Wnon-virtual-dtor]
  1191. In file included from /home/eithrial/AUR/krusader/src/krusader-2.4.0-beta1/krusader/Panel/../VFS/krquery.h:37:0,
  1192.                  from /home/eithrial/AUR/krusader/src/krusader-2.4.0-beta1/krusader/Panel/krview.h:43,
  1193.                  from /home/eithrial/AUR/krusader/src/krusader-2.4.0-beta1/krusader/Panel/krviewitem.h:26,
  1194.                  from /home/eithrial/AUR/krusader/src/krusader-2.4.0-beta1/krusader/Panel/panelfunc.h:36,
  1195.                  from /home/eithrial/AUR/krusader/src/krusader-2.4.0-beta1/krusader/Panel/panelfunc.cpp:31:
  1196. /usr/include/kio/jobclasses.h:103:14: warning: ‘virtual void KIO::Job::start()’ was hidden [-Woverloaded-virtual]
  1197. In file included from /home/eithrial/AUR/krusader/src/krusader-2.4.0-beta1/krusader/Panel/../VFS/packjob.h:36:0,
  1198.                  from /home/eithrial/AUR/krusader/src/krusader-2.4.0-beta1/krusader/Panel/panelfunc.cpp:88:
  1199. /home/eithrial/AUR/krusader/src/krusader-2.4.0-beta1/krusader/Panel/../VFS/abstractthreadedjob.h:68:18: warning:   by ‘virtual void AbstractThreadedJob::start(AbstractJobThread*)’ [-Woverloaded-virtual]
  1200. [ 72%] Building CXX object krusader/Panel/CMakeFiles/Panel.dir/listpanelframe.o
  1201. In file included from /home/eithrial/AUR/krusader/src/krusader-2.4.0-beta1/krusader/Panel/krpanel.h:35:0,
  1202.                  from /home/eithrial/AUR/krusader/src/krusader-2.4.0-beta1/krusader/Panel/listpanel.h:58,
  1203.                  from /home/eithrial/AUR/krusader/src/krusader-2.4.0-beta1/krusader/Panel/listpanel.cpp:31:
  1204. /home/eithrial/AUR/krusader/src/krusader-2.4.0-beta1/krusader/Panel/../abstractpanelmanager.h:26:7: warning: ‘class AbstractPanelManager’ has virtual functions and accessible non-virtual destructor [-Wnon-virtual-dtor]
  1205. In file included from /home/eithrial/AUR/krusader/src/krusader-2.4.0-beta1/krusader/Panel/listpanel.h:58:0,
  1206.                  from /home/eithrial/AUR/krusader/src/krusader-2.4.0-beta1/krusader/Panel/listpanel.cpp:31:
  1207. /home/eithrial/AUR/krusader/src/krusader-2.4.0-beta1/krusader/Panel/krpanel.h:43:7: warning: ‘class KrPanel’ has virtual functions and accessible non-virtual destructor [-Wnon-virtual-dtor]
  1208. In file included from /home/eithrial/AUR/krusader/src/krusader-2.4.0-beta1/krusader/Panel/../filemanagerwindow.h:22:0,
  1209.                  from /home/eithrial/AUR/krusader/src/krusader-2.4.0-beta1/krusader/Panel/../krusader.h:39,
  1210.                  from /home/eithrial/AUR/krusader/src/krusader-2.4.0-beta1/krusader/Panel/listpanel.cpp:76:
  1211. /home/eithrial/AUR/krusader/src/krusader-2.4.0-beta1/krusader/Panel/../krmainwindow.h:29:7: warning: ‘class KrMainWindow’ has virtual functions and accessible non-virtual destructor [-Wnon-virtual-dtor]
  1212. In file included from /home/eithrial/AUR/krusader/src/krusader-2.4.0-beta1/krusader/Panel/../krusader.h:39:0,
  1213.                  from /home/eithrial/AUR/krusader/src/krusader-2.4.0-beta1/krusader/Panel/listpanel.cpp:76:
  1214. /home/eithrial/AUR/krusader/src/krusader-2.4.0-beta1/krusader/Panel/../filemanagerwindow.h:31:7: warning: ‘class FileManagerWindow’ has virtual functions and accessible non-virtual destructor [-Wnon-virtual-dtor]
  1215. In file included from /home/eithrial/AUR/krusader/src/krusader-2.4.0-beta1/krusader/Panel/panelpopup.h:29:0,
  1216.                  from /home/eithrial/AUR/krusader/src/krusader-2.4.0-beta1/krusader/Panel/listpanel.cpp:99:
  1217. /usr/include/QtGui/qtreeview.h:218:10: warning: ‘virtual void QTreeView::currentChanged(const QModelIndex&, const QModelIndex&)’ was hidden [-Woverloaded-virtual]
  1218. In file included from /home/eithrial/AUR/krusader/src/krusader-2.4.0-beta1/krusader/Panel/listpanel.cpp:99:0:
  1219. /home/eithrial/AUR/krusader/src/krusader-2.4.0-beta1/krusader/Panel/panelpopup.h:128:10: warning:   by ‘void KrFileTreeView::currentChanged(const KUrl&)’ [-Woverloaded-virtual]
  1220. In file included from /home/eithrial/AUR/krusader/src/krusader-2.4.0-beta1/krusader/Panel/listpanel.cpp:102:0:
  1221. /home/eithrial/AUR/krusader/src/krusader-2.4.0-beta1/krusader/Panel/krviewfactory.h:42:7: warning: ‘class KrViewInstance’ has virtual functions and accessible non-virtual destructor [-Wnon-virtual-dtor]
  1222. /home/eithrial/AUR/krusader/src/krusader-2.4.0-beta1/krusader/Panel/listpanel.cpp: In constructor ‘ListPanel::ListPanel(QWidget*, AbstractPanelManager*, KConfigGroup)’:
  1223. /home/eithrial/AUR/krusader/src/krusader-2.4.0-beta1/krusader/Panel/listpanel.cpp:141:50: warning: base ‘KrPanel’ will be initialized after [-Wreorder]
  1224. /home/eithrial/AUR/krusader/src/krusader-2.4.0-beta1/krusader/Panel/listpanel.cpp:141:50: warning:   base ‘QWidget’ [-Wreorder]
  1225. /home/eithrial/AUR/krusader/src/krusader-2.4.0-beta1/krusader/Panel/listpanel.cpp:137:1: warning:   when initialized here [-Wreorder]
  1226. In file included from /home/eithrial/AUR/krusader/src/krusader-2.4.0-beta1/krusader/Panel/listpanel.cpp:31:0:
  1227. /home/eithrial/AUR/krusader/src/krusader-2.4.0-beta1/krusader/Panel/listpanel.h:223:17: warning: ‘ListPanel::popup’ will be initialized after [-Wreorder]
  1228. /home/eithrial/AUR/krusader/src/krusader-2.4.0-beta1/krusader/Panel/listpanel.h:208:15: warning:   ‘KIO::Job* ListPanel::inlineRefreshJob’ [-Wreorder]
  1229. /home/eithrial/AUR/krusader/src/krusader-2.4.0-beta1/krusader/Panel/listpanel.cpp:137:1: warning:   when initialized here [-Wreorder]
  1230. In file included from /home/eithrial/AUR/krusader/src/krusader-2.4.0-beta1/krusader/Panel/listpanel.cpp:31:0:
  1231. /home/eithrial/AUR/krusader/src/krusader-2.4.0-beta1/krusader/Panel/listpanel.h:235:10: warning: ‘ListPanel::_locked’ will be initialized after [-Wreorder]
  1232. /home/eithrial/AUR/krusader/src/krusader-2.4.0-beta1/krusader/Panel/listpanel.h:207:11: warning:   ‘KJob* ListPanel::previewJob’ [-Wreorder]
  1233. /home/eithrial/AUR/krusader/src/krusader-2.4.0-beta1/krusader/Panel/listpanel.cpp:137:1: warning:   when initialized here [-Wreorder]
  1234. [ 73%] /home/eithrial/AUR/krusader/src/krusader-2.4.0-beta1/krusader/Panel/listpanel.cpp: In member function ‘void ListPanel::handleDropOnView(QDropEvent*, QWidget*)’:
  1235. /home/eithrial/AUR/krusader/src/krusader-2.4.0-beta1/krusader/Panel/listpanel.cpp:804:10: warning: variable ‘dragFromOtherPanel’ set but not used [-Wunused-but-set-variable]
  1236. /home/eithrial/AUR/krusader/src/krusader-2.4.0-beta1/krusader/Panel/listpanel.cpp: At global scope:
  1237. /home/eithrial/AUR/krusader/src/krusader-2.4.0-beta1/krusader/Panel/listpanel.cpp:917:6: warning: unused parameter ‘job’ [-Wunused-parameter]
  1238. Building CXX object krusader/Panel/CMakeFiles/Panel.dir/panelpopup.o
  1239. /home/eithrial/AUR/krusader/src/krusader-2.4.0-beta1/krusader/Panel/listpanel.cpp:1085:6: warning: unused parameter ‘job’ [-Wunused-parameter]
  1240. /home/eithrial/AUR/krusader/src/krusader-2.4.0-beta1/krusader/Panel/listpanel.cpp:1090:6: warning: unused parameter ‘job’ [-Wunused-parameter]
  1241. In file included from /home/eithrial/AUR/krusader/src/krusader-2.4.0-beta1/krusader/Panel/panelpopup.h:29:0,
  1242.                  from /home/eithrial/AUR/krusader/src/krusader-2.4.0-beta1/krusader/Panel/panelpopup.cpp:20:
  1243. /usr/include/QtGui/qtreeview.h:218:10: warning: ‘virtual void QTreeView::currentChanged(const QModelIndex&, const QModelIndex&)’ was hidden [-Woverloaded-virtual]
  1244. In file included from /home/eithrial/AUR/krusader/src/krusader-2.4.0-beta1/krusader/Panel/panelpopup.cpp:20:0:
  1245. /home/eithrial/AUR/krusader/src/krusader-2.4.0-beta1/krusader/Panel/panelpopup.h:128:10: warning:   by ‘void KrFileTreeView::currentChanged(const KUrl&)’ [-Woverloaded-virtual]
  1246. In file included from /home/eithrial/AUR/krusader/src/krusader-2.4.0-beta1/krusader/Panel/krpanel.h:35:0,
  1247.                  from /home/eithrial/AUR/krusader/src/krusader-2.4.0-beta1/krusader/Panel/panelpopup.cpp:22:
  1248. /home/eithrial/AUR/krusader/src/krusader-2.4.0-beta1/krusader/Panel/../abstractpanelmanager.h:26:7: warning: ‘class AbstractPanelManager’ has virtual functions and accessible non-virtual destructor [-Wnon-virtual-dtor]
  1249. In file included from /home/eithrial/AUR/krusader/src/krusader-2.4.0-beta1/krusader/Panel/panelpopup.cpp:22:0:
  1250. /home/eithrial/AUR/krusader/src/krusader-2.4.0-beta1/krusader/Panel/krpanel.h:43:7: warning: ‘class KrPanel’ has virtual functions and accessible non-virtual destructor [-Wnon-virtual-dtor]
  1251. In file included from /home/eithrial/AUR/krusader/src/krusader-2.4.0-beta1/krusader/Panel/../filemanagerwindow.h:22:0,
  1252.                  from /home/eithrial/AUR/krusader/src/krusader-2.4.0-beta1/krusader/Panel/panelpopup.cpp:28:
  1253. /home/eithrial/AUR/krusader/src/krusader-2.4.0-beta1/krusader/Panel/../krmainwindow.h:29:7: warning: ‘class KrMainWindow’ has virtual functions and accessible non-virtual destructor [-Wnon-virtual-dtor]
  1254. In file included from /home/eithrial/AUR/krusader/src/krusader-2.4.0-beta1/krusader/Panel/panelpopup.cpp:28:0:
  1255. /home/eithrial/AUR/krusader/src/krusader-2.4.0-beta1/krusader/Panel/../filemanagerwindow.h:31:7: warning: ‘class FileManagerWindow’ has virtual functions and accessible non-virtual destructor [-Wnon-virtual-dtor]
  1256. In file included from /home/eithrial/AUR/krusader/src/krusader-2.4.0-beta1/krusader/Panel/../KViewer/../DiskUsage/diskusage.h:50:0,
  1257.                  from /home/eithrial/AUR/krusader/src/krusader-2.4.0-beta1/krusader/Panel/../KViewer/diskusageviewer.h:34,
  1258.                  from /home/eithrial/AUR/krusader/src/krusader-2.4.0-beta1/krusader/Panel/panelpopup.cpp:33:
  1259. /home/eithrial/AUR/krusader/src/krusader-2.4.0-beta1/krusader/Panel/../KViewer/../DiskUsage/filelightParts/fileTree.h:101:21: warning: type qualifiers ignored on function return type [-Wignored-qualifiers]
  1260. /home/eithrial/AUR/krusader/src/krusader-2.4.0-beta1/krusader/Panel/../KViewer/../DiskUsage/filelightParts/fileTree.h:249:51: warning: type qualifiers ignored on function return type [-Wignored-qualifiers]
  1261. /home/eithrial/AUR/krusader/src/krusader-2.4.0-beta1/krusader/Panel/../KViewer/../DiskUsage/filelightParts/fileTree.h:252:51: warning: type qualifiers ignored on function return type [-Wignored-qualifiers]
  1262. /home/eithrial/AUR/krusader/src/krusader-2.4.0-beta1/krusader/Panel/../KViewer/../DiskUsage/filelightParts/fileTree.h:255:51: warning: type qualifiers ignored on function return type [-Wignored-qualifiers]
  1263. /home/eithrial/AUR/krusader/src/krusader-2.4.0-beta1/krusader/Panel/../KViewer/../DiskUsage/filelightParts/fileTree.h:267:51: warning: type qualifiers ignored on function return type [-Wignored-qualifiers]
  1264. /home/eithrial/AUR/krusader/src/krusader-2.4.0-beta1/krusader/Panel/../KViewer/../DiskUsage/filelightParts/fileTree.h:273:51: warning: type qualifiers ignored on function return type [-Wignored-qualifiers]
  1265. /home/eithrial/AUR/krusader/src/krusader-2.4.0-beta1/krusader/Panel/../KViewer/../DiskUsage/filelightParts/fileTree.h:276:51: warning: type qualifiers ignored on function return type [-Wignored-qualifiers]
  1266. /home/eithrial/AUR/krusader/src/krusader-2.4.0-beta1/krusader/Panel/../KViewer/../DiskUsage/filelightParts/fileTree.h:279:51: warning: type qualifiers ignored on function return type [-Wignored-qualifiers]
  1267. /home/eithrial/AUR/krusader/src/krusader-2.4.0-beta1/krusader/Panel/../KViewer/../DiskUsage/filelightParts/fileTree.h:285:51: warning: type qualifiers ignored on function return type [-Wignored-qualifiers]
  1268. /home/eithrial/AUR/krusader/src/krusader-2.4.0-beta1/krusader/Panel/../KViewer/../DiskUsage/filelightParts/fileTree.h:336:51: warning: type qualifiers ignored on function return type [-Wignored-qualifiers]
  1269. [ 73%] Building CXX object krusader/Panel/CMakeFiles/Panel.dir/krselectionmode.o
  1270. /home/eithrial/AUR/krusader/src/krusader-2.4.0-beta1/krusader/Panel/panelpopup.cpp: In member function ‘void KrFileTreeView::dropMimeData(const KUrl::List&, const KUrl&, const QModelIndex&)’:
  1271. /home/eithrial/AUR/krusader/src/krusader-2.4.0-beta1/krusader/Panel/panelpopup.cpp:150:19: warning: variable ‘job’ set but not used [-Wunused-but-set-variable]
  1272. [ 73%] Building CXX object krusader/Panel/CMakeFiles/Panel.dir/krvfsmodel.o
  1273. [ 74%] Building CXX object krusader/Panel/CMakeFiles/Panel.dir/krinterview.o
  1274. In file included from /home/eithrial/AUR/krusader/src/krusader-2.4.0-beta1/krusader/Panel/krvfsmodel.h:26:0,
  1275.                  from /home/eithrial/AUR/krusader/src/krusader-2.4.0-beta1/krusader/Panel/krvfsmodel.cpp:20:
  1276. /home/eithrial/AUR/krusader/src/krusader-2.4.0-beta1/krusader/Panel/krinterview.h:83:22: warning: unused parameter ‘index’ [-Wunused-parameter]
  1277. /home/eithrial/AUR/krusader/src/krusader-2.4.0-beta1/krusader/Panel/krinterview.h:83:22: warning: unused parameter ‘command’ [-Wunused-parameter]
  1278. /home/eithrial/AUR/krusader/src/krusader-2.4.0-beta1/krusader/Panel/krinterview.h:84:22: warning: unused parameter ‘selection’ [-Wunused-parameter]
  1279. /home/eithrial/AUR/krusader/src/krusader-2.4.0-beta1/krusader/Panel/krinterview.h:84:22: warning: unused parameter ‘command’ [-Wunused-parameter]
  1280. In file included from /home/eithrial/AUR/krusader/src/krusader-2.4.0-beta1/krusader/Panel/krvfsmodel.cpp:20:0:
  1281. /home/eithrial/AUR/krusader/src/krusader-2.4.0-beta1/krusader/Panel/krvfsmodel.h:98:22: warning: unused parameter ‘vf’ [-Wunused-parameter]
  1282. In file included from /home/eithrial/AUR/krusader/src/krusader-2.4.0-beta1/krusader/Panel/krpanel.h:35:0,
  1283.                  from /home/eithrial/AUR/krusader/src/krusader-2.4.0-beta1/krusader/Panel/krvfsmodel.cpp:28:
  1284. /home/eithrial/AUR/krusader/src/krusader-2.4.0-beta1/krusader/Panel/../abstractpanelmanager.h:26:7: warning: ‘class AbstractPanelManager’ has virtual functions and accessible non-virtual destructor [-Wnon-virtual-dtor]
  1285. In file included from /home/eithrial/AUR/krusader/src/krusader-2.4.0-beta1/krusader/Panel/krvfsmodel.cpp:28:0:
  1286. /home/eithrial/AUR/krusader/src/krusader-2.4.0-beta1/krusader/Panel/krpanel.h:43:7: warning: ‘class KrPanel’ has virtual functions and accessible non-virtual destructor [-Wnon-virtual-dtor]
  1287. /home/eithrial/AUR/krusader/src/krusader-2.4.0-beta1/krusader/Panel/krvfsmodel.cpp: In member function ‘void KrVfsModel::clear()’:
  1288. /home/eithrial/AUR/krusader/src/krusader-2.4.0-beta1/krusader/Panel/krvfsmodel.cpp:71:5: warning: unused variable ‘mndx’ [-Wunused-variable]
  1289. /home/eithrial/AUR/krusader/src/krusader-2.4.0-beta1/krusader/Panel/krvfsmodel.cpp: At global scope:
  1290. /home/eithrial/AUR/krusader/src/krusader-2.4.0-beta1/krusader/Panel/krvfsmodel.cpp:83:5: warning: unused parameter ‘parent’ [-Wunused-parameter]
  1291. /home/eithrial/AUR/krusader/src/krusader-2.4.0-beta1/krusader/Panel/krvfsmodel.cpp:89:5: warning: unused parameter ‘parent’ [-Wunused-parameter]
  1292. [ 74%] Building CXX object krusader/Panel/CMakeFiles/Panel.dir/krinterbriefview.o
  1293. In file included from /home/eithrial/AUR/krusader/src/krusader-2.4.0-beta1/krusader/Panel/krinterview.cpp:21:0:
  1294. /home/eithrial/AUR/krusader/src/krusader-2.4.0-beta1/krusader/Panel/krinterview.h:83:22: warning: unused parameter ‘index’ [-Wunused-parameter]
  1295. /home/eithrial/AUR/krusader/src/krusader-2.4.0-beta1/krusader/Panel/krinterview.h:83:22: warning: unused parameter ‘command’ [-Wunused-parameter]
  1296. /home/eithrial/AUR/krusader/src/krusader-2.4.0-beta1/krusader/Panel/krinterview.h:84:22: warning: unused parameter ‘selection’ [-Wunused-parameter]
  1297. /home/eithrial/AUR/krusader/src/krusader-2.4.0-beta1/krusader/Panel/krinterview.h:84:22: warning: unused parameter ‘command’ [-Wunused-parameter]
  1298. In file included from /home/eithrial/AUR/krusader/src/krusader-2.4.0-beta1/krusader/Panel/krinterview.cpp:22:0:
  1299. /home/eithrial/AUR/krusader/src/krusader-2.4.0-beta1/krusader/Panel/krvfsmodel.h:98:22: warning: unused parameter ‘vf’ [-Wunused-parameter]
  1300. [ 75%] Building CXX object krusader/Panel/CMakeFiles/Panel.dir/krinterdetailedview.o
  1301. In file included from /home/eithrial/AUR/krusader/src/krusader-2.4.0-beta1/krusader/Panel/kritemview.h:22:0,
  1302.                  from /home/eithrial/AUR/krusader/src/krusader-2.4.0-beta1/krusader/Panel/krinterbriefview.h:26,
  1303.                  from /home/eithrial/AUR/krusader/src/krusader-2.4.0-beta1/krusader/Panel/krinterbriefview.cpp:19:
  1304. /home/eithrial/AUR/krusader/src/krusader-2.4.0-beta1/krusader/Panel/krinterview.h:83:22: warning: unused parameter ‘index’ [-Wunused-parameter]
  1305. /home/eithrial/AUR/krusader/src/krusader-2.4.0-beta1/krusader/Panel/krinterview.h:83:22: warning: unused parameter ‘command’ [-Wunused-parameter]
  1306. /home/eithrial/AUR/krusader/src/krusader-2.4.0-beta1/krusader/Panel/krinterview.h:84:22: warning: unused parameter ‘selection’ [-Wunused-parameter]
  1307. /home/eithrial/AUR/krusader/src/krusader-2.4.0-beta1/krusader/Panel/krinterview.h:84:22: warning: unused parameter ‘command’ [-Wunused-parameter]
  1308. /home/eithrial/AUR/krusader/src/krusader-2.4.0-beta1/krusader/Panel/krinterview.h:48:18: warning: ‘virtual void KrInterView::setSelection(KUrl::List)’ was hidden [-Woverloaded-virtual]
  1309. In file included from /home/eithrial/AUR/krusader/src/krusader-2.4.0-beta1/krusader/Panel/krinterbriefview.h:26:0,
  1310.                  from /home/eithrial/AUR/krusader/src/krusader-2.4.0-beta1/krusader/Panel/krinterbriefview.cpp:19:
  1311. /home/eithrial/AUR/krusader/src/krusader-2.4.0-beta1/krusader/Panel/kritemview.h:35:18: warning:   by ‘virtual void KrItemView::setSelection(const QRect&, QItemSelectionModel::SelectionFlags)’ [-Woverloaded-virtual]
  1312. /home/eithrial/AUR/krusader/src/krusader-2.4.0-beta1/krusader/Panel/kritemview.h:35:18: warning: unused parameter ‘rect’ [-Wunused-parameter]
  1313. /home/eithrial/AUR/krusader/src/krusader-2.4.0-beta1/krusader/Panel/kritemview.h:35:18: warning: unused parameter ‘command’ [-Wunused-parameter]
  1314. In file included from /home/eithrial/AUR/krusader/src/krusader-2.4.0-beta1/krusader/Panel/kritemview.h:22:0,
  1315.                  from /home/eithrial/AUR/krusader/src/krusader-2.4.0-beta1/krusader/Panel/krinterbriefview.h:26,
  1316.                  from /home/eithrial/AUR/krusader/src/krusader-2.4.0-beta1/krusader/Panel/krinterbriefview.cpp:19:
  1317. /home/eithrial/AUR/krusader/src/krusader-2.4.0-beta1/krusader/Panel/krinterview.h:67:18: warning: ‘virtual void KrInterView::showContextMenu()’ was hidden [-Woverloaded-virtual]
  1318. In file included from /home/eithrial/AUR/krusader/src/krusader-2.4.0-beta1/krusader/Panel/krinterbriefview.cpp:19:0:
  1319. /home/eithrial/AUR/krusader/src/krusader-2.4.0-beta1/krusader/Panel/krinterbriefview.h:72:18: warning:   by ‘virtual void KrInterBriefView::showContextMenu(const QPoint&)’ [-Woverloaded-virtual]
  1320. [ 75%] Building CXX object krusader/Panel/CMakeFiles/Panel.dir/krinterviewitemdelegate.o
  1321. In file included from /home/eithrial/AUR/krusader/src/krusader-2.4.0-beta1/krusader/Panel/krinterviewitem.h:26:0,
  1322.                  from /home/eithrial/AUR/krusader/src/krusader-2.4.0-beta1/krusader/Panel/krinterbriefview.cpp:36:
  1323. /home/eithrial/AUR/krusader/src/krusader-2.4.0-beta1/krusader/Panel/krvfsmodel.h:98:22: warning: unused parameter ‘vf’ [-Wunused-parameter]
  1324. In file included from /home/eithrial/AUR/krusader/src/krusader-2.4.0-beta1/krusader/Panel/krinterbriefview.cpp:37:0:
  1325. /home/eithrial/AUR/krusader/src/krusader-2.4.0-beta1/krusader/Panel/krviewfactory.h:42:7: warning: ‘class KrViewInstance’ has virtual functions and accessible non-virtual destructor [-Wnon-virtual-dtor]
  1326. In file included from /home/eithrial/AUR/krusader/src/krusader-2.4.0-beta1/krusader/Panel/krinterdetailedview.h:27:0,
  1327.                  from /home/eithrial/AUR/krusader/src/krusader-2.4.0-beta1/krusader/Panel/krinterdetailedview.cpp:20:
  1328. /home/eithrial/AUR/krusader/src/krusader-2.4.0-beta1/krusader/Panel/krinterview.h:83:22: warning: unused parameter ‘index’ [-Wunused-parameter]
  1329. /home/eithrial/AUR/krusader/src/krusader-2.4.0-beta1/krusader/Panel/krinterview.h:83:22: warning: unused parameter ‘command’ [-Wunused-parameter]
  1330. /home/eithrial/AUR/krusader/src/krusader-2.4.0-beta1/krusader/Panel/krinterview.h:84:22: warning: unused parameter ‘selection’ [-Wunused-parameter]
  1331. /home/eithrial/AUR/krusader/src/krusader-2.4.0-beta1/krusader/Panel/krinterview.h:84:22: warning: unused parameter ‘command’ [-Wunused-parameter]
  1332. /home/eithrial/AUR/krusader/src/krusader-2.4.0-beta1/krusader/Panel/krinterview.h:48:18: warning: ‘virtual void KrInterView::setSelection(KUrl::List)’ was hidden [-Woverloaded-virtual]
  1333. In file included from /home/eithrial/AUR/krusader/src/krusader-2.4.0-beta1/krusader/Panel/krinterdetailedview.cpp:20:0:
  1334. /home/eithrial/AUR/krusader/src/krusader-2.4.0-beta1/krusader/Panel/krinterdetailedview.h:63:18: warning:   by ‘virtual void KrInterDetailedView::setSelection(const QRect&, QItemSelectionModel::SelectionFlags)’ [-Woverloaded-virtual]
  1335. In file included from /home/eithrial/AUR/krusader/src/krusader-2.4.0-beta1/krusader/Panel/krinterdetailedview.h:27:0,
  1336.                  from /home/eithrial/AUR/krusader/src/krusader-2.4.0-beta1/krusader/Panel/krinterdetailedview.cpp:20:
  1337. /home/eithrial/AUR/krusader/src/krusader-2.4.0-beta1/krusader/Panel/krinterview.h:67:18: warning: ‘virtual void KrInterView::showContextMenu()’ was hidden [-Woverloaded-virtual]
  1338. In file included from /home/eithrial/AUR/krusader/src/krusader-2.4.0-beta1/krusader/Panel/krinterdetailedview.cpp:20:0:
  1339. /home/eithrial/AUR/krusader/src/krusader-2.4.0-beta1/krusader/Panel/krinterdetailedview.h:82:18: warning:   by ‘virtual void KrInterDetailedView::showContextMenu(const QPoint&)’ [-Woverloaded-virtual]
  1340. /home/eithrial/AUR/krusader/src/krusader-2.4.0-beta1/krusader/Panel/krinterdetailedview.h:63:18: warning: unused parameter ‘rect’ [-Wunused-parameter]
  1341. /home/eithrial/AUR/krusader/src/krusader-2.4.0-beta1/krusader/Panel/krinterdetailedview.h:63:18: warning: unused parameter ‘command’ [-Wunused-parameter]
  1342. In file included from /home/eithrial/AUR/krusader/src/krusader-2.4.0-beta1/krusader/Panel/krvfsmodel.h:26:0,
  1343.                  from /home/eithrial/AUR/krusader/src/krusader-2.4.0-beta1/krusader/Panel/krinterviewitemdelegate.cpp:20:
  1344. /home/eithrial/AUR/krusader/src/krusader-2.4.0-beta1/krusader/Panel/krinterview.h:83:22: warning: unused parameter ‘index’ [-Wunused-parameter]
  1345. /home/eithrial/AUR/krusader/src/krusader-2.4.0-beta1/krusader/Panel/krinterview.h:83:22: warning: unused parameter ‘command’ [-Wunused-parameter]
  1346. /home/eithrial/AUR/krusader/src/krusader-2.4.0-beta1/krusader/Panel/krinterview.h:84:22: warning: unused parameter ‘selection’ [-Wunused-parameter]
  1347. /home/eithrial/AUR/krusader/src/krusader-2.4.0-beta1/krusader/Panel/krinterview.h:84:22: warning: unused parameter ‘command’ [-Wunused-parameter]
  1348. In file included from /home/eithrial/AUR/krusader/src/krusader-2.4.0-beta1/krusader/Panel/krinterviewitemdelegate.cpp:20:0:
  1349. /home/eithrial/AUR/krusader/src/krusader-2.4.0-beta1/krusader/Panel/krvfsmodel.h:98:22: warning: unused parameter ‘vf’ [-Wunused-parameter]
  1350. [ 76%] Building CXX object krusader/Panel/CMakeFiles/Panel.dir/krviewfactory.o
  1351. In file included from /home/eithrial/AUR/krusader/src/krusader-2.4.0-beta1/krusader/Panel/krinterviewitem.h:26:0,
  1352.                  from /home/eithrial/AUR/krusader/src/krusader-2.4.0-beta1/krusader/Panel/krinterdetailedview.cpp:32:
  1353. /home/eithrial/AUR/krusader/src/krusader-2.4.0-beta1/krusader/Panel/krvfsmodel.h:98:22: warning: unused parameter ‘vf’ [-Wunused-parameter]
  1354. In file included from /home/eithrial/AUR/krusader/src/krusader-2.4.0-beta1/krusader/Panel/krinterdetailedview.cpp:33:0:
  1355. /home/eithrial/AUR/krusader/src/krusader-2.4.0-beta1/krusader/Panel/krviewfactory.h:42:7: warning: ‘class KrViewInstance’ has virtual functions and accessible non-virtual destructor [-Wnon-virtual-dtor]
  1356. [ 76%] Building CXX object krusader/Panel/CMakeFiles/Panel.dir/krmousehandler.o
  1357. /home/eithrial/AUR/krusader/src/krusader-2.4.0-beta1/krusader/Panel/krinterdetailedview.cpp:296:6: warning: unused parameter ‘column’ [-Wunused-parameter]
  1358. /home/eithrial/AUR/krusader/src/krusader-2.4.0-beta1/krusader/Panel/krinterdetailedview.cpp:315:6: warning: unused parameter ‘logicalIndex’ [-Wunused-parameter]
  1359. /home/eithrial/AUR/krusader/src/krusader-2.4.0-beta1/krusader/Panel/krinterdetailedview.cpp:315:6: warning: unused parameter ‘oldVisualIndex’ [-Wunused-parameter]
  1360. /home/eithrial/AUR/krusader/src/krusader-2.4.0-beta1/krusader/Panel/krinterdetailedview.cpp:315:6: warning: unused parameter ‘newVisualIndex’ [-Wunused-parameter]
  1361. In file included from /home/eithrial/AUR/krusader/src/krusader-2.4.0-beta1/krusader/Panel/krviewfactory.cpp:31:0:
  1362. /home/eithrial/AUR/krusader/src/krusader-2.4.0-beta1/krusader/Panel/krviewfactory.h:42:7: warning: ‘class KrViewInstance’ has virtual functions and accessible non-virtual destructor [-Wnon-virtual-dtor]
  1363. /home/eithrial/AUR/krusader/src/krusader-2.4.0-beta1/krusader/Panel/krmousehandler.cpp:328:6: warning: unused parameter ‘e’ [-Wunused-parameter]
  1364. In file included from /home/eithrial/AUR/krusader/src/krusader-2.4.0-beta1/krusader/Panel/krinterdetailedview.h:27:0,
  1365.                  from /home/eithrial/AUR/krusader/src/krusader-2.4.0-beta1/krusader/Panel/krviewfactory.cpp:33:
  1366. /home/eithrial/AUR/krusader/src/krusader-2.4.0-beta1/krusader/Panel/krinterview.h:83:22: warning: unused parameter ‘index’ [-Wunused-parameter]
  1367. /home/eithrial/AUR/krusader/src/krusader-2.4.0-beta1/krusader/Panel/krinterview.h:83:22: warning: unused parameter ‘command’ [-Wunused-parameter]
  1368. /home/eithrial/AUR/krusader/src/krusader-2.4.0-beta1/krusader/Panel/krinterview.h:84:22: warning: unused parameter ‘selection’ [-Wunused-parameter]
  1369. /home/eithrial/AUR/krusader/src/krusader-2.4.0-beta1/krusader/Panel/krinterview.h:84:22: warning: unused parameter ‘command’ [-Wunused-parameter]
  1370. /home/eithrial/AUR/krusader/src/krusader-2.4.0-beta1/krusader/Panel/krinterview.h:48:18: warning: ‘virtual void KrInterView::setSelection(KUrl::List)’ was hidden [-Woverloaded-virtual]
  1371. In file included from /home/eithrial/AUR/krusader/src/krusader-2.4.0-beta1/krusader/Panel/krviewfactory.cpp:33:0:
  1372. /home/eithrial/AUR/krusader/src/krusader-2.4.0-beta1/krusader/Panel/krinterdetailedview.h:63:18: warning:   by ‘virtual void KrInterDetailedView::setSelection(const QRect&, QItemSelectionModel::SelectionFlags)’ [-Woverloaded-virtual]
  1373. In file included from /home/eithrial/AUR/krusader/src/krusader-2.4.0-beta1/krusader/Panel/krinterdetailedview.h:27:0,
  1374.                  from /home/eithrial/AUR/krusader/src/krusader-2.4.0-beta1/krusader/Panel/krviewfactory.cpp:33:
  1375. /home/eithrial/AUR/krusader/src/krusader-2.4.0-beta1/krusader/Panel/krinterview.h:67:18: warning: ‘virtual void KrInterView::showContextMenu()’ was hidden [-Woverloaded-virtual]
  1376. In file included from /home/eithrial/AUR/krusader/src/krusader-2.4.0-beta1/krusader/Panel/krviewfactory.cpp:33:0:
  1377. /home/eithrial/AUR/krusader/src/krusader-2.4.0-beta1/krusader/Panel/krinterdetailedview.h:82:18: warning:   by ‘virtual void KrInterDetailedView::showContextMenu(const QPoint&)’ [-Woverloaded-virtual]
  1378. /home/eithrial/AUR/krusader/src/krusader-2.4.0-beta1/krusader/Panel/krinterdetailedview.h:63:18: warning: unused parameter ‘rect’ [-Wunused-parameter]
  1379. /home/eithrial/AUR/krusader/src/krusader-2.4.0-beta1/krusader/Panel/krinterdetailedview.h:63:18: warning: unused parameter ‘command’ [-Wunused-parameter]
  1380. In file included from /home/eithrial/AUR/krusader/src/krusader-2.4.0-beta1/krusader/Panel/krinterdetailedview.h:27:0,
  1381.                  from /home/eithrial/AUR/krusader/src/krusader-2.4.0-beta1/krusader/Panel/krviewfactory.cpp:33:
  1382. /home/eithrial/AUR/krusader/src/krusader-2.4.0-beta1/krusader/Panel/krinterview.h:48:18: warning: ‘virtual void KrInterView::setSelection(KUrl::List)’ was hidden [-Woverloaded-virtual]
  1383. In file included from /home/eithrial/AUR/krusader/src/krusader-2.4.0-beta1/krusader/Panel/krinterbriefview.h:26:0,
  1384.                  from /home/eithrial/AUR/krusader/src/krusader-2.4.0-beta1/krusader/Panel/krviewfactory.cpp:34:
  1385. /home/eithrial/AUR/krusader/src/krusader-2.4.0-beta1/krusader/Panel/kritemview.h:35:18: warning:   by ‘virtual void KrItemView::setSelection(const QRect&, QItemSelectionModel::SelectionFlags)’ [-Woverloaded-virtual]
  1386. /home/eithrial/AUR/krusader/src/krusader-2.4.0-beta1/krusader/Panel/kritemview.h:35:18: warning: unused parameter ‘rect’ [-Wunused-parameter]
  1387. /home/eithrial/AUR/krusader/src/krusader-2.4.0-beta1/krusader/Panel/kritemview.h:35:18: warning: unused parameter ‘command’ [-Wunused-parameter]
  1388. In file included from /home/eithrial/AUR/krusader/src/krusader-2.4.0-beta1/krusader/Panel/krinterdetailedview.h:27:0,
  1389.                  from /home/eithrial/AUR/krusader/src/krusader-2.4.0-beta1/krusader/Panel/krviewfactory.cpp:33:
  1390. /home/eithrial/AUR/krusader/src/krusader-2.4.0-beta1/krusader/Panel/krinterview.h:67:18: warning: ‘virtual void KrInterView::showContextMenu()’ was hidden [-Woverloaded-virtual]
  1391. In file included from /home/eithrial/AUR/krusader/src/krusader-2.4.0-beta1/krusader/Panel/krviewfactory.cpp:34:0:
  1392. /home/eithrial/AUR/krusader/src/krusader-2.4.0-beta1/krusader/Panel/krinterbriefview.h:72:18: warning:   by ‘virtual void KrInterBriefView::showContextMenu(const QPoint&)’ [-Woverloaded-virtual]
  1393. In file included from /home/eithrial/AUR/krusader/src/krusader-2.4.0-beta1/krusader/Panel/krviewfactory.cpp:31:0:
  1394. /home/eithrial/AUR/krusader/src/krusader-2.4.0-beta1/krusader/Panel/krviewfactory.h: In instantiation of ‘class KrViewInstanceImpl<KrInterDetailedView>’:
  1395. /home/eithrial/AUR/krusader/src/krusader-2.4.0-beta1/krusader/Panel/krviewfactory.cpp:65:85:   required from here
  1396. /home/eithrial/AUR/krusader/src/krusader-2.4.0-beta1/krusader/Panel/krviewfactory.h:78:7: warning: ‘class KrViewInstanceImpl<KrInterDetailedView>’ has virtual functions and accessible non-virtual destructor [-Wnon-virtual-dtor]
  1397. /home/eithrial/AUR/krusader/src/krusader-2.4.0-beta1/krusader/Panel/krviewfactory.h: In instantiation of ‘class KrViewInstanceImpl<KrInterBriefView>’:
  1398. /home/eithrial/AUR/krusader/src/krusader-2.4.0-beta1/krusader/Panel/krviewfactory.cpp:68:80:   required from here
  1399. /home/eithrial/AUR/krusader/src/krusader-2.4.0-beta1/krusader/Panel/krviewfactory.h:78:7: warning: ‘class KrViewInstanceImpl<KrInterBriefView>’ has virtual functions and accessible non-virtual destructor [-Wnon-virtual-dtor]
  1400. Linking CXX static library ../../lib/libPanel.a
  1401. [ 76%] Built target Panel
  1402. make: *** [all] Error 2
  1403. ==> ERROR:(B A failure occurred in build().(B
  1404.     Aborting...(B
RAW Paste Data
Top