SHARE
TWEET

errorlogopencv30beta

a guest Jan 16th, 2015 479 Never
Not a member of Pastebin yet? Sign Up, it unlocks many cool features!
  1. Rafaels-iMac:build rafaelruizmunoz$ cmake "Unix Makefile" -D CMAKE_OSX_ARCHITECTURES=x86_64 -D BUILD_PERF_TESTS=OFF ..
  2. -- The CXX compiler identification is AppleClang 6.0.0.6000054
  3. -- The C compiler identification is AppleClang 6.0.0.6000054
  4. -- Check for working CXX compiler: /usr/bin/c++
  5. -- Check for working CXX compiler: /usr/bin/c++ -- works
  6. -- Detecting CXX compiler ABI info
  7. -- Detecting CXX compiler ABI info - done
  8. -- Check for working C compiler: /usr/bin/cc
  9. -- Check for working C compiler: /usr/bin/cc -- works
  10. -- Detecting C compiler ABI info
  11. -- Detecting C compiler ABI info - done
  12. -- Performing Test HAVE_CXX_FSIGNED_CHAR
  13. -- Performing Test HAVE_CXX_FSIGNED_CHAR - Success
  14. -- Performing Test HAVE_C_FSIGNED_CHAR
  15. -- Performing Test HAVE_C_FSIGNED_CHAR - Success
  16. -- Performing Test HAVE_CXX_W
  17. -- Performing Test HAVE_CXX_W - Success
  18. -- Performing Test HAVE_C_W
  19. -- Performing Test HAVE_C_W - Success
  20. -- Performing Test HAVE_CXX_WALL
  21. -- Performing Test HAVE_CXX_WALL - Failed
  22. -- Performing Test HAVE_C_WALL
  23. -- Performing Test HAVE_C_WALL - Failed
  24. -- Performing Test HAVE_CXX_WERROR_RETURN_TYPE
  25. -- Performing Test HAVE_CXX_WERROR_RETURN_TYPE - Success
  26. -- Performing Test HAVE_C_WERROR_RETURN_TYPE
  27. -- Performing Test HAVE_C_WERROR_RETURN_TYPE - Success
  28. -- Performing Test HAVE_CXX_WERROR_NON_VIRTUAL_DTOR
  29. -- Performing Test HAVE_CXX_WERROR_NON_VIRTUAL_DTOR - Success
  30. -- Performing Test HAVE_C_WERROR_NON_VIRTUAL_DTOR
  31. -- Performing Test HAVE_C_WERROR_NON_VIRTUAL_DTOR - Success
  32. -- Performing Test HAVE_CXX_WERROR_ADDRESS
  33. -- Performing Test HAVE_CXX_WERROR_ADDRESS - Success
  34. -- Performing Test HAVE_C_WERROR_ADDRESS
  35. -- Performing Test HAVE_C_WERROR_ADDRESS - Success
  36. -- Performing Test HAVE_CXX_WERROR_SEQUENCE_POINT
  37. -- Performing Test HAVE_CXX_WERROR_SEQUENCE_POINT - Success
  38. -- Performing Test HAVE_C_WERROR_SEQUENCE_POINT
  39. -- Performing Test HAVE_C_WERROR_SEQUENCE_POINT - Success
  40. -- Performing Test HAVE_CXX_WFORMAT
  41. -- Performing Test HAVE_CXX_WFORMAT - Success
  42. -- Performing Test HAVE_C_WFORMAT
  43. -- Performing Test HAVE_C_WFORMAT - Success
  44. -- Performing Test HAVE_CXX_WERROR_FORMAT_SECURITY
  45. -- Performing Test HAVE_CXX_WERROR_FORMAT_SECURITY - Success
  46. -- Performing Test HAVE_C_WERROR_FORMAT_SECURITY
  47. -- Performing Test HAVE_C_WERROR_FORMAT_SECURITY - Success
  48. -- Performing Test HAVE_CXX_WMISSING_DECLARATIONS
  49. -- Performing Test HAVE_CXX_WMISSING_DECLARATIONS - Success
  50. -- Performing Test HAVE_C_WMISSING_DECLARATIONS
  51. -- Performing Test HAVE_C_WMISSING_DECLARATIONS - Success
  52. -- Performing Test HAVE_CXX_WMISSING_PROTOTYPES
  53. -- Performing Test HAVE_CXX_WMISSING_PROTOTYPES - Success
  54. -- Performing Test HAVE_C_WMISSING_PROTOTYPES
  55. -- Performing Test HAVE_C_WMISSING_PROTOTYPES - Success
  56. -- Performing Test HAVE_CXX_WSTRICT_PROTOTYPES
  57. -- Performing Test HAVE_CXX_WSTRICT_PROTOTYPES - Success
  58. -- Performing Test HAVE_C_WSTRICT_PROTOTYPES
  59. -- Performing Test HAVE_C_WSTRICT_PROTOTYPES - Success
  60. -- Performing Test HAVE_CXX_WUNDEF
  61. -- Performing Test HAVE_CXX_WUNDEF - Success
  62. -- Performing Test HAVE_C_WUNDEF
  63. -- Performing Test HAVE_C_WUNDEF - Success
  64. -- Performing Test HAVE_CXX_WINIT_SELF
  65. -- Performing Test HAVE_CXX_WINIT_SELF - Success
  66. -- Performing Test HAVE_C_WINIT_SELF
  67. -- Performing Test HAVE_C_WINIT_SELF - Success
  68. -- Performing Test HAVE_CXX_WPOINTER_ARITH
  69. -- Performing Test HAVE_CXX_WPOINTER_ARITH - Success
  70. -- Performing Test HAVE_C_WPOINTER_ARITH
  71. -- Performing Test HAVE_C_WPOINTER_ARITH - Success
  72. -- Performing Test HAVE_CXX_WSHADOW
  73. -- Performing Test HAVE_CXX_WSHADOW - Success
  74. -- Performing Test HAVE_C_WSHADOW
  75. -- Performing Test HAVE_C_WSHADOW - Success
  76. -- Performing Test HAVE_CXX_WSIGN_PROMO
  77. -- Performing Test HAVE_CXX_WSIGN_PROMO - Success
  78. -- Performing Test HAVE_C_WSIGN_PROMO
  79. -- Performing Test HAVE_C_WSIGN_PROMO - Success
  80. -- Performing Test HAVE_CXX_WNO_NARROWING
  81. -- Performing Test HAVE_CXX_WNO_NARROWING - Success
  82. -- Performing Test HAVE_C_WNO_NARROWING
  83. -- Performing Test HAVE_C_WNO_NARROWING - Success
  84. -- Performing Test HAVE_CXX_WNO_DELETE_NON_VIRTUAL_DTOR
  85. -- Performing Test HAVE_CXX_WNO_DELETE_NON_VIRTUAL_DTOR - Success
  86. -- Performing Test HAVE_C_WNO_DELETE_NON_VIRTUAL_DTOR
  87. -- Performing Test HAVE_C_WNO_DELETE_NON_VIRTUAL_DTOR - Success
  88. -- Performing Test HAVE_CXX_WNO_UNNAMED_TYPE_TEMPLATE_ARGS
  89. -- Performing Test HAVE_CXX_WNO_UNNAMED_TYPE_TEMPLATE_ARGS - Success
  90. -- Performing Test HAVE_C_WNO_UNNAMED_TYPE_TEMPLATE_ARGS
  91. -- Performing Test HAVE_C_WNO_UNNAMED_TYPE_TEMPLATE_ARGS - Success
  92. -- Performing Test HAVE_CXX_FDIAGNOSTICS_SHOW_OPTION
  93. -- Performing Test HAVE_CXX_FDIAGNOSTICS_SHOW_OPTION - Success
  94. -- Performing Test HAVE_C_FDIAGNOSTICS_SHOW_OPTION
  95. -- Performing Test HAVE_C_FDIAGNOSTICS_SHOW_OPTION - Success
  96. -- Performing Test HAVE_CXX_WNO_LONG_LONG
  97. -- Performing Test HAVE_CXX_WNO_LONG_LONG - Success
  98. -- Performing Test HAVE_C_WNO_LONG_LONG
  99. -- Performing Test HAVE_C_WNO_LONG_LONG - Success
  100. -- Performing Test HAVE_CXX_WNO_SEMICOLON_BEFORE_METHOD_BODY
  101. -- Performing Test HAVE_CXX_WNO_SEMICOLON_BEFORE_METHOD_BODY - Success
  102. -- Performing Test HAVE_C_WNO_SEMICOLON_BEFORE_METHOD_BODY
  103. -- Performing Test HAVE_C_WNO_SEMICOLON_BEFORE_METHOD_BODY - Success
  104. -- Performing Test HAVE_CXX_FNO_OMIT_FRAME_POINTER
  105. -- Performing Test HAVE_CXX_FNO_OMIT_FRAME_POINTER - Success
  106. -- Performing Test HAVE_C_FNO_OMIT_FRAME_POINTER
  107. -- Performing Test HAVE_C_FNO_OMIT_FRAME_POINTER - Success
  108. -- Performing Test HAVE_CXX_MSSE
  109. -- Performing Test HAVE_CXX_MSSE - Success
  110. -- Performing Test HAVE_C_MSSE
  111. -- Performing Test HAVE_C_MSSE - Success
  112. -- Performing Test HAVE_CXX_MSSE2
  113. -- Performing Test HAVE_CXX_MSSE2 - Success
  114. -- Performing Test HAVE_C_MSSE2
  115. -- Performing Test HAVE_C_MSSE2 - Success
  116. -- Performing Test HAVE_CXX_MSSE3
  117. -- Performing Test HAVE_CXX_MSSE3 - Success
  118. -- Performing Test HAVE_C_MSSE3
  119. -- Performing Test HAVE_C_MSSE3 - Success
  120. -- Performing Test HAVE_CXX_FVISIBILITY_HIDDEN
  121. -- Performing Test HAVE_CXX_FVISIBILITY_HIDDEN - Success
  122. -- Performing Test HAVE_C_FVISIBILITY_HIDDEN
  123. -- Performing Test HAVE_C_FVISIBILITY_HIDDEN - Success
  124. -- Performing Test HAVE_CXX_FVISIBILITY_INLINES_HIDDEN
  125. -- Performing Test HAVE_CXX_FVISIBILITY_INLINES_HIDDEN - Success
  126. -- Performing Test HAVE_C_FVISIBILITY_INLINES_HIDDEN
  127. -- Performing Test HAVE_C_FVISIBILITY_INLINES_HIDDEN - Success
  128. -- Check if the system is big endian
  129. -- Searching 16 bit integer
  130. -- Looking for sys/types.h
  131. -- Looking for sys/types.h - found
  132. -- Looking for stdint.h
  133. -- Looking for stdint.h - found
  134. -- Looking for stddef.h
  135. -- Looking for stddef.h - found
  136. -- Check size of unsigned short
  137. -- Check size of unsigned short - done
  138. -- Using unsigned short
  139. -- Check if the system is big endian - little endian
  140. -- Looking for fseeko
  141. -- Looking for fseeko - found
  142. -- Looking for unistd.h
  143. -- Looking for unistd.h - found
  144. -- Check size of off64_t
  145. -- Check size of off64_t - failed
  146. -- Performing Test HAVE_C_WNO_SHORTEN_64_TO_32
  147. -- Performing Test HAVE_C_WNO_SHORTEN_64_TO_32 - Success
  148. -- Performing Test HAVE_C_WNO_ATTRIBUTES
  149. -- Performing Test HAVE_C_WNO_ATTRIBUTES - Success
  150. -- Performing Test HAVE_C_WNO_STRICT_PROTOTYPES
  151. -- Performing Test HAVE_C_WNO_STRICT_PROTOTYPES - Success
  152. -- Performing Test HAVE_C_WNO_MISSING_PROTOTYPES
  153. -- Performing Test HAVE_C_WNO_MISSING_PROTOTYPES - Success
  154. -- Performing Test HAVE_C_WNO_MISSING_DECLARATIONS
  155. -- Performing Test HAVE_C_WNO_MISSING_DECLARATIONS - Success
  156. -- Looking for assert.h
  157. -- Looking for assert.h - found
  158. -- Looking for fcntl.h
  159. -- Looking for fcntl.h - found
  160. -- Looking for io.h
  161. -- Looking for io.h - not found
  162. -- Looking for jbg_newlen
  163. -- Looking for jbg_newlen - not found
  164. -- Looking for mmap
  165. -- Looking for mmap - found
  166. -- Looking for search.h
  167. -- Looking for search.h - found
  168. -- Looking for string.h
  169. -- Looking for string.h - found
  170. -- Looking for unistd.h
  171. -- Looking for unistd.h - found
  172. -- Performing Test HAVE_C_WNO_UNUSED_BUT_SET_VARIABLE
  173. -- Performing Test HAVE_C_WNO_UNUSED_BUT_SET_VARIABLE - Failed
  174. -- Performing Test HAVE_C_WNO_UNDEF
  175. -- Performing Test HAVE_C_WNO_UNDEF - Success
  176. -- Performing Test HAVE_C_WNO_UNUSED
  177. -- Performing Test HAVE_C_WNO_UNUSED - Success
  178. -- Performing Test HAVE_C_WNO_SIGN_COMPARE
  179. -- Performing Test HAVE_C_WNO_SIGN_COMPARE - Success
  180. -- Performing Test HAVE_C_WNO_CAST_ALIGN
  181. -- Performing Test HAVE_C_WNO_CAST_ALIGN - Success
  182. -- Performing Test HAVE_C_WNO_SHADOW
  183. -- Performing Test HAVE_C_WNO_SHADOW - Success
  184. -- Performing Test HAVE_C_WNO_MAYBE_UNINITIALIZED
  185. -- Performing Test HAVE_C_WNO_MAYBE_UNINITIALIZED - Failed
  186. -- Performing Test HAVE_C_WNO_POINTER_TO_INT_CAST
  187. -- Performing Test HAVE_C_WNO_POINTER_TO_INT_CAST - Success
  188. -- Performing Test HAVE_C_WNO_INT_TO_POINTER_CAST
  189. -- Performing Test HAVE_C_WNO_INT_TO_POINTER_CAST - Success
  190. -- Performing Test HAVE_C_WNO_UNUSED_PARAMETER
  191. -- Performing Test HAVE_C_WNO_UNUSED_PARAMETER - Success
  192. -- Performing Test HAVE_CXX_WNO_MISSING_DECLARATIONS
  193. -- Performing Test HAVE_CXX_WNO_MISSING_DECLARATIONS - Success
  194. -- Performing Test HAVE_CXX_WNO_UNUSED_PARAMETER
  195. -- Performing Test HAVE_CXX_WNO_UNUSED_PARAMETER - Success
  196. -- Found WebP: /opt/local/lib/libwebp.dylib  
  197. -- Performing Test HAVE_C_WNO_IMPLICIT_FUNCTION_DECLARATION
  198. -- Performing Test HAVE_C_WNO_IMPLICIT_FUNCTION_DECLARATION - Success
  199. -- Performing Test HAVE_C_WNO_UNINITIALIZED
  200. -- Performing Test HAVE_C_WNO_UNINITIALIZED - Success
  201. -- Performing Test HAVE_C_WNO_UNUSED_BUT_SET_PARAMETER
  202. -- Performing Test HAVE_C_WNO_UNUSED_BUT_SET_PARAMETER - Failed
  203. -- Performing Test HAVE_C_WNO_STRICT_OVERFLOW
  204. -- Performing Test HAVE_C_WNO_STRICT_OVERFLOW - Success
  205. -- Looking for semaphore.h
  206. -- Looking for semaphore.h - found
  207. -- Performing Test HAVE_CXX_WNO_SHADOW
  208. -- Performing Test HAVE_CXX_WNO_SHADOW - Success
  209. -- Performing Test HAVE_CXX_WNO_UNUSED
  210. -- Performing Test HAVE_CXX_WNO_UNUSED - Success
  211. -- Performing Test HAVE_CXX_WNO_SIGN_COMPARE
  212. -- Performing Test HAVE_CXX_WNO_SIGN_COMPARE - Success
  213. -- Performing Test HAVE_CXX_WNO_UNDEF
  214. -- Performing Test HAVE_CXX_WNO_UNDEF - Success
  215. -- Performing Test HAVE_CXX_WNO_UNINITIALIZED
  216. -- Performing Test HAVE_CXX_WNO_UNINITIALIZED - Success
  217. -- Performing Test HAVE_CXX_WNO_SWITCH
  218. -- Performing Test HAVE_CXX_WNO_SWITCH - Success
  219. -- Performing Test HAVE_CXX_WNO_PARENTHESES
  220. -- Performing Test HAVE_CXX_WNO_PARENTHESES - Success
  221. -- Performing Test HAVE_CXX_WNO_ARRAY_BOUNDS
  222. -- Performing Test HAVE_CXX_WNO_ARRAY_BOUNDS - Success
  223. -- Performing Test HAVE_CXX_WNO_EXTRA
  224. -- Performing Test HAVE_CXX_WNO_EXTRA - Success
  225. -- checking for module 'gstreamer-base-0.10'
  226. --   package 'gstreamer-base-0.10' not found
  227. -- checking for module 'gstreamer-video-0.10'
  228. --   package 'gstreamer-video-0.10' not found
  229. -- checking for module 'gstreamer-app-0.10'
  230. --   package 'gstreamer-app-0.10' not found
  231. -- checking for module 'gstreamer-riff-0.10'
  232. --   package 'gstreamer-riff-0.10' not found
  233. -- checking for module 'gstreamer-pbutils-0.10'
  234. --   package 'gstreamer-pbutils-0.10' not found
  235. -- checking for module 'libdc1394-2'
  236. --   package 'libdc1394-2' not found
  237. -- checking for module 'libdc1394'
  238. --   package 'libdc1394' not found
  239. -- checking for module 'libv4l1'
  240. --   package 'libv4l1' not found
  241. -- Looking for linux/videodev.h
  242. -- Looking for linux/videodev.h - not found
  243. -- Looking for linux/videodev2.h
  244. -- Looking for linux/videodev2.h - not found
  245. -- Looking for sys/videoio.h
  246. -- Looking for sys/videoio.h - not found
  247. -- checking for module 'libavcodec'
  248. --   found libavcodec, version 55.69.100
  249. -- checking for module 'libavformat'
  250. --   found libavformat, version 55.48.100
  251. -- checking for module 'libavutil'
  252. --   found libavutil, version 52.92.100
  253. -- checking for module 'libswscale'
  254. --   found libswscale, version 2.6.100
  255. -- Looking for libavformat/avformat.h
  256. -- Looking for libavformat/avformat.h - not found
  257. -- Looking for ffmpeg/avformat.h
  258. -- Looking for ffmpeg/avformat.h - not found
  259. -- ICV: Downloading ippicv_macosx_20141027.tgz...
  260. -- ICV: Unpacking ippicv_macosx_20141027.tgz to /Users/rafaelruizmunoz/Downloads/opencv/3rdparty/ippicv/unpack...
  261. -- ICV: Package successfully downloaded
  262. -- found IPP (ICV version): 8.2.1 [8.2.1]
  263. -- at: /Users/rafaelruizmunoz/Downloads/opencv/3rdparty/ippicv/unpack/ippicv_osx
  264. -- Could NOT find Doxygen (missing:  DOXYGEN_EXECUTABLE)
  265. -- To enable PlantUML support, set PLANTUML_JAR environment variable or pass -DPLANTUML_JAR=<filepath> option to cmake
  266. -- Found PythonInterp: /opt/local/bin/python2.7 (found suitable version "2.7.8", minimum required is "2.7")
  267. -- Could NOT find PythonLibs: Found unsuitable version "2.7.5", but required is exact version "2.7.8" (found /usr/lib/libpython2.7.dylib)
  268. -- Could NOT find PythonInterp: Found unsuitable version "2.7.8", but required is at least "3.4" (found /opt/local/bin/python)
  269. -- Could NOT find PythonInterp: Found unsuitable version "2.7.8", but required is at least "3.2" (found /opt/local/bin/python)
  270. -- Found JNI: /Applications/Xcode.app/Contents/Developer/Platforms/MacOSX.platform/Developer/SDKs/MacOSX10.9.sdk/System/Library/Frameworks/JavaVM.framework  
  271. -- Found Matlab: /Applications/MATLAB_R2014a.app/bin/mex  
  272. -- Found VTK ver. 6.1.0 (usefile: /usr/local/lib/cmake/vtk-6.1/UseVTK.cmake)
  273. -- Assume that non-module dependency is available: -framework OpenCL (for module opencv_core)
  274. -- Performing Test HAVE_OBJCXX_FOBJC_EXCEPTIONS
  275. -- Performing Test HAVE_OBJCXX_FOBJC_EXCEPTIONS - Success
  276. -- Performing Test HAVE_CXX_WNO_DEPRECATED_DECLARATIONS
  277. -- Performing Test HAVE_CXX_WNO_DEPRECATED_DECLARATIONS - Success
  278. --
  279. -- General configuration for OpenCV 3.0.0-dev =====================================
  280. --   Version control:               3.0.0-beta-297-gdf57d03
  281. --
  282. --   Platform:
  283. --     Host:                        Darwin 13.4.0 x86_64
  284. --     CMake:                       3.0.0
  285. --     CMake generator:             Unix Makefiles
  286. --     CMake build tool:            /opt/local/bin/gmake
  287. --     Configuration:               Release
  288. --
  289. --   C/C++:
  290. --     Built as dynamic libs?:      YES
  291. --     C++ Compiler:                /usr/bin/c++  (ver 6.0.0.6000054)
  292. --     C++ flags (Release):         -fsigned-char -W -Werror=return-type -Werror=non-virtual-dtor -Werror=address -Werror=sequence-point -Wformat -Werror=format-security -Wmissing-declarations -Wmissing-prototypes -Wstrict-prototypes -Wundef -Winit-self -Wpointer-arith -Wshadow -Wsign-promo -Wno-narrowing -Wno-delete-non-virtual-dtor -Wno-unnamed-type-template-args -fdiagnostics-show-option -Wno-long-long -Wno-semicolon-before-method-body -fno-omit-frame-pointer -msse -msse2 -msse3 -fvisibility=hidden -fvisibility-inlines-hidden -O3 -DNDEBUG  -DNDEBUG
  293. --     C++ flags (Debug):           -fsigned-char -W -Werror=return-type -Werror=non-virtual-dtor -Werror=address -Werror=sequence-point -Wformat -Werror=format-security -Wmissing-declarations -Wmissing-prototypes -Wstrict-prototypes -Wundef -Winit-self -Wpointer-arith -Wshadow -Wsign-promo -Wno-narrowing -Wno-delete-non-virtual-dtor -Wno-unnamed-type-template-args -fdiagnostics-show-option -Wno-long-long -Wno-semicolon-before-method-body -fno-omit-frame-pointer -msse -msse2 -msse3 -fvisibility=hidden -fvisibility-inlines-hidden -g  -O0 -DDEBUG -D_DEBUG
  294. --     C Compiler:                  /usr/bin/cc
  295. --     C flags (Release):           -fsigned-char -W -Werror=return-type -Werror=non-virtual-dtor -Werror=address -Werror=sequence-point -Wformat -Werror=format-security -Wmissing-declarations -Wmissing-prototypes -Wstrict-prototypes -Wundef -Winit-self -Wpointer-arith -Wshadow -Wsign-promo -Wno-narrowing -Wno-delete-non-virtual-dtor -Wno-unnamed-type-template-args -fdiagnostics-show-option -Wno-long-long -Wno-semicolon-before-method-body -fno-omit-frame-pointer -msse -msse2 -msse3 -fvisibility=hidden -fvisibility-inlines-hidden -O3 -DNDEBUG  -DNDEBUG
  296. --     C flags (Debug):             -fsigned-char -W -Werror=return-type -Werror=non-virtual-dtor -Werror=address -Werror=sequence-point -Wformat -Werror=format-security -Wmissing-declarations -Wmissing-prototypes -Wstrict-prototypes -Wundef -Winit-self -Wpointer-arith -Wshadow -Wsign-promo -Wno-narrowing -Wno-delete-non-virtual-dtor -Wno-unnamed-type-template-args -fdiagnostics-show-option -Wno-long-long -Wno-semicolon-before-method-body -fno-omit-frame-pointer -msse -msse2 -msse3 -fvisibility=hidden -fvisibility-inlines-hidden -g  -O0 -DDEBUG -D_DEBUG
  297. --     Linker flags (Release):      
  298. --     Linker flags (Debug):        
  299. --     Precompiled headers:         NO
  300. --
  301. --   OpenCV modules:
  302. --     To be built:                 core flann imgproc imgcodecs videoio highgui ml features2d calib3d objdetect photo video shape stitching superres ts videostab viz
  303. --     Disabled:                    world
  304. --     Disabled by dependency:      -
  305. --     Unavailable:                 androidcamera cuda cudaarithm cudabgsegm cudacodec cudafeatures2d cudafilters cudaimgproc cudalegacy cudaoptflow cudastereo cudawarping cudev java python2 python3
  306. --
  307. --   GUI:
  308. --     QT:                          NO
  309. --     Cocoa:                       YES
  310. --     OpenGL support:              NO
  311. --     VTK support:                 YES (ver 6.1.0)
  312. --
  313. --   Media I/O:
  314. --     ZLib:                        build (ver 1.2.8)
  315. --     JPEG:                        build (ver 90)
  316. --     WEBP:                        /opt/local/lib/libwebp.dylib (ver encoder: 0x0202)
  317. --     PNG:                         build (ver 1.5.12)
  318. --     TIFF:                        build (ver 42 - 4.0.2)
  319. --     JPEG 2000:                   build (ver 1.900.1)
  320. --     OpenEXR:                     build (ver 1.7.1)
  321. --     GDAL:                        NO
  322. --
  323. --   Video I/O:
  324. --     DC1394 1.x:                  NO
  325. --     DC1394 2.x:                  NO
  326. --     FFMPEG:                      YES
  327. --       codec:                     YES (ver Unknown)
  328. --       format:                    YES (ver Unknown)
  329. --       util:                      YES (ver Unknown)
  330. --       swscale:                   YES (ver Unknown)
  331. --       gentoo-style:              YES
  332. --     OpenNI:                      NO
  333. --     OpenNI PrimeSensor Modules:  NO
  334. --     OpenNI2:                     NO
  335. --     PvAPI:                       NO
  336. --     GigEVisionSDK:               NO
  337. --     QuickTime:                   NO
  338. --     QTKit:                       YES
  339. --     V4L/V4L2:                    NO/NO
  340. --     XIMEA:                       NO
  341. --
  342. --   Other third-party libraries:
  343. --     Use IPP:                     8.2.1 [8.2.1]
  344. --          at:                     /Users/rafaelruizmunoz/Downloads/opencv/3rdparty/ippicv/unpack/ippicv_osx
  345. --     Use IPP Async:               NO
  346. --     Use Eigen:                   NO
  347. --     Use TBB:                     NO
  348. --     Use OpenMP:                  NO
  349. --     Use GCD                      YES
  350. --     Use Concurrency              NO
  351. --     Use C=:                      NO
  352. --     Use Cuda:                    NO
  353. --     Use OpenCL:                  YES
  354. --
  355. --   OpenCL:
  356. --     Version:                     static
  357. --     libraries:                   -framework OpenCL
  358. --     Use AMDFFT:                  NO
  359. --     Use AMDBLAS:                 NO
  360. --
  361. --   Python 2:
  362. --     Interpreter:                 /opt/local/bin/python2.7 (ver 2.7.8)
  363. --
  364. --   Python 3:
  365. --     Interpreter:                 NO
  366. --
  367. --   Python (for build):            /opt/local/bin/python2.7
  368. --
  369. --   Java:
  370. --     ant:                         NO
  371. --     JNI:                         /Applications/Xcode.app/Contents/Developer/Platforms/MacOSX.platform/Developer/SDKs/MacOSX10.9.sdk/System/Library/Frameworks/JavaVM.framework/Headers /Applications/Xcode.app/Contents/Developer/Platforms/MacOSX.platform/Developer/SDKs/MacOSX10.9.sdk/System/Library/Frameworks/JavaVM.framework/Headers /Applications/Xcode.app/Contents/Developer/Platforms/MacOSX.platform/Developer/SDKs/MacOSX10.9.sdk/System/Library/Frameworks/JavaVM.framework/Headers
  372. --     Java wrappers:               NO
  373. --     Java tests:                  NO
  374. --
  375. --   Matlab:
  376. --     mex:                         /Applications/MATLAB_R2014a.app/bin/mex
  377. --     Compiler/generator:          Not working (bindings will not be generated)
  378. --
  379. --   Documentation:
  380. --     Doxygen:                     NO
  381. --     PlantUML:                    NO
  382. --
  383. --   Tests and samples:
  384. --     Tests:                       YES
  385. --     Performance tests:           NO
  386. --     C/C++ Examples:              NO
  387. --
  388. --   Install path:                  /usr/local
  389. --
  390. --   cvconfig.h is in:              /Users/rafaelruizmunoz/Downloads/opencv/build
  391. -- -----------------------------------------------------------------
  392. --
  393. -- Configuring done
  394. CMake Warning (dev):
  395.   Policy CMP0042 is not set: MACOSX_RPATH is enabled by default.  Run "cmake
  396.   --help-policy CMP0042" for policy details.  Use the cmake_policy command to
  397.   set the policy and suppress this warning.
  398.  
  399.   MACOSX_RPATH is not specified for the following targets:
  400.  
  401.    opencv_calib3d
  402.    opencv_core
  403.    opencv_features2d
  404.    opencv_flann
  405.    opencv_highgui
  406.    opencv_imgcodecs
  407.    opencv_imgproc
  408.    opencv_ml
  409.    opencv_objdetect
  410.    opencv_photo
  411.    opencv_shape
  412.    opencv_stitching
  413.    opencv_superres
  414.    opencv_video
  415.    opencv_videoio
  416.    opencv_videostab
  417.    opencv_viz
  418.  
  419. This warning is for project developers.  Use -Wno-dev to suppress it.
  420.  
  421. -- Generating done
  422. -- Build files have been written to: /Users/rafaelruizmunoz/Downloads/opencv/build
  423. Rafaels-iMac:build rafaelruizmunoz$ cd modules/viz/CMakeFiles/opencv_viz.dir/
  424. Rafaels-iMac:opencv_viz.dir rafaelruizmunoz$ open .
  425. Rafaels-iMac:opencv_viz.dir rafaelruizmunoz$ open .
  426. Rafaels-iMac:opencv_viz.dir rafaelruizmunoz$ make -j8
  427. make: *** No targets specified and no makefile found.  Stop.
  428. Rafaels-iMac:opencv_viz.dir rafaelruizmunoz$ cd /Users/rafaelruizmunoz/Downloads/opencv/build
  429. Rafaels-iMac:build rafaelruizmunoz$ make -j8
  430. Scanning dependencies of target zlib
  431. Scanning dependencies of target libjpeg
  432. Scanning dependencies of target libjasper
  433. [  0%] [  1%] [  1%] [  1%] [  1%] Building C object 3rdparty/zlib/CMakeFiles/zlib.dir/adler32.c.o
  434. Building C object 3rdparty/zlib/CMakeFiles/zlib.dir/deflate.c.o
  435. Building C object 3rdparty/zlib/CMakeFiles/zlib.dir/compress.c.o
  436. Building C object 3rdparty/zlib/CMakeFiles/zlib.dir/gzclose.c.o
  437. [  1%] Building C object 3rdparty/zlib/CMakeFiles/zlib.dir/gzlib.c.o
  438. Building C object 3rdparty/zlib/CMakeFiles/zlib.dir/crc32.c.o
  439. [  1%] Building C object 3rdparty/libjpeg/CMakeFiles/libjpeg.dir/jaricom.c.o
  440. [  1%] Building C object 3rdparty/libjpeg/CMakeFiles/libjpeg.dir/jcapimin.c.o
  441. [  2%] [  2%] Building C object 3rdparty/libjasper/CMakeFiles/libjasper.dir/jas_cm.c.o
  442. [  2%] Building C object 3rdparty/libjpeg/CMakeFiles/libjpeg.dir/jcapistd.c.o
  443. Building C object 3rdparty/zlib/CMakeFiles/zlib.dir/gzread.c.o
  444. [  2%] [  3%] Building C object 3rdparty/zlib/CMakeFiles/zlib.dir/gzwrite.c.o
  445. Building C object 3rdparty/zlib/CMakeFiles/zlib.dir/inflate.c.o
  446. [  3%] Building C object 3rdparty/libjpeg/CMakeFiles/libjpeg.dir/jcarith.c.o
  447. [  3%] Building C object 3rdparty/zlib/CMakeFiles/zlib.dir/infback.c.o
  448. [  3%] Building C object 3rdparty/zlib/CMakeFiles/zlib.dir/inftrees.c.o
  449. [  3%] Building C object 3rdparty/zlib/CMakeFiles/zlib.dir/inffast.c.o
  450. [  3%] Building C object 3rdparty/zlib/CMakeFiles/zlib.dir/trees.c.o
  451. [  3%] Building C object 3rdparty/libjpeg/CMakeFiles/libjpeg.dir/jccoefct.c.o
  452. [  3%] Building C object 3rdparty/zlib/CMakeFiles/zlib.dir/uncompr.c.o
  453. [  3%] Building C object 3rdparty/libjasper/CMakeFiles/libjasper.dir/jas_debug.c.o
  454. [  3%] [  3%] [  4%] Building C object 3rdparty/libjasper/CMakeFiles/libjasper.dir/jas_getopt.c.o
  455. Building C object 3rdparty/libjpeg/CMakeFiles/libjpeg.dir/jccolor.c.o
  456. Building C object 3rdparty/libjpeg/CMakeFiles/libjpeg.dir/jcdctmgr.c.o
  457. [  4%] [  4%] Building C object 3rdparty/libjasper/CMakeFiles/libjasper.dir/jas_icc.c.o
  458. Building C object 3rdparty/libjpeg/CMakeFiles/libjpeg.dir/jchuff.c.o
  459. [  5%] [  5%] Building C object 3rdparty/zlib/CMakeFiles/zlib.dir/zutil.c.o
  460. Building C object 3rdparty/libjasper/CMakeFiles/libjasper.dir/jas_iccdata.c.o
  461. [  5%] [  5%] Building C object 3rdparty/libjpeg/CMakeFiles/libjpeg.dir/jcinit.c.o
  462. Building C object 3rdparty/libjasper/CMakeFiles/libjasper.dir/jas_image.c.o
  463. [  5%] Building C object 3rdparty/libjpeg/CMakeFiles/libjpeg.dir/jcmainct.c.o
  464. [  5%] Building C object 3rdparty/libjpeg/CMakeFiles/libjpeg.dir/jcmarker.c.o
  465. [  5%] Building C object 3rdparty/libjasper/CMakeFiles/libjasper.dir/jas_init.c.o
  466. [  5%] Building C object 3rdparty/libjpeg/CMakeFiles/libjpeg.dir/jcmaster.c.o
  467. [  6%] Building C object 3rdparty/libjasper/CMakeFiles/libjasper.dir/jas_malloc.c.o
  468. [  6%] Building C object 3rdparty/libjpeg/CMakeFiles/libjpeg.dir/jcomapi.c.o
  469. [  6%] Building C object 3rdparty/libjasper/CMakeFiles/libjasper.dir/jas_seq.c.o
  470. [  7%] Building C object 3rdparty/libjpeg/CMakeFiles/libjpeg.dir/jcparam.c.o
  471. [  7%] Building C object 3rdparty/libjasper/CMakeFiles/libjasper.dir/jas_stream.c.o
  472. [  7%] Building C object 3rdparty/libjasper/CMakeFiles/libjasper.dir/jas_string.c.o
  473. [  7%] Building C object 3rdparty/libjpeg/CMakeFiles/libjpeg.dir/jcprepct.c.o
  474. [  7%] Building C object 3rdparty/libjpeg/CMakeFiles/libjpeg.dir/jcsample.c.o
  475. [  7%] Building C object 3rdparty/libjpeg/CMakeFiles/libjpeg.dir/jctrans.c.o
  476. [  7%] Building C object 3rdparty/libjpeg/CMakeFiles/libjpeg.dir/jdapimin.c.o
  477. [  7%] Building C object 3rdparty/libjasper/CMakeFiles/libjasper.dir/jas_tmr.c.o
  478. [  7%] Building C object 3rdparty/libjpeg/CMakeFiles/libjpeg.dir/jdapistd.c.o
  479. [  7%] Building C object 3rdparty/libjpeg/CMakeFiles/libjpeg.dir/jdarith.c.o
  480. Linking C static library ../lib/libzlib.a
  481. [  7%] Building C object 3rdparty/libjasper/CMakeFiles/libjasper.dir/jas_tvp.c.o
  482. [  7%] [  8%] Building C object 3rdparty/libjasper/CMakeFiles/libjasper.dir/jas_version.c.o
  483. Building C object 3rdparty/libjasper/CMakeFiles/libjasper.dir/jp2_cod.c.o
  484. [  9%] [  9%] Building C object 3rdparty/libjpeg/CMakeFiles/libjpeg.dir/jdatadst.c.o
  485. Building C object 3rdparty/libjpeg/CMakeFiles/libjpeg.dir/jdatasrc.c.o
  486. [  9%] [  9%] Building C object 3rdparty/libjasper/CMakeFiles/libjasper.dir/jp2_dec.c.o
  487. Building C object 3rdparty/libjpeg/CMakeFiles/libjpeg.dir/jdcoefct.c.o
  488. [  9%] Building C object 3rdparty/libjasper/CMakeFiles/libjasper.dir/jp2_enc.c.o
  489. [  9%] Built target zlib
  490. [  9%] Building C object 3rdparty/libjpeg/CMakeFiles/libjpeg.dir/jdcolor.c.o
  491. Scanning dependencies of target libpng
  492. Scanning dependencies of target libtiff
  493. [  9%] Scanning dependencies of target IlmImf
  494. Generating opencl_kernels_core.cpp, opencl_kernels_core.hpp
  495. [  9%] Building C object 3rdparty/libjasper/CMakeFiles/libjasper.dir/jpc_bs.c.o
  496. [  9%] Building C object 3rdparty/libjasper/CMakeFiles/libjasper.dir/jpc_cs.c.o
  497. [  9%] [  9%] Building C object 3rdparty/libjpeg/CMakeFiles/libjpeg.dir/jddctmgr.c.o
  498. Building C object 3rdparty/libjpeg/CMakeFiles/libjpeg.dir/jdhuff.c.o
  499. [  9%] Scanning dependencies of target opencv_core
  500. Building C object 3rdparty/libpng/CMakeFiles/libpng.dir/png.c.o
  501. [  9%] Building C object 3rdparty/libjasper/CMakeFiles/libjasper.dir/jpc_dec.c.o
  502. [ 10%] Building C object 3rdparty/libjpeg/CMakeFiles/libjpeg.dir/jdinput.c.o
  503. [ 10%] Building C object 3rdparty/libjpeg/CMakeFiles/libjpeg.dir/jdmainct.c.o
  504. [ 10%] Building C object 3rdparty/libjasper/CMakeFiles/libjasper.dir/jpc_enc.c.o
  505. [ 11%] [ 11%] Building C object 3rdparty/libjasper/CMakeFiles/libjasper.dir/jpc_math.c.o
  506. Building C object 3rdparty/libjpeg/CMakeFiles/libjpeg.dir/jdmarker.c.o
  507. [ 12%] Building C object 3rdparty/libtiff/CMakeFiles/libtiff.dir/tif_aux.c.o
  508. [ 12%] Building C object 3rdparty/libjasper/CMakeFiles/libjasper.dir/jpc_mct.c.o
  509. [ 12%] [ 13%] Building C object 3rdparty/libtiff/CMakeFiles/libtiff.dir/tif_close.c.o
  510. [ 13%] Building C object 3rdparty/libpng/CMakeFiles/libpng.dir/pngerror.c.o
  511. Building C object 3rdparty/libjasper/CMakeFiles/libjasper.dir/jpc_mqcod.c.o
  512. [ 13%] [ 13%] Building C object 3rdparty/libtiff/CMakeFiles/libtiff.dir/tif_codec.c.o
  513. Building C object 3rdparty/libjpeg/CMakeFiles/libjpeg.dir/jdmaster.c.o
  514. [ 13%] [ 13%] Building C object 3rdparty/libtiff/CMakeFiles/libtiff.dir/tif_color.c.o
  515. Building C object 3rdparty/libpng/CMakeFiles/libpng.dir/pngget.c.o
  516. [ 13%] Building C object 3rdparty/libjpeg/CMakeFiles/libjpeg.dir/jdmerge.c.o
  517. [ 13%] Building C object 3rdparty/libtiff/CMakeFiles/libtiff.dir/tif_compress.c.o
  518. [ 13%] Building C object 3rdparty/libjasper/CMakeFiles/libjasper.dir/jpc_mqdec.c.o
  519. [ 13%] Building C object 3rdparty/libpng/CMakeFiles/libpng.dir/pngmem.c.o
  520. [ 13%] Building C object 3rdparty/libtiff/CMakeFiles/libtiff.dir/tif_dir.c.o
  521. [ 13%] [ 13%] Building C object 3rdparty/libpng/CMakeFiles/libpng.dir/pngpread.c.o
  522. Building C object 3rdparty/libjpeg/CMakeFiles/libjpeg.dir/jdpostct.c.o
  523. [ 13%] Building C object 3rdparty/libjasper/CMakeFiles/libjasper.dir/jpc_mqenc.c.o
  524. [ 13%] [ 13%] Building C object 3rdparty/libjpeg/CMakeFiles/libjpeg.dir/jdsample.c.o
  525. Building C object 3rdparty/libjasper/CMakeFiles/libjasper.dir/jpc_qmfb.c.o
  526. [ 13%] Building C object 3rdparty/libpng/CMakeFiles/libpng.dir/pngread.c.o
  527. [ 14%] [ 14%] Building C object 3rdparty/libjpeg/CMakeFiles/libjpeg.dir/jdtrans.c.o
  528. Building CXX object 3rdparty/openexr/CMakeFiles/IlmImf.dir/Half/half.cpp.o
  529. [ 14%] Building C object 3rdparty/libjpeg/CMakeFiles/libjpeg.dir/jerror.c.o
  530. [ 14%] [ 14%] Building C object 3rdparty/libjasper/CMakeFiles/libjasper.dir/jpc_t1cod.c.o
  531. Building C object 3rdparty/libpng/CMakeFiles/libpng.dir/pngrio.c.o
  532. [ 14%] Building C object 3rdparty/libjpeg/CMakeFiles/libjpeg.dir/jfdctflt.c.o
  533. [ 14%] Building C object 3rdparty/libpng/CMakeFiles/libpng.dir/pngrtran.c.o
  534. [ 14%] Building C object 3rdparty/libjpeg/CMakeFiles/libjpeg.dir/jfdctfst.c.o
  535. [ 15%] Building C object 3rdparty/libpng/CMakeFiles/libpng.dir/pngrutil.c.o
  536. [ 15%] Building C object 3rdparty/libjpeg/CMakeFiles/libjpeg.dir/jfdctint.c.o
  537. [ 15%] Building C object 3rdparty/libtiff/CMakeFiles/libtiff.dir/tif_dirinfo.c.o
  538. [ 16%] Building C object 3rdparty/libtiff/CMakeFiles/libtiff.dir/tif_dirread.c.o
  539. [ 16%] Building CXX object modules/core/CMakeFiles/opencv_core.dir/src/algorithm.cpp.o
  540. [ 16%] Building CXX object 3rdparty/openexr/CMakeFiles/IlmImf.dir/Iex/IexBaseExc.cpp.o
  541. [ 16%] Building C object 3rdparty/libpng/CMakeFiles/libpng.dir/pngset.c.o
  542. [ 16%] Building C object 3rdparty/libjpeg/CMakeFiles/libjpeg.dir/jidctflt.c.o
  543. [ 16%] Building C object 3rdparty/libjpeg/CMakeFiles/libjpeg.dir/jidctfst.c.o
  544. [ 16%] [ 17%] Building C object 3rdparty/libpng/CMakeFiles/libpng.dir/pngtrans.c.o
  545. Building C object 3rdparty/libjpeg/CMakeFiles/libjpeg.dir/jidctint.c.o
  546. [ 17%] Building C object 3rdparty/libtiff/CMakeFiles/libtiff.dir/tif_dirwrite.c.o
  547. [ 17%] Building C object 3rdparty/libpng/CMakeFiles/libpng.dir/pngwio.c.o
  548. [ 17%] Building C object 3rdparty/libpng/CMakeFiles/libpng.dir/pngwrite.c.o
  549. [ 18%] Building C object 3rdparty/libjasper/CMakeFiles/libjasper.dir/jpc_t1dec.c.o
  550. [ 18%] Building C object 3rdparty/libjasper/CMakeFiles/libjasper.dir/jpc_t1enc.c.o
  551. [ 18%] Building C object 3rdparty/libpng/CMakeFiles/libpng.dir/pngwtran.c.o
  552. [ 18%] Building C object 3rdparty/libpng/CMakeFiles/libpng.dir/pngwutil.c.o
  553. [ 18%] [ 18%] Building CXX object 3rdparty/openexr/CMakeFiles/IlmImf.dir/Iex/IexThrowErrnoExc.cpp.o
  554. Building CXX object 3rdparty/openexr/CMakeFiles/IlmImf.dir/IlmThread/IlmThread.cpp.o
  555. [ 18%] Building CXX object 3rdparty/openexr/CMakeFiles/IlmImf.dir/IlmThread/IlmThreadMutex.cpp.o
  556. [ 18%] Building CXX object 3rdparty/openexr/CMakeFiles/IlmImf.dir/IlmThread/IlmThreadMutexPosix.cpp.o
  557. [ 18%] [ 18%] Building C object 3rdparty/libtiff/CMakeFiles/libtiff.dir/tif_dumpmode.c.o
  558. Building C object 3rdparty/libjpeg/CMakeFiles/libjpeg.dir/jmemmgr.c.o
  559. [ 18%] Building C object 3rdparty/libtiff/CMakeFiles/libtiff.dir/tif_error.c.o
  560. [ 18%] Building C object 3rdparty/libtiff/CMakeFiles/libtiff.dir/tif_extension.c.o
  561. [ 18%] [ 18%] Building C object 3rdparty/libjasper/CMakeFiles/libjasper.dir/jpc_t2cod.c.o
  562. Building C object 3rdparty/libjpeg/CMakeFiles/libjpeg.dir/jmemnobs.c.o
  563. Linking C static library ../lib/liblibpng.a
  564. [ 18%] Building C object 3rdparty/libtiff/CMakeFiles/libtiff.dir/tif_fax3.c.o
  565. [ 18%] Building C object 3rdparty/libjpeg/CMakeFiles/libjpeg.dir/jquant1.c.o
  566. [ 18%] Built target libpng
  567. [ 19%] Building CXX object 3rdparty/openexr/CMakeFiles/IlmImf.dir/IlmThread/IlmThreadPool.cpp.o
  568. [ 19%] Building C object 3rdparty/libtiff/CMakeFiles/libtiff.dir/tif_fax3sm.c.o
  569. [ 19%] Building C object 3rdparty/libjpeg/CMakeFiles/libjpeg.dir/jquant2.c.o
  570. [ 19%] Building C object 3rdparty/libjasper/CMakeFiles/libjasper.dir/jpc_t2dec.c.o
  571. [ 19%] [ 19%] Building CXX object modules/core/CMakeFiles/opencv_core.dir/src/alloc.cpp.o
  572. Building CXX object 3rdparty/openexr/CMakeFiles/IlmImf.dir/IlmThread/IlmThreadPosix.cpp.o
  573. [ 19%] Building C object 3rdparty/libjasper/CMakeFiles/libjasper.dir/jpc_t2enc.c.o
  574. [ 19%] Building C object 3rdparty/libjpeg/CMakeFiles/libjpeg.dir/jutils.c.o
  575. Linking C static library ../lib/liblibjpeg.a
  576. [ 19%] Building C object 3rdparty/libjasper/CMakeFiles/libjasper.dir/jpc_tagtree.c.o
  577. [ 19%] Building C object 3rdparty/libjasper/CMakeFiles/libjasper.dir/jpc_tsfb.c.o
  578. [ 19%] Built target libjpeg
  579. [ 20%] Building C object 3rdparty/libtiff/CMakeFiles/libtiff.dir/tif_flush.c.o
  580. [ 21%] [ 21%] Building C object 3rdparty/libjasper/CMakeFiles/libjasper.dir/jpc_util.c.o
  581. Building C object 3rdparty/libtiff/CMakeFiles/libtiff.dir/tif_getimage.c.o
  582. [ 21%] Building CXX object 3rdparty/openexr/CMakeFiles/IlmImf.dir/IlmThread/IlmThreadSemaphore.cpp.o
  583. Linking C static library ../lib/liblibjasper.a
  584. [ 21%] Building CXX object modules/core/CMakeFiles/opencv_core.dir/src/arithm.cpp.o
  585. [ 21%] Built target libjasper
  586. [ 21%] Building C object 3rdparty/libtiff/CMakeFiles/libtiff.dir/tif_jbig.c.o
  587. [ 21%] Building C object 3rdparty/libtiff/CMakeFiles/libtiff.dir/tif_jpeg_12.c.o
  588. [ 21%] Building CXX object 3rdparty/openexr/CMakeFiles/IlmImf.dir/IlmThread/IlmThreadSemaphorePosix.cpp.o
  589. [ 21%] [ 21%] Building CXX object 3rdparty/openexr/CMakeFiles/IlmImf.dir/IlmThread/IlmThreadSemaphorePosixCompat.cpp.o
  590. Building C object 3rdparty/libtiff/CMakeFiles/libtiff.dir/tif_jpeg.c.o
  591. [ 21%] [ 21%] Building CXX object 3rdparty/openexr/CMakeFiles/IlmImf.dir/Imath/ImathColorAlgo.cpp.o
  592. Building CXX object modules/core/CMakeFiles/opencv_core.dir/src/array.cpp.o
  593. [ 21%] Building C object 3rdparty/libtiff/CMakeFiles/libtiff.dir/tif_luv.c.o
  594. [ 21%] Building C object 3rdparty/libtiff/CMakeFiles/libtiff.dir/tif_lzma.c.o
  595. [ 22%] Building C object 3rdparty/libtiff/CMakeFiles/libtiff.dir/tif_lzw.c.o
  596. [ 22%] Building C object 3rdparty/libtiff/CMakeFiles/libtiff.dir/tif_next.c.o
  597. [ 22%] Building CXX object 3rdparty/openexr/CMakeFiles/IlmImf.dir/Imath/ImathFun.cpp.o
  598. [ 22%] Building C object 3rdparty/libtiff/CMakeFiles/libtiff.dir/tif_ojpeg.c.o
  599. [ 23%] Building CXX object 3rdparty/openexr/CMakeFiles/IlmImf.dir/Imath/ImathMatrixAlgo.cpp.o
  600. [ 23%] Building C object 3rdparty/libtiff/CMakeFiles/libtiff.dir/tif_open.c.o
  601. [ 23%] Building C object 3rdparty/libtiff/CMakeFiles/libtiff.dir/tif_packbits.c.o
  602. [ 23%] Building C object 3rdparty/libtiff/CMakeFiles/libtiff.dir/tif_pixarlog.c.o
  603. [ 24%] Building CXX object modules/core/CMakeFiles/opencv_core.dir/src/command_line_parser.cpp.o
  604. [ 24%] Building CXX object 3rdparty/openexr/CMakeFiles/IlmImf.dir/Imath/ImathRandom.cpp.o
  605. [ 24%] Building CXX object modules/core/CMakeFiles/opencv_core.dir/src/conjugate_gradient.cpp.o
  606. [ 24%] Building C object 3rdparty/libtiff/CMakeFiles/libtiff.dir/tif_predict.c.o
  607. [ 24%] Building CXX object 3rdparty/openexr/CMakeFiles/IlmImf.dir/Imath/ImathVec.cpp.o
  608. [ 25%] Building C object 3rdparty/libtiff/CMakeFiles/libtiff.dir/tif_print.c.o
  609. [ 25%] Building C object 3rdparty/libtiff/CMakeFiles/libtiff.dir/tif_read.c.o
  610. [ 25%] Building C object 3rdparty/libtiff/CMakeFiles/libtiff.dir/tif_strip.c.o
  611. [ 25%] Building CXX object modules/core/CMakeFiles/opencv_core.dir/src/convert.cpp.o
  612. [ 25%] Building C object 3rdparty/libtiff/CMakeFiles/libtiff.dir/tif_swab.c.o
  613. [ 25%] Building C object 3rdparty/libtiff/CMakeFiles/libtiff.dir/tif_thunder.c.o
  614. [ 25%] Building C object 3rdparty/libtiff/CMakeFiles/libtiff.dir/tif_tile.c.o
  615. [ 25%] Building C object 3rdparty/libtiff/CMakeFiles/libtiff.dir/tif_version.c.o
  616. [ 26%] Building C object 3rdparty/libtiff/CMakeFiles/libtiff.dir/tif_warning.c.o
  617. [ 26%] Building C object 3rdparty/libtiff/CMakeFiles/libtiff.dir/tif_write.c.o
  618. [ 26%] Building C object 3rdparty/libtiff/CMakeFiles/libtiff.dir/tif_zip.c.o
  619. [ 26%] Building CXX object 3rdparty/libtiff/CMakeFiles/libtiff.dir/tif_stream.cxx.o
  620. [ 26%] [ 26%] Building CXX object modules/core/CMakeFiles/opencv_core.dir/src/copy.cpp.o
  621. Building CXX object 3rdparty/openexr/CMakeFiles/IlmImf.dir/IlmImf/ImfAcesFile.cpp.o
  622. [ 26%] Building C object 3rdparty/libtiff/CMakeFiles/libtiff.dir/tif_unix.c.o
  623. [ 26%] Building CXX object modules/core/CMakeFiles/opencv_core.dir/src/cuda_gpu_mat.cpp.o
  624. Linking CXX static library ../lib/liblibtiff.a
  625. /Applications/Xcode.app/Contents/Developer/Toolchains/XcodeDefault.xctoolchain/usr/bin/ranlib: file: ../lib/liblibtiff.a(tif_jbig.c.o) has no symbols
  626. /Applications/Xcode.app/Contents/Developer/Toolchains/XcodeDefault.xctoolchain/usr/bin/ranlib: file: ../lib/liblibtiff.a(tif_jpeg_12.c.o) has no symbols
  627. /Applications/Xcode.app/Contents/Developer/Toolchains/XcodeDefault.xctoolchain/usr/bin/ranlib: file: ../lib/liblibtiff.a(tif_jpeg.c.o) has no symbols
  628. /Applications/Xcode.app/Contents/Developer/Toolchains/XcodeDefault.xctoolchain/usr/bin/ranlib: file: ../lib/liblibtiff.a(tif_lzma.c.o) has no symbols
  629. /Applications/Xcode.app/Contents/Developer/Toolchains/XcodeDefault.xctoolchain/usr/bin/ranlib: file: ../lib/liblibtiff.a(tif_ojpeg.c.o) has no symbols
  630. [ 26%] Building CXX object 3rdparty/openexr/CMakeFiles/IlmImf.dir/IlmImf/ImfAttribute.cpp.o
  631. /Applications/Xcode.app/Contents/Developer/Toolchains/XcodeDefault.xctoolchain/usr/bin/ranlib: file: ../lib/liblibtiff.a(tif_jbig.c.o) has no symbols
  632. /Applications/Xcode.app/Contents/Developer/Toolchains/XcodeDefault.xctoolchain/usr/bin/ranlib: file: ../lib/liblibtiff.a(tif_jpeg_12.c.o) has no symbols
  633. /Applications/Xcode.app/Contents/Developer/Toolchains/XcodeDefault.xctoolchain/usr/bin/ranlib: file: ../lib/liblibtiff.a(tif_jpeg.c.o) has no symbols
  634. /Applications/Xcode.app/Contents/Developer/Toolchains/XcodeDefault.xctoolchain/usr/bin/ranlib: file: ../lib/liblibtiff.a(tif_lzma.c.o) has no symbols
  635. /Applications/Xcode.app/Contents/Developer/Toolchains/XcodeDefault.xctoolchain/usr/bin/ranlib: file: ../lib/liblibtiff.a(tif_ojpeg.c.o) has no symbols
  636. [ 26%] Built target libtiff
  637. [ 26%] Building CXX object modules/core/CMakeFiles/opencv_core.dir/src/cuda_host_mem.cpp.o
  638. [ 26%] Building CXX object modules/core/CMakeFiles/opencv_core.dir/src/cuda_info.cpp.o
  639. [ 26%] [ 26%] Building CXX object 3rdparty/openexr/CMakeFiles/IlmImf.dir/IlmImf/ImfB44Compressor.cpp.o
  640. Building CXX object 3rdparty/openexr/CMakeFiles/IlmImf.dir/IlmImf/ImfBoxAttribute.cpp.o
  641. [ 27%] Building CXX object modules/core/CMakeFiles/opencv_core.dir/src/cuda_stream.cpp.o
  642. [ 27%] Building CXX object modules/core/CMakeFiles/opencv_core.dir/src/datastructs.cpp.o
  643. [ 27%] Building CXX object modules/core/CMakeFiles/opencv_core.dir/src/directx.cpp.o
  644. [ 28%] Building CXX object 3rdparty/openexr/CMakeFiles/IlmImf.dir/IlmImf/ImfChannelList.cpp.o
  645. [ 28%] Building CXX object modules/core/CMakeFiles/opencv_core.dir/src/downhill_simplex.cpp.o
  646. [ 28%] Building CXX object 3rdparty/openexr/CMakeFiles/IlmImf.dir/IlmImf/ImfChannelListAttribute.cpp.o
  647. [ 28%] Building CXX object 3rdparty/openexr/CMakeFiles/IlmImf.dir/IlmImf/ImfChromaticities.cpp.o
  648. [ 28%] Building CXX object modules/core/CMakeFiles/opencv_core.dir/src/dxt.cpp.o
  649. [ 28%] Building CXX object modules/core/CMakeFiles/opencv_core.dir/src/gl_core_3_1.cpp.o
  650. [ 28%] Building CXX object modules/core/CMakeFiles/opencv_core.dir/src/glob.cpp.o
  651. [ 28%] [ 29%] Building CXX object 3rdparty/openexr/CMakeFiles/IlmImf.dir/IlmImf/ImfChromaticitiesAttribute.cpp.o
  652. Building CXX object modules/core/CMakeFiles/opencv_core.dir/src/kmeans.cpp.o
  653. [ 29%] Building CXX object modules/core/CMakeFiles/opencv_core.dir/src/lapack.cpp.o
  654. [ 29%] Building CXX object 3rdparty/openexr/CMakeFiles/IlmImf.dir/IlmImf/ImfCompressionAttribute.cpp.o
  655. [ 29%] Building CXX object 3rdparty/openexr/CMakeFiles/IlmImf.dir/IlmImf/ImfCompressor.cpp.o
  656. [ 29%] Building CXX object 3rdparty/openexr/CMakeFiles/IlmImf.dir/IlmImf/ImfConvert.cpp.o
  657. [ 30%] Building CXX object 3rdparty/openexr/CMakeFiles/IlmImf.dir/IlmImf/ImfCRgbaFile.cpp.o
  658. [ 30%] Building CXX object 3rdparty/openexr/CMakeFiles/IlmImf.dir/IlmImf/ImfDoubleAttribute.cpp.o
  659. [ 30%] Building CXX object 3rdparty/openexr/CMakeFiles/IlmImf.dir/IlmImf/ImfEnvmap.cpp.o
  660. [ 30%] Building CXX object modules/core/CMakeFiles/opencv_core.dir/src/lda.cpp.o
  661. [ 30%] [ 30%] Building CXX object 3rdparty/openexr/CMakeFiles/IlmImf.dir/IlmImf/ImfEnvmapAttribute.cpp.o
  662. Building CXX object modules/core/CMakeFiles/opencv_core.dir/src/lpsolver.cpp.o
  663. [ 30%] Building CXX object modules/core/CMakeFiles/opencv_core.dir/src/mathfuncs.cpp.o
  664. [ 30%] Building CXX object 3rdparty/openexr/CMakeFiles/IlmImf.dir/IlmImf/ImfFloatAttribute.cpp.o
  665. [ 30%] Building CXX object 3rdparty/openexr/CMakeFiles/IlmImf.dir/IlmImf/ImfFrameBuffer.cpp.o
  666. [ 30%] Building CXX object modules/core/CMakeFiles/opencv_core.dir/src/matmul.cpp.o
  667. [ 30%] Building CXX object modules/core/CMakeFiles/opencv_core.dir/src/matop.cpp.o
  668. [ 30%] Building CXX object 3rdparty/openexr/CMakeFiles/IlmImf.dir/IlmImf/ImfFramesPerSecond.cpp.o
  669. [ 31%] Building CXX object modules/core/CMakeFiles/opencv_core.dir/src/matrix.cpp.o
  670. [ 32%] Building CXX object 3rdparty/openexr/CMakeFiles/IlmImf.dir/IlmImf/ImfHeader.cpp.o
  671. [ 32%] Building CXX object 3rdparty/openexr/CMakeFiles/IlmImf.dir/IlmImf/ImfHuf.cpp.o
  672. [ 32%] Building CXX object 3rdparty/openexr/CMakeFiles/IlmImf.dir/IlmImf/ImfInputFile.cpp.o
  673. [ 32%] Building CXX object modules/core/CMakeFiles/opencv_core.dir/src/ocl.cpp.o
  674. [ 32%] Building CXX object modules/core/CMakeFiles/opencv_core.dir/src/opencl/runtime/opencl_clamdblas.cpp.o
  675. [ 32%] Building CXX object 3rdparty/openexr/CMakeFiles/IlmImf.dir/IlmImf/ImfIntAttribute.cpp.o
  676. [ 32%] Building CXX object 3rdparty/openexr/CMakeFiles/IlmImf.dir/IlmImf/ImfIO.cpp.o
  677. [ 32%] Building CXX object modules/core/CMakeFiles/opencv_core.dir/src/opencl/runtime/opencl_clamdfft.cpp.o
  678. [ 32%] [ 32%] Building CXX object modules/core/CMakeFiles/opencv_core.dir/src/opencl/runtime/opencl_core.cpp.o
  679. [ 32%] Building CXX object modules/core/CMakeFiles/opencv_core.dir/src/opengl.cpp.o
  680. Building CXX object 3rdparty/openexr/CMakeFiles/IlmImf.dir/IlmImf/ImfKeyCode.cpp.o
  681. [ 32%] Building CXX object modules/core/CMakeFiles/opencv_core.dir/src/out.cpp.o
  682. [ 32%] Building CXX object 3rdparty/openexr/CMakeFiles/IlmImf.dir/IlmImf/ImfKeyCodeAttribute.cpp.o
  683. [ 33%] Building CXX object modules/core/CMakeFiles/opencv_core.dir/src/parallel.cpp.o
  684. [ 33%] Building CXX object modules/core/CMakeFiles/opencv_core.dir/src/pca.cpp.o
  685. [ 34%] Building CXX object 3rdparty/openexr/CMakeFiles/IlmImf.dir/IlmImf/ImfLineOrderAttribute.cpp.o
  686. [ 34%] Building CXX object modules/core/CMakeFiles/opencv_core.dir/src/persistence.cpp.o
  687. [ 34%] Building CXX object 3rdparty/openexr/CMakeFiles/IlmImf.dir/IlmImf/ImfLut.cpp.o
  688. [ 34%] Building CXX object modules/core/CMakeFiles/opencv_core.dir/src/rand.cpp.o
  689. [ 34%] Building CXX object 3rdparty/openexr/CMakeFiles/IlmImf.dir/IlmImf/ImfMatrixAttribute.cpp.o
  690. [ 34%] Building CXX object modules/core/CMakeFiles/opencv_core.dir/src/stat.cpp.o
  691. [ 34%] Building CXX object 3rdparty/openexr/CMakeFiles/IlmImf.dir/IlmImf/ImfMisc.cpp.o
  692. [ 34%] Building CXX object 3rdparty/openexr/CMakeFiles/IlmImf.dir/IlmImf/ImfMultiView.cpp.o
  693. [ 34%] Building CXX object 3rdparty/openexr/CMakeFiles/IlmImf.dir/IlmImf/ImfOpaqueAttribute.cpp.o
  694. [ 34%] Building CXX object 3rdparty/openexr/CMakeFiles/IlmImf.dir/IlmImf/ImfOutputFile.cpp.o
  695. [ 35%] Building CXX object 3rdparty/openexr/CMakeFiles/IlmImf.dir/IlmImf/ImfPizCompressor.cpp.o
  696. [ 35%] Building CXX object 3rdparty/openexr/CMakeFiles/IlmImf.dir/IlmImf/ImfPreviewImage.cpp.o
  697. [ 35%] Building CXX object modules/core/CMakeFiles/opencv_core.dir/src/stl.cpp.o
  698. [ 36%] Building CXX object modules/core/CMakeFiles/opencv_core.dir/src/system.cpp.o
  699. [ 36%] Building CXX object 3rdparty/openexr/CMakeFiles/IlmImf.dir/IlmImf/ImfPreviewImageAttribute.cpp.o
  700. [ 36%] Building CXX object 3rdparty/openexr/CMakeFiles/IlmImf.dir/IlmImf/ImfPxr24Compressor.cpp.o
  701. [ 36%] Building CXX object modules/core/CMakeFiles/opencv_core.dir/src/tables.cpp.o
  702. [ 36%] Building CXX object modules/core/CMakeFiles/opencv_core.dir/src/types.cpp.o
  703. [ 36%] Building CXX object modules/core/CMakeFiles/opencv_core.dir/src/umatrix.cpp.o
  704. [ 36%] Building CXX object 3rdparty/openexr/CMakeFiles/IlmImf.dir/IlmImf/ImfRational.cpp.o
  705. [ 36%] [ 36%] Building CXX object 3rdparty/openexr/CMakeFiles/IlmImf.dir/IlmImf/ImfRationalAttribute.cpp.o
  706. Building CXX object 3rdparty/openexr/CMakeFiles/IlmImf.dir/IlmImf/ImfRgbaFile.cpp.o
  707. [ 36%] Building CXX object modules/core/CMakeFiles/opencv_core.dir/opencl_kernels_core.cpp.o
  708. [ 37%] Building CXX object 3rdparty/openexr/CMakeFiles/IlmImf.dir/IlmImf/ImfRgbaYca.cpp.o
  709. [ 37%] Building CXX object 3rdparty/openexr/CMakeFiles/IlmImf.dir/IlmImf/ImfRleCompressor.cpp.o
  710. [ 37%] Building CXX object 3rdparty/openexr/CMakeFiles/IlmImf.dir/IlmImf/ImfScanLineInputFile.cpp.o
  711. [ 37%] Building CXX object 3rdparty/openexr/CMakeFiles/IlmImf.dir/IlmImf/ImfStandardAttributes.cpp.o
  712. [ 37%] Building CXX object 3rdparty/openexr/CMakeFiles/IlmImf.dir/IlmImf/ImfStdIO.cpp.o
  713. [ 37%] Building CXX object 3rdparty/openexr/CMakeFiles/IlmImf.dir/IlmImf/ImfStringAttribute.cpp.o
  714. [ 37%] Building CXX object 3rdparty/openexr/CMakeFiles/IlmImf.dir/IlmImf/ImfStringVectorAttribute.cpp.o
  715. [ 38%] Building CXX object 3rdparty/openexr/CMakeFiles/IlmImf.dir/IlmImf/ImfTestFile.cpp.o
  716. [ 38%] Building CXX object 3rdparty/openexr/CMakeFiles/IlmImf.dir/IlmImf/ImfThreading.cpp.o
  717. [ 38%] Building CXX object 3rdparty/openexr/CMakeFiles/IlmImf.dir/IlmImf/ImfTileDescriptionAttribute.cpp.o
  718. [ 38%] Building CXX object 3rdparty/openexr/CMakeFiles/IlmImf.dir/IlmImf/ImfTiledInputFile.cpp.o
  719. [ 38%] Building CXX object 3rdparty/openexr/CMakeFiles/IlmImf.dir/IlmImf/ImfTiledMisc.cpp.o
  720. [ 38%] Building CXX object 3rdparty/openexr/CMakeFiles/IlmImf.dir/IlmImf/ImfTiledOutputFile.cpp.o
  721. [ 38%] Building CXX object 3rdparty/openexr/CMakeFiles/IlmImf.dir/IlmImf/ImfTiledRgbaFile.cpp.o
  722. [ 39%] Building CXX object 3rdparty/openexr/CMakeFiles/IlmImf.dir/IlmImf/ImfTileOffsets.cpp.o
  723. [ 39%] Building CXX object 3rdparty/openexr/CMakeFiles/IlmImf.dir/IlmImf/ImfTimeCode.cpp.o
  724. [ 39%] Building CXX object 3rdparty/openexr/CMakeFiles/IlmImf.dir/IlmImf/ImfTimeCodeAttribute.cpp.o
  725. [ 39%] Building CXX object 3rdparty/openexr/CMakeFiles/IlmImf.dir/IlmImf/ImfVecAttribute.cpp.o
  726. [ 39%] Building CXX object 3rdparty/openexr/CMakeFiles/IlmImf.dir/IlmImf/ImfVersion.cpp.o
  727. [ 39%] Building CXX object 3rdparty/openexr/CMakeFiles/IlmImf.dir/IlmImf/ImfWav.cpp.o
  728. [ 39%] Building CXX object 3rdparty/openexr/CMakeFiles/IlmImf.dir/IlmImf/ImfZipCompressor.cpp.o
  729. Linking CXX shared library ../../lib/libopencv_core.dylib
  730. Linking CXX static library ../lib/libIlmImf.a
  731. /Applications/Xcode.app/Contents/Developer/Toolchains/XcodeDefault.xctoolchain/usr/bin/ranlib: file: ../lib/libIlmImf.a(IlmThread.cpp.o) has no symbols
  732. /Applications/Xcode.app/Contents/Developer/Toolchains/XcodeDefault.xctoolchain/usr/bin/ranlib: file: ../lib/libIlmImf.a(IlmThreadMutex.cpp.o) has no symbols
  733. /Applications/Xcode.app/Contents/Developer/Toolchains/XcodeDefault.xctoolchain/usr/bin/ranlib: file: ../lib/libIlmImf.a(IlmThreadSemaphore.cpp.o) has no symbols
  734. /Applications/Xcode.app/Contents/Developer/Toolchains/XcodeDefault.xctoolchain/usr/bin/ranlib: file: ../lib/libIlmImf.a(IlmThreadSemaphorePosixCompat.cpp.o) has no symbols
  735. /Applications/Xcode.app/Contents/Developer/Toolchains/XcodeDefault.xctoolchain/usr/bin/ranlib: file: ../lib/libIlmImf.a(IlmThread.cpp.o) has no symbols
  736. /Applications/Xcode.app/Contents/Developer/Toolchains/XcodeDefault.xctoolchain/usr/bin/ranlib: file: ../lib/libIlmImf.a(IlmThreadMutex.cpp.o) has no symbols
  737. /Applications/Xcode.app/Contents/Developer/Toolchains/XcodeDefault.xctoolchain/usr/bin/ranlib: file: ../lib/libIlmImf.a(IlmThreadSemaphore.cpp.o) has no symbols
  738. /Applications/Xcode.app/Contents/Developer/Toolchains/XcodeDefault.xctoolchain/usr/bin/ranlib: file: ../lib/libIlmImf.a(IlmThreadSemaphorePosixCompat.cpp.o) has no symbols
  739. [ 39%] Built target IlmImf
  740. [ 39%] Built target opencv_core
  741. Scanning dependencies of target opencv_flann
  742. Scanning dependencies of target opencv_ml
  743. Scanning dependencies of target opencv_viz
  744. [ 40%] Generating opencl_kernels_imgproc.cpp, opencl_kernels_imgproc.hpp
  745. Scanning dependencies of target opencv_imgproc
  746. [ 40%] [ 40%] [ 40%] [ 40%] [ 40%] Building CXX object modules/ml/CMakeFiles/opencv_ml.dir/src/boost.cpp.o
  747. Building CXX object modules/ml/CMakeFiles/opencv_ml.dir/src/ann_mlp.cpp.o
  748. Building CXX object modules/ml/CMakeFiles/opencv_ml.dir/src/data.cpp.o
  749. Building CXX object modules/ml/CMakeFiles/opencv_ml.dir/src/em.cpp.o
  750. Building CXX object modules/ml/CMakeFiles/opencv_ml.dir/src/gbt.cpp.o
  751. [ 41%] Building CXX object modules/ml/CMakeFiles/opencv_ml.dir/src/inner_functions.cpp.o
  752. [ 41%] Building CXX object modules/ml/CMakeFiles/opencv_ml.dir/src/kdtree.cpp.o
  753. [ 41%] Building CXX object modules/ml/CMakeFiles/opencv_ml.dir/src/knearest.cpp.o
  754. [ 41%] Building CXX object modules/ml/CMakeFiles/opencv_ml.dir/src/lr.cpp.o
  755. [ 41%] Building CXX object modules/ml/CMakeFiles/opencv_ml.dir/src/nbayes.cpp.o
  756. [ 41%] Building CXX object modules/ml/CMakeFiles/opencv_ml.dir/src/rtrees.cpp.o
  757. [ 41%] Building CXX object modules/ml/CMakeFiles/opencv_ml.dir/src/svm.cpp.o
  758. [ 42%] Building CXX object modules/ml/CMakeFiles/opencv_ml.dir/src/testset.cpp.o
  759. [ 42%] Building CXX object modules/ml/CMakeFiles/opencv_ml.dir/src/tree.cpp.o
  760. [ 42%] [ 42%] [ 42%] Building CXX object modules/imgproc/CMakeFiles/opencv_imgproc.dir/src/accum.cpp.o
  761. Building CXX object modules/imgproc/CMakeFiles/opencv_imgproc.dir/src/approx.cpp.o
  762. Building CXX object modules/imgproc/CMakeFiles/opencv_imgproc.dir/src/blend.cpp.o
  763. [ 42%] Building CXX object modules/imgproc/CMakeFiles/opencv_imgproc.dir/src/canny.cpp.o
  764. [ 42%] Building CXX object modules/imgproc/CMakeFiles/opencv_imgproc.dir/src/clahe.cpp.o
  765. [ 42%] Building CXX object modules/imgproc/CMakeFiles/opencv_imgproc.dir/src/color.cpp.o
  766. [ 43%] Building CXX object modules/imgproc/CMakeFiles/opencv_imgproc.dir/src/colormap.cpp.o
  767. [ 43%] Building CXX object modules/imgproc/CMakeFiles/opencv_imgproc.dir/src/connectedcomponents.cpp.o
  768. [ 43%] Building CXX object modules/imgproc/CMakeFiles/opencv_imgproc.dir/src/contours.cpp.o
  769. [ 43%] Building CXX object modules/imgproc/CMakeFiles/opencv_imgproc.dir/src/convhull.cpp.o
  770. Linking CXX shared library ../../lib/libopencv_ml.dylib
  771. [ 43%] Built target opencv_ml
  772. [ 43%] Building CXX object modules/imgproc/CMakeFiles/opencv_imgproc.dir/src/corner.cpp.o
  773. [ 43%] [ 43%] [ 43%] Building CXX object modules/imgproc/CMakeFiles/opencv_imgproc.dir/src/cornersubpix.cpp.o
  774. Building CXX object modules/flann/CMakeFiles/opencv_flann.dir/src/flann.cpp.o
  775. Building CXX object modules/imgproc/CMakeFiles/opencv_imgproc.dir/src/demosaicing.cpp.o
  776. [ 43%] [ 43%] Building CXX object modules/viz/CMakeFiles/opencv_viz.dir/src/clouds.cpp.o
  777. Building CXX object modules/flann/CMakeFiles/opencv_flann.dir/src/miniflann.cpp.o
  778. [ 44%] Building CXX object modules/imgproc/CMakeFiles/opencv_imgproc.dir/src/deriv.cpp.o
  779. [ 44%] Building CXX object modules/imgproc/CMakeFiles/opencv_imgproc.dir/src/distransform.cpp.o
  780. [ 44%] Building CXX object modules/imgproc/CMakeFiles/opencv_imgproc.dir/src/drawing.cpp.o
  781. [ 44%] Building CXX object modules/viz/CMakeFiles/opencv_viz.dir/src/shapes.cpp.o
  782. In file included from /Users/rafaelruizmunoz/Downloads/opencv/modules/viz/src/clouds.cpp:46:
  783. In file included from /Users/rafaelruizmunoz/Downloads/opencv/modules/viz/src/precomp.hpp:144:
  784. In file included from /Users/rafaelruizmunoz/Downloads/opencv/modules/viz/src/vtk/vtkCloudMatSink.h:48:
  785. In file included from /Users/rafaelruizmunoz/Downloads/opencv/modules/core/include/opencv2/core.hpp:57:
  786. /usr/local/include/opencv2/core/mat.hpp:58:13: error: incomplete type 'cv::Mat'
  787.       named in nested name specifier
  788. inline void Mat::initEmpty()
  789.             ^~~~~
  790. /Users/rafaelruizmunoz/Downloads/opencv/modules/core/include/opencv2/core/base.hpp:679:18: note:
  791.       forward declaration of 'cv::Mat'
  792. class CV_EXPORTS Mat;
  793.                  ^
  794. In file included from /Users/rafaelruizmunoz/Downloads/opencv/modules/viz/src/clouds.cpp:46:
  795. In file included from /Users/rafaelruizmunoz/Downloads/opencv/modules/viz/src/precomp.hpp:144:
  796. In file included from /Users/rafaelruizmunoz/Downloads/opencv/modules/viz/src/vtk/vtkCloudMatSink.h:48:
  797. In file included from /Users/rafaelruizmunoz/Downloads/opencv/modules/core/include/opencv2/core.hpp:57:
  798. /usr/local/include/opencv2/core/mat.hpp:67:8: error: incomplete type 'cv::Mat'
  799.       named in nested name specifier
  800. inline Mat::Mat() : size(&rows)
  801.        ^~~~~
  802. /Users/rafaelruizmunoz/Downloads/opencv/modules/core/include/opencv2/core/base.hpp:679:18: note:
  803.       forward declaration of 'cv::Mat'
  804. class CV_EXPORTS Mat;
  805.                  ^
  806. In file included from /Users/rafaelruizmunoz/Downloads/opencv/modules/viz/src/clouds.cpp:46:
  807. In file included from /Users/rafaelruizmunoz/Downloads/opencv/modules/viz/src/precomp.hpp:144:
  808. In file included from /Users/rafaelruizmunoz/Downloads/opencv/modules/viz/src/vtk/vtkCloudMatSink.h:48:
  809. In file included from /Users/rafaelruizmunoz/Downloads/opencv/modules/core/include/opencv2/core.hpp:57:
  810. /usr/local/include/opencv2/core/mat.hpp:72:8: error: incomplete type 'cv::Mat'
  811.       named in nested name specifier
  812. inline Mat::Mat(int _rows, int _cols, int _type) : size(&rows)
  813.        ^~~~~
  814. /Users/rafaelruizmunoz/Downloads/opencv/modules/core/include/opencv2/core/base.hpp:679:18: note:
  815.       forward declaration of 'cv::Mat'
  816. class CV_EXPORTS Mat;
  817.                  ^
  818. In file included from /Users/rafaelruizmunoz/Downloads/opencv/modules/viz/src/clouds.cpp:46:
  819. In file included from /Users/rafaelruizmunoz/Downloads/opencv/modules/viz/src/precomp.hpp:144:
  820. In file included from /Users/rafaelruizmunoz/Downloads/opencv/modules/viz/src/vtk/vtkCloudMatSink.h:48:
  821. In file included from /Users/rafaelruizmunoz/Downloads/opencv/modules/core/include/opencv2/core.hpp:57:
  822. /usr/local/include/opencv2/core/mat.hpp:72:8: error: incomplete type 'cv::Mat'
  823.       named in nested name specifier
  824. inline Mat::Mat(int _rows, int _cols, int _type) : size(&rows)
  825.        ^~~~~
  826. /Users/rafaelruizmunoz/Downloads/opencv/modules/core/include/opencv2/core/base.hpp:679:18: note:
  827.       forward declaration of 'cv::Mat'
  828. class CV_EXPORTS Mat;
  829.                  ^
  830. In file included from /Users/rafaelruizmunoz/Downloads/opencv/modules/viz/src/clouds.cpp:46:
  831. In file included from /Users/rafaelruizmunoz/Downloads/opencv/modules/viz/src/precomp.hpp:144:
  832. In file included from /Users/rafaelruizmunoz/Downloads/opencv/modules/viz/src/vtk/vtkCloudMatSink.h:48:
  833. In file included from /Users/rafaelruizmunoz/Downloads/opencv/modules/core/include/opencv2/core.hpp:57:
  834. /usr/local/include/opencv2/core/mat.hpp:78:8: error: incomplete type 'cv::Mat'
  835.       named in nested name specifier
  836. inline Mat::Mat(int _rows, int _cols, int _type, const Scalar& _s) : size(&rows)
  837.        ^~~~~
  838. /Users/rafaelruizmunoz/Downloads/opencv/modules/core/include/opencv2/core/base.hpp:679:18: note:
  839.       forward declaration of 'cv::Mat'
  840. class CV_EXPORTS Mat;
  841.                  ^
  842. In file included from /Users/rafaelruizmunoz/Downloads/opencv/modules/viz/src/clouds.cpp:46:
  843. In file included from /Users/rafaelruizmunoz/Downloads/opencv/modules/viz/src/precomp.hpp:144:
  844. In file included from /Users/rafaelruizmunoz/Downloads/opencv/modules/viz/src/vtk/vtkCloudMatSink.h:48:
  845. In file included from /Users/rafaelruizmunoz/Downloads/opencv/modules/core/include/opencv2/core.hpp:57:
  846. /usr/local/include/opencv2/core/mat.hpp:78:8: error: incomplete type 'cv::Mat'
  847.       named in nested name specifier
  848. inline Mat::Mat(int _rows, int _cols, int _type, const Scalar& _s) : size(&rows)
  849.        ^~~~~
  850. /Users/rafaelruizmunoz/Downloads/opencv/modules/core/include/opencv2/core/base.hpp:679:18: note:
  851.       forward declaration of 'cv::Mat'
  852. class CV_EXPORTS Mat;
  853.                  ^
  854. In file included from /Users/rafaelruizmunoz/Downloads/opencv/modules/viz/src/clouds.cpp:46:
  855. In file included from /Users/rafaelruizmunoz/Downloads/opencv/modules/viz/src/precomp.hpp:144:
  856. In file included from /Users/rafaelruizmunoz/Downloads/opencv/modules/viz/src/vtk/vtkCloudMatSink.h:48:
  857. In file included from /Users/rafaelruizmunoz/Downloads/opencv/modules/core/include/opencv2/core.hpp:57:
  858. /usr/local/include/opencv2/core/mat.hpp:85:8: error: incomplete type 'cv::Mat'
  859.       named in nested name specifier
  860. inline Mat::Mat(Size _sz, int _type) : size(&rows)
  861.        ^~~~~
  862. /Users/rafaelruizmunoz/Downloads/opencv/modules/core/include/opencv2/core/base.hpp:679:18: note:
  863.       forward declaration of 'cv::Mat'
  864. class CV_EXPORTS Mat;
  865.                  ^
  866. In file included from /Users/rafaelruizmunoz/Downloads/opencv/modules/viz/src/clouds.cpp:46:
  867. In file included from /Users/rafaelruizmunoz/Downloads/opencv/modules/viz/src/precomp.hpp:144:
  868. In file included from /Users/rafaelruizmunoz/Downloads/opencv/modules/viz/src/vtk/vtkCloudMatSink.h:48:
  869. In file included from /Users/rafaelruizmunoz/Downloads/opencv/modules/core/include/opencv2/core.hpp:57:
  870. /usr/local/include/opencv2/core/mat.hpp:85:8: error: incomplete type 'cv::Mat'
  871.       named in nested name specifier
  872. inline Mat::Mat(Size _sz, int _type) : size(&rows)
  873.        ^~~~~
  874. /Users/rafaelruizmunoz/Downloads/opencv/modules/core/include/opencv2/core/base.hpp:679:18: note:
  875.       forward declaration of 'cv::Mat'
  876. class CV_EXPORTS Mat;
  877.                  ^
  878. In file included from /Users/rafaelruizmunoz/Downloads/opencv/modules/viz/src/clouds.cpp:46:
  879. In file included from /Users/rafaelruizmunoz/Downloads/opencv/modules/viz/src/precomp.hpp:144:
  880. In file included from /Users/rafaelruizmunoz/Downloads/opencv/modules/viz/src/vtk/vtkCloudMatSink.h:48:
  881. In file included from /Users/rafaelruizmunoz/Downloads/opencv/modules/core/include/opencv2/core.hpp:57:
  882. /usr/local/include/opencv2/core/mat.hpp:91:8: error: incomplete type 'cv::Mat'
  883.       named in nested name specifier
  884. inline Mat::Mat(Size _sz, int _type, const Scalar& _s) : size(&rows)
  885.        ^~~~~
  886. /Users/rafaelruizmunoz/Downloads/opencv/modules/core/include/opencv2/core/base.hpp:679:18: note:
  887.       forward declaration of 'cv::Mat'
  888. class CV_EXPORTS Mat;
  889.                  ^
  890. In file included from /Users/rafaelruizmunoz/Downloads/opencv/modules/viz/src/clouds.cpp:46:
  891. In file included from /Users/rafaelruizmunoz/Downloads/opencv/modules/viz/src/precomp.hpp:144:
  892. In file included from /Users/rafaelruizmunoz/Downloads/opencv/modules/viz/src/vtk/vtkCloudMatSink.h:48:
  893. In file included from /Users/rafaelruizmunoz/Downloads/opencv/modules/core/include/opencv2/core.hpp:57:
  894. /usr/local/include/opencv2/core/mat.hpp:91:8: error: incomplete type 'cv::Mat'
  895.       named in nested name specifier
  896. inline Mat::Mat(Size _sz, int _type, const Scalar& _s) : size(&rows)
  897.        ^~~~~
  898. /Users/rafaelruizmunoz/Downloads/opencv/modules/core/include/opencv2/core/base.hpp:679:18: note:
  899.       forward declaration of 'cv::Mat'
  900. class CV_EXPORTS Mat;
  901.                  ^
  902. In file included from /Users/rafaelruizmunoz/Downloads/opencv/modules/viz/src/clouds.cpp:46:
  903. In file included from /Users/rafaelruizmunoz/Downloads/opencv/modules/viz/src/precomp.hpp:144:
  904. In file included from /Users/rafaelruizmunoz/Downloads/opencv/modules/viz/src/vtk/vtkCloudMatSink.h:48:
  905. In file included from /Users/rafaelruizmunoz/Downloads/opencv/modules/core/include/opencv2/core.hpp:57:
  906. /usr/local/include/opencv2/core/mat.hpp:98:8: error: incomplete type 'cv::Mat'
  907.       named in nested name specifier
  908. inline Mat::Mat(int _dims, const int* _sz, int _type) : size(&rows)
  909.        ^~~~~
  910. /Users/rafaelruizmunoz/Downloads/opencv/modules/core/include/opencv2/core/base.hpp:679:18: note:
  911.       forward declaration of 'cv::Mat'
  912. class CV_EXPORTS Mat;
  913.                  ^
  914. In file included from /Users/rafaelruizmunoz/Downloads/opencv/modules/viz/src/clouds.cpp:46:
  915. In file included from /Users/rafaelruizmunoz/Downloads/opencv/modules/viz/src/precomp.hpp:144:
  916. In file included from /Users/rafaelruizmunoz/Downloads/opencv/modules/viz/src/vtk/vtkCloudMatSink.h:48:
  917. In file included from /Users/rafaelruizmunoz/Downloads/opencv/modules/core/include/opencv2/core.hpp:57:
  918. /usr/local/include/opencv2/core/mat.hpp:98:8: error: incomplete type 'cv::Mat'
  919.       named in nested name specifier
  920. inline Mat::Mat(int _dims, const int* _sz, int _type) : size(&rows)
  921.        ^~~~~
  922. /Users/rafaelruizmunoz/Downloads/opencv/modules/core/include/opencv2/core/base.hpp:679:18: note:
  923.       forward declaration of 'cv::Mat'
  924. class CV_EXPORTS Mat;
  925.                  ^
  926. In file included from /Users/rafaelruizmunoz/Downloads/opencv/modules/viz/src/clouds.cpp:46:
  927. In file included from /Users/rafaelruizmunoz/Downloads/opencv/modules/viz/src/precomp.hpp:144:
  928. In file included from /Users/rafaelruizmunoz/Downloads/opencv/modules/viz/src/vtk/vtkCloudMatSink.h:48:
  929. In file included from /Users/rafaelruizmunoz/Downloads/opencv/modules/core/include/opencv2/core.hpp:57:
  930. /usr/local/include/opencv2/core/mat.hpp:104:8: error: incomplete type 'cv::Mat'
  931.       named in nested name specifier
  932. inline Mat::Mat(int _dims, const int* _sz, int _type, const Scalar& _s) ...
  933.        ^~~~~
  934. /Users/rafaelruizmunoz/Downloads/opencv/modules/core/include/opencv2/core/base.hpp:679:18: note:
  935.       forward declaration of 'cv::Mat'
  936. class CV_EXPORTS Mat;
  937.                  ^
  938. In file included from /Users/rafaelruizmunoz/Downloads/opencv/modules/viz/src/clouds.cpp:46:
  939. In file included from /Users/rafaelruizmunoz/Downloads/opencv/modules/viz/src/precomp.hpp:144:
  940. In file included from /Users/rafaelruizmunoz/Downloads/opencv/modules/viz/src/vtk/vtkCloudMatSink.h:48:
  941. In file included from /Users/rafaelruizmunoz/Downloads/opencv/modules/core/include/opencv2/core.hpp:57:
  942. /usr/local/include/opencv2/core/mat.hpp:104:8: error: incomplete type 'cv::Mat'
  943.       named in nested name specifier
  944. inline Mat::Mat(int _dims, const int* _sz, int _type, const Scalar& _s) ...
  945.        ^~~~~
  946. /Users/rafaelruizmunoz/Downloads/opencv/modules/core/include/opencv2/core/base.hpp:679:18: note:
  947.       forward declaration of 'cv::Mat'
  948. class CV_EXPORTS Mat;
  949.                  ^
  950. In file included from /Users/rafaelruizmunoz/Downloads/opencv/modules/viz/src/clouds.cpp:46:
  951. In file included from /Users/rafaelruizmunoz/Downloads/opencv/modules/viz/src/precomp.hpp:144:
  952. In file included from /Users/rafaelruizmunoz/Downloads/opencv/modules/viz/src/vtk/vtkCloudMatSink.h:48:
  953. In file included from /Users/rafaelruizmunoz/Downloads/opencv/modules/core/include/opencv2/core.hpp:57:
  954. /usr/local/include/opencv2/core/mat.hpp:111:8: error: incomplete type 'cv::Mat'
  955.       named in nested name specifier
  956. inline Mat::Mat(const Mat& m)
  957.        ^~~~~
  958. /Users/rafaelruizmunoz/Downloads/opencv/modules/core/include/opencv2/core/base.hpp:679:18: note:
  959.       forward declaration of 'cv::Mat'
  960. class CV_EXPORTS Mat;
  961.                  ^
  962. In file included from /Users/rafaelruizmunoz/Downloads/opencv/modules/viz/src/clouds.cpp:46:
  963. In file included from /Users/rafaelruizmunoz/Downloads/opencv/modules/viz/src/precomp.hpp:144:
  964. In file included from /Users/rafaelruizmunoz/Downloads/opencv/modules/viz/src/vtk/vtkCloudMatSink.h:48:
  965. In file included from /Users/rafaelruizmunoz/Downloads/opencv/modules/core/include/opencv2/core.hpp:57:
  966. /usr/local/include/opencv2/core/mat.hpp:111:8: error: incomplete type 'cv::Mat'
  967.       named in nested name specifier
  968. inline Mat::Mat(const Mat& m)
  969.        ^~~~~
  970. /Users/rafaelruizmunoz/Downloads/opencv/modules/core/include/opencv2/core/base.hpp:679:18: note:
  971.       forward declaration of 'cv::Mat'
  972. class CV_EXPORTS Mat;
  973.                  ^
  974. In file included from /Users/rafaelruizmunoz/Downloads/opencv/modules/viz/src/clouds.cpp:46:
  975. In file included from /Users/rafaelruizmunoz/Downloads/opencv/modules/viz/src/precomp.hpp:144:
  976. In file included from /Users/rafaelruizmunoz/Downloads/opencv/modules/viz/src/vtk/vtkCloudMatSink.h:48:
  977. In file included from /Users/rafaelruizmunoz/Downloads/opencv/modules/core/include/opencv2/core.hpp:57:
  978. /usr/local/include/opencv2/core/mat.hpp:129:8: error: incomplete type 'cv::Mat'
  979.       named in nested name specifier
  980. inline Mat::Mat(int _rows, int _cols, int _type, void* _data, size_t _step)
  981.        ^~~~~
  982. /Users/rafaelruizmunoz/Downloads/opencv/modules/core/include/opencv2/core/base.hpp:679:18: note:
  983.       forward declaration of 'cv::Mat'
  984. class CV_EXPORTS Mat;
  985.                  ^
  986. In file included from /Users/rafaelruizmunoz/Downloads/opencv/modules/viz/src/clouds.cpp:46:
  987. In file included from /Users/rafaelruizmunoz/Downloads/opencv/modules/viz/src/precomp.hpp:144:
  988. In file included from /Users/rafaelruizmunoz/Downloads/opencv/modules/viz/src/vtk/vtkCloudMatSink.h:48:
  989. In file included from /Users/rafaelruizmunoz/Downloads/opencv/modules/core/include/opencv2/core.hpp:57:
  990. /usr/local/include/opencv2/core/mat.hpp:129:8: error: incomplete type 'cv::Mat'
  991.       named in nested name specifier
  992. inline Mat::Mat(int _rows, int _cols, int _type, void* _data, size_t _step)
  993.        ^~~~~
  994. /Users/rafaelruizmunoz/Downloads/opencv/modules/core/include/opencv2/core/base.hpp:679:18: note:
  995.       forward declaration of 'cv::Mat'
  996. class CV_EXPORTS Mat;
  997.                  ^
  998. In file included from /Users/rafaelruizmunoz/Downloads/opencv/modules/viz/src/clouds.cpp:46:
  999. In file included from /Users/rafaelruizmunoz/Downloads/opencv/modules/viz/src/precomp.hpp:144:
  1000. In file included from /Users/rafaelruizmunoz/Downloads/opencv/modules/viz/src/vtk/vtkCloudMatSink.h:48:
  1001. In file included from /Users/rafaelruizmunoz/Downloads/opencv/modules/core/include/opencv2/core.hpp:57:
  1002. /usr/local/include/opencv2/core/mat.hpp:151:8: error: incomplete type 'cv::Mat'
  1003.       named in nested name specifier
  1004. inline Mat::Mat(Size _sz, int _type, void* _data, size_t _step)
  1005.        ^~~~~
  1006. /Users/rafaelruizmunoz/Downloads/opencv/modules/core/include/opencv2/core/base.hpp:679:18: note:
  1007.       forward declaration of 'cv::Mat'
  1008. class CV_EXPORTS Mat;
  1009.                  ^
  1010. fatal error: too many errors emitted, stopping now [-ferror-limit=]
  1011. [ 44%] Building CXX object modules/viz/CMakeFiles/opencv_viz.dir/src/types.cpp.o
  1012. 20 errors generated.
  1013. make[2]: *** [modules/viz/CMakeFiles/opencv_viz.dir/src/clouds.cpp.o] Error 1
  1014. make[2]: *** Waiting for unfinished jobs....
  1015. [ 44%] [ 44%] [ 44%] Building CXX object modules/imgproc/CMakeFiles/opencv_imgproc.dir/src/emd.cpp.o
  1016. Building CXX object modules/imgproc/CMakeFiles/opencv_imgproc.dir/src/featureselect.cpp.o
  1017. Building CXX object modules/imgproc/CMakeFiles/opencv_imgproc.dir/src/filter.cpp.o
  1018. In file included from /Users/rafaelruizmunoz/Downloads/opencv/modules/viz/src/shapes.cpp:46:
  1019. In file included from /Users/rafaelruizmunoz/Downloads/opencv/modules/viz/src/precomp.hpp:144:
  1020. In file included from /Users/rafaelruizmunoz/Downloads/opencv/modules/viz/src/vtk/vtkCloudMatSink.h:48:
  1021. In file included from /Users/rafaelruizmunoz/Downloads/opencv/modules/core/include/opencv2/core.hpp:57:
  1022. /usr/local/include/opencv2/core/mat.hpp:58:13: error: incomplete type 'cv::Mat'
  1023.       named in nested name specifier
  1024. inline void Mat::initEmpty()
  1025.             ^~~~~
  1026. /Users/rafaelruizmunoz/Downloads/opencv/modules/core/include/opencv2/core/base.hpp:679:18: note:
  1027.       forward declaration of 'cv::Mat'
  1028. class CV_EXPORTS Mat;
  1029.                  ^
  1030. In file included from /Users/rafaelruizmunoz/Downloads/opencv/modules/viz/src/shapes.cpp:46:
  1031. In file included from /Users/rafaelruizmunoz/Downloads/opencv/modules/viz/src/precomp.hpp:144:
  1032. In file included from /Users/rafaelruizmunoz/Downloads/opencv/modules/viz/src/vtk/vtkCloudMatSink.h:48:
  1033. In file included from /Users/rafaelruizmunoz/Downloads/opencv/modules/core/include/opencv2/core.hpp:57:
  1034. /usr/local/include/opencv2/core/mat.hpp:67:8: error: incomplete type 'cv::Mat'
  1035.       named in nested name specifier
  1036. inline Mat::Mat() : size(&rows)
  1037.        ^~~~~
  1038. /Users/rafaelruizmunoz/Downloads/opencv/modules/core/include/opencv2/core/base.hpp:679:18: note:
  1039.       forward declaration of 'cv::Mat'
  1040. class CV_EXPORTS Mat;
  1041.                  ^
  1042. In file included from /Users/rafaelruizmunoz/Downloads/opencv/modules/viz/src/shapes.cpp:46:
  1043. In file included from /Users/rafaelruizmunoz/Downloads/opencv/modules/viz/src/precomp.hpp:144:
  1044. In file included from /Users/rafaelruizmunoz/Downloads/opencv/modules/viz/src/vtk/vtkCloudMatSink.h:48:
  1045. In file included from /Users/rafaelruizmunoz/Downloads/opencv/modules/core/include/opencv2/core.hpp:57:
  1046. /usr/local/include/opencv2/core/mat.hpp:72:8: error: incomplete type 'cv::Mat'
  1047.       named in nested name specifier
  1048. inline Mat::Mat(int _rows, int _cols, int _type) : size(&rows)
  1049.        ^~~~~
  1050. /Users/rafaelruizmunoz/Downloads/opencv/modules/core/include/opencv2/core/base.hpp:679:18: note:
  1051.       forward declaration of 'cv::Mat'
  1052. class CV_EXPORTS Mat;
  1053.                  ^
  1054. In file included from /Users/rafaelruizmunoz/Downloads/opencv/modules/viz/src/shapes.cpp:46:
  1055. In file included from /Users/rafaelruizmunoz/Downloads/opencv/modules/viz/src/precomp.hpp:144:
  1056. In file included from /Users/rafaelruizmunoz/Downloads/opencv/modules/viz/src/vtk/vtkCloudMatSink.h:48:
  1057. In file included from /Users/rafaelruizmunoz/Downloads/opencv/modules/core/include/opencv2/core.hpp:57:
  1058. /usr/local/include/opencv2/core/mat.hpp:72:8: error: incomplete type 'cv::Mat'
  1059.       named in nested name specifier
  1060. inline Mat::Mat(int _rows, int _cols, int _type) : size(&rows)
  1061.        ^~~~~
  1062. /Users/rafaelruizmunoz/Downloads/opencv/modules/core/include/opencv2/core/base.hpp:679:18: note:
  1063.       forward declaration of 'cv::Mat'
  1064. class CV_EXPORTS Mat;
  1065.                  ^
  1066. In file included from /Users/rafaelruizmunoz/Downloads/opencv/modules/viz/src/shapes.cpp:46:
  1067. In file included from /Users/rafaelruizmunoz/Downloads/opencv/modules/viz/src/precomp.hpp:144:
  1068. In file included from /Users/rafaelruizmunoz/Downloads/opencv/modules/viz/src/vtk/vtkCloudMatSink.h:48:
  1069. In file included from /Users/rafaelruizmunoz/Downloads/opencv/modules/core/include/opencv2/core.hpp:57:
  1070. /usr/local/include/opencv2/core/mat.hpp:78:8: error: incomplete type 'cv::Mat'
  1071.       named in nested name specifier
  1072. inline Mat::Mat(int _rows, int _cols, int _type, const Scalar& _s) : size(&rows)
  1073.        ^~~~~
  1074. /Users/rafaelruizmunoz/Downloads/opencv/modules/core/include/opencv2/core/base.hpp:679:18: note:
  1075.       forward declaration of 'cv::Mat'
  1076. class CV_EXPORTS Mat;
  1077.                  ^
  1078. In file included from /Users/rafaelruizmunoz/Downloads/opencv/modules/viz/src/shapes.cpp:46:
  1079. In file included from /Users/rafaelruizmunoz/Downloads/opencv/modules/viz/src/precomp.hpp:144:
  1080. In file included from /Users/rafaelruizmunoz/Downloads/opencv/modules/viz/src/vtk/vtkCloudMatSink.h:48:
  1081. In file included from /Users/rafaelruizmunoz/Downloads/opencv/modules/core/include/opencv2/core.hpp:57:
  1082. /usr/local/include/opencv2/core/mat.hpp:78:8: error: incomplete type 'cv::Mat'
  1083.       named in nested name specifier
  1084. inline Mat::Mat(int _rows, int _cols, int _type, const Scalar& _s) : size(&rows)
  1085.        ^~~~~
  1086. /Users/rafaelruizmunoz/Downloads/opencv/modules/core/include/opencv2/core/base.hpp:679:18: note:
  1087.       forward declaration of 'cv::Mat'
  1088. class CV_EXPORTS Mat;
  1089.                  ^
  1090. In file included from /Users/rafaelruizmunoz/Downloads/opencv/modules/viz/src/shapes.cpp:46:
  1091. In file included from /Users/rafaelruizmunoz/Downloads/opencv/modules/viz/src/precomp.hpp:144:
  1092. In file included from /Users/rafaelruizmunoz/Downloads/opencv/modules/viz/src/vtk/vtkCloudMatSink.h:48:
  1093. In file included from /Users/rafaelruizmunoz/Downloads/opencv/modules/core/include/opencv2/core.hpp:57:
  1094. /usr/local/include/opencv2/core/mat.hpp:85:8: error: incomplete type 'cv::Mat'
  1095.       named in nested name specifier
  1096. inline Mat::Mat(Size _sz, int _type) : size(&rows)
  1097.        ^~~~~
  1098. /Users/rafaelruizmunoz/Downloads/opencv/modules/core/include/opencv2/core/base.hpp:679:18: note:
  1099.       forward declaration of 'cv::Mat'
  1100. class CV_EXPORTS Mat;
  1101.                  ^
  1102. In file included from /Users/rafaelruizmunoz/Downloads/opencv/modules/viz/src/shapes.cpp:46:
  1103. In file included from /Users/rafaelruizmunoz/Downloads/opencv/modules/viz/src/precomp.hpp:144:
  1104. In file included from /Users/rafaelruizmunoz/Downloads/opencv/modules/viz/src/vtk/vtkCloudMatSink.h:48:
  1105. In file included from /Users/rafaelruizmunoz/Downloads/opencv/modules/core/include/opencv2/core.hpp:57:
  1106. /usr/local/include/opencv2/core/mat.hpp:85:8: error: incomplete type 'cv::Mat'
  1107.       named in nested name specifier
  1108. inline Mat::Mat(Size _sz, int _type) : size(&rows)
  1109.        ^~~~~
  1110. /Users/rafaelruizmunoz/Downloads/opencv/modules/core/include/opencv2/core/base.hpp:679:18: note:
  1111.       forward declaration of 'cv::Mat'
  1112. class CV_EXPORTS Mat;
  1113.                  ^
  1114. In file included from /Users/rafaelruizmunoz/Downloads/opencv/modules/viz/src/shapes.cpp:46:
  1115. In file included from /Users/rafaelruizmunoz/Downloads/opencv/modules/viz/src/precomp.hpp:144:
  1116. In file included from /Users/rafaelruizmunoz/Downloads/opencv/modules/viz/src/vtk/vtkCloudMatSink.h:48:
  1117. In file included from /Users/rafaelruizmunoz/Downloads/opencv/modules/core/include/opencv2/core.hpp:57:
  1118. /usr/local/include/opencv2/core/mat.hpp:91:8: error: incomplete type 'cv::Mat'
  1119.       named in nested name specifier
  1120. inline Mat::Mat(Size _sz, int _type, const Scalar& _s) : size(&rows)
  1121.        ^~~~~
  1122. /Users/rafaelruizmunoz/Downloads/opencv/modules/core/include/opencv2/core/base.hpp:679:18: note:
  1123.       forward declaration of 'cv::Mat'
  1124. class CV_EXPORTS Mat;
  1125.                  ^
  1126. In file included from /Users/rafaelruizmunoz/Downloads/opencv/modules/viz/src/shapes.cpp:46:
  1127. In file included from /Users/rafaelruizmunoz/Downloads/opencv/modules/viz/src/precomp.hpp:144:
  1128. In file included from /Users/rafaelruizmunoz/Downloads/opencv/modules/viz/src/vtk/vtkCloudMatSink.h:48:
  1129. In file included from /Users/rafaelruizmunoz/Downloads/opencv/modules/core/include/opencv2/core.hpp:57:
  1130. /usr/local/include/opencv2/core/mat.hpp:91:8: error: incomplete type 'cv::Mat'
  1131.       named in nested name specifier
  1132. inline Mat::Mat(Size _sz, int _type, const Scalar& _s) : size(&rows)
  1133.        ^~~~~
  1134. /Users/rafaelruizmunoz/Downloads/opencv/modules/core/include/opencv2/core/base.hpp:679:18: note:
  1135.       forward declaration of 'cv::Mat'
  1136. class CV_EXPORTS Mat;
  1137.                  ^
  1138. In file included from /Users/rafaelruizmunoz/Downloads/opencv/modules/viz/src/shapes.cpp:46:
  1139. In file included from /Users/rafaelruizmunoz/Downloads/opencv/modules/viz/src/precomp.hpp:144:
  1140. In file included from /Users/rafaelruizmunoz/Downloads/opencv/modules/viz/src/vtk/vtkCloudMatSink.h:48:
  1141. In file included from /Users/rafaelruizmunoz/Downloads/opencv/modules/core/include/opencv2/core.hpp:57:
  1142. /usr/local/include/opencv2/core/mat.hpp:98:8: error: incomplete type 'cv::Mat'
  1143.       named in nested name specifier
  1144. inline Mat::Mat(int _dims, const int* _sz, int _type) : size(&rows)
  1145.        ^~~~~
  1146. /Users/rafaelruizmunoz/Downloads/opencv/modules/core/include/opencv2/core/base.hpp:679:18: note:
  1147.       forward declaration of 'cv::Mat'
  1148. class CV_EXPORTS Mat;
  1149.                  ^
  1150. In file included from /Users/rafaelruizmunoz/Downloads/opencv/modules/viz/src/shapes.cpp:46:
  1151. In file included from /Users/rafaelruizmunoz/Downloads/opencv/modules/viz/src/precomp.hpp:144:
  1152. In file included from /Users/rafaelruizmunoz/Downloads/opencv/modules/viz/src/vtk/vtkCloudMatSink.h:48:
  1153. In file included from /Users/rafaelruizmunoz/Downloads/opencv/modules/core/include/opencv2/core.hpp:57:
  1154. /usr/local/include/opencv2/core/mat.hpp:98:8: error: incomplete type 'cv::Mat'
  1155.       named in nested name specifier
  1156. inline Mat::Mat(int _dims, const int* _sz, int _type) : size(&rows)
  1157.        ^~~~~
  1158. /Users/rafaelruizmunoz/Downloads/opencv/modules/core/include/opencv2/core/base.hpp:679:18: note:
  1159.       forward declaration of 'cv::Mat'
  1160. class CV_EXPORTS Mat;
  1161.                  ^
  1162. In file included from /Users/rafaelruizmunoz/Downloads/opencv/modules/viz/src/shapes.cpp:46:
  1163. In file included from /Users/rafaelruizmunoz/Downloads/opencv/modules/viz/src/precomp.hpp:144:
  1164. In file included from /Users/rafaelruizmunoz/Downloads/opencv/modules/viz/src/vtk/vtkCloudMatSink.h:48:
  1165. In file included from /Users/rafaelruizmunoz/Downloads/opencv/modules/core/include/opencv2/core.hpp:57:
  1166. /usr/local/include/opencv2/core/mat.hpp:104:8: error: incomplete type 'cv::Mat'
  1167.       named in nested name specifier
  1168. inline Mat::Mat(int _dims, const int* _sz, int _type, const Scalar& _s) ...
  1169.        ^~~~~
  1170. /Users/rafaelruizmunoz/Downloads/opencv/modules/core/include/opencv2/core/base.hpp:679:18: note:
  1171.       forward declaration of 'cv::Mat'
  1172. class CV_EXPORTS Mat;
  1173.                  ^
  1174. In file included from /Users/rafaelruizmunoz/Downloads/opencv/modules/viz/src/shapes.cpp:46:
  1175. In file included from /Users/rafaelruizmunoz/Downloads/opencv/modules/viz/src/precomp.hpp:144:
  1176. In file included from /Users/rafaelruizmunoz/Downloads/opencv/modules/viz/src/vtk/vtkCloudMatSink.h:48:
  1177. In file included from /Users/rafaelruizmunoz/Downloads/opencv/modules/core/include/opencv2/core.hpp:57:
  1178. /usr/local/include/opencv2/core/mat.hpp:104:8: error: incomplete type 'cv::Mat'
  1179.       named in nested name specifier
  1180. inline Mat::Mat(int _dims, const int* _sz, int _type, const Scalar& _s) ...
  1181.        ^~~~~
  1182. /Users/rafaelruizmunoz/Downloads/opencv/modules/core/include/opencv2/core/base.hpp:679:18: note:
  1183.       forward declaration of 'cv::Mat'
  1184. class CV_EXPORTS Mat;
  1185.                  ^
  1186. In file included from /Users/rafaelruizmunoz/Downloads/opencv/modules/viz/src/shapes.cpp:46:
  1187. In file included from /Users/rafaelruizmunoz/Downloads/opencv/modules/viz/src/precomp.hpp:144:
  1188. In file included from /Users/rafaelruizmunoz/Downloads/opencv/modules/viz/src/vtk/vtkCloudMatSink.h:48:
  1189. In file included from /Users/rafaelruizmunoz/Downloads/opencv/modules/core/include/opencv2/core.hpp:57:
  1190. /usr/local/include/opencv2/core/mat.hpp:111:8: error: incomplete type 'cv::Mat'
  1191.       named in nested name specifier
  1192. inline Mat::Mat(const Mat& m)
  1193.        ^~~~~
  1194. /Users/rafaelruizmunoz/Downloads/opencv/modules/core/include/opencv2/core/base.hpp:679:18: note:
  1195.       forward declaration of 'cv::Mat'
  1196. class CV_EXPORTS Mat;
  1197.                  ^
  1198. In file included from /Users/rafaelruizmunoz/Downloads/opencv/modules/viz/src/shapes.cpp:46:
  1199. In file included from /Users/rafaelruizmunoz/Downloads/opencv/modules/viz/src/precomp.hpp:144:
  1200. In file included from /Users/rafaelruizmunoz/Downloads/opencv/modules/viz/src/vtk/vtkCloudMatSink.h:48:
  1201. In file included from /Users/rafaelruizmunoz/Downloads/opencv/modules/core/include/opencv2/core.hpp:57:
  1202. /usr/local/include/opencv2/core/mat.hpp:111:8: error: incomplete type 'cv::Mat'
  1203.       named in nested name specifier
  1204. inline Mat::Mat(const Mat& m)
  1205.        ^~~~~
  1206. /Users/rafaelruizmunoz/Downloads/opencv/modules/core/include/opencv2/core/base.hpp:679:18: note:
  1207.       forward declaration of 'cv::Mat'
  1208. class CV_EXPORTS Mat;
  1209.                  ^
  1210. In file included from /Users/rafaelruizmunoz/Downloads/opencv/modules/viz/src/shapes.cpp:46:
  1211. In file included from /Users/rafaelruizmunoz/Downloads/opencv/modules/viz/src/precomp.hpp:144:
  1212. In file included from /Users/rafaelruizmunoz/Downloads/opencv/modules/viz/src/vtk/vtkCloudMatSink.h:48:
  1213. In file included from /Users/rafaelruizmunoz/Downloads/opencv/modules/core/include/opencv2/core.hpp:57:
  1214. /usr/local/include/opencv2/core/mat.hpp:129:8: error: incomplete type 'cv::Mat'
  1215.       named in nested name specifier
  1216. inline Mat::Mat(int _rows, int _cols, int _type, void* _data, size_t _step)
  1217.        ^~~~~
  1218. /Users/rafaelruizmunoz/Downloads/opencv/modules/core/include/opencv2/core/base.hpp:679:18: note:
  1219.       forward declaration of 'cv::Mat'
  1220. class CV_EXPORTS Mat;
  1221.                  ^
  1222. In file included from /Users/rafaelruizmunoz/Downloads/opencv/modules/viz/src/shapes.cpp:46:
  1223. In file included from /Users/rafaelruizmunoz/Downloads/opencv/modules/viz/src/precomp.hpp:144:
  1224. In file included from /Users/rafaelruizmunoz/Downloads/opencv/modules/viz/src/vtk/vtkCloudMatSink.h:48:
  1225. In file included from /Users/rafaelruizmunoz/Downloads/opencv/modules/core/include/opencv2/core.hpp:57:
  1226. /usr/local/include/opencv2/core/mat.hpp:129:8: error: incomplete type 'cv::Mat'
  1227.       named in nested name specifier
  1228. inline Mat::Mat(int _rows, int _cols, int _type, void* _data, size_t _step)
  1229.        ^~~~~
  1230. /Users/rafaelruizmunoz/Downloads/opencv/modules/core/include/opencv2/core/base.hpp:679:18: note:
  1231.       forward declaration of 'cv::Mat'
  1232. class CV_EXPORTS Mat;
  1233.                  ^
  1234. In file included from /Users/rafaelruizmunoz/Downloads/opencv/modules/viz/src/shapes.cpp:46:
  1235. In file included from /Users/rafaelruizmunoz/Downloads/opencv/modules/viz/src/precomp.hpp:144:
  1236. In file included from /Users/rafaelruizmunoz/Downloads/opencv/modules/viz/src/vtk/vtkCloudMatSink.h:48:
  1237. In file included from /Users/rafaelruizmunoz/Downloads/opencv/modules/core/include/opencv2/core.hpp:57:
  1238. /usr/local/include/opencv2/core/mat.hpp:151:8: error: incomplete type 'cv::Mat'
  1239.       named in nested name specifier
  1240. inline Mat::Mat(Size _sz, int _type, void* _data, size_t _step)
  1241.        ^~~~~
  1242. /Users/rafaelruizmunoz/Downloads/opencv/modules/core/include/opencv2/core/base.hpp:679:18: note:
  1243.       forward declaration of 'cv::Mat'
  1244. class CV_EXPORTS Mat;
  1245.                  ^
  1246. fatal error: too many errors emitted, stopping now [-ferror-limit=]
  1247. 20 errors generated.
  1248. make[2]: *** [modules/viz/CMakeFiles/opencv_viz.dir/src/shapes.cpp.o] Error 1
  1249. [ 44%] Building CXX object modules/imgproc/CMakeFiles/opencv_imgproc.dir/src/floodfill.cpp.o
  1250. In file included from /Users/rafaelruizmunoz/Downloads/opencv/modules/viz/src/types.cpp:46:
  1251. In file included from /Users/rafaelruizmunoz/Downloads/opencv/modules/viz/src/precomp.hpp:144:
  1252. In file included from /Users/rafaelruizmunoz/Downloads/opencv/modules/viz/src/vtk/vtkCloudMatSink.h:48:
  1253. In file included from /Users/rafaelruizmunoz/Downloads/opencv/modules/core/include/opencv2/core.hpp:57:
  1254. /usr/local/include/opencv2/core/mat.hpp:58:13: error: incomplete type 'cv::Mat'
  1255.       named in nested name specifier
  1256. inline void Mat::initEmpty()
  1257.             ^~~~~
  1258. /Users/rafaelruizmunoz/Downloads/opencv/modules/core/include/opencv2/core/base.hpp:679:18: note:
  1259.       forward declaration of 'cv::Mat'
  1260. class CV_EXPORTS Mat;
  1261.                  ^
  1262. In file included from /Users/rafaelruizmunoz/Downloads/opencv/modules/viz/src/types.cpp:46:
  1263. In file included from /Users/rafaelruizmunoz/Downloads/opencv/modules/viz/src/precomp.hpp:144:
  1264. In file included from /Users/rafaelruizmunoz/Downloads/opencv/modules/viz/src/vtk/vtkCloudMatSink.h:48:
  1265. In file included from /Users/rafaelruizmunoz/Downloads/opencv/modules/core/include/opencv2/core.hpp:57:
  1266. /usr/local/include/opencv2/core/mat.hpp:67:8: error: incomplete type 'cv::Mat'
  1267.       named in nested name specifier
  1268. inline Mat::Mat() : size(&rows)
  1269.        ^~~~~
  1270. /Users/rafaelruizmunoz/Downloads/opencv/modules/core/include/opencv2/core/base.hpp:679:18: note:
  1271.       forward declaration of 'cv::Mat'
  1272. class CV_EXPORTS Mat;
  1273.                  ^
  1274. In file included from /Users/rafaelruizmunoz/Downloads/opencv/modules/viz/src/types.cpp:46:
  1275. In file included from /Users/rafaelruizmunoz/Downloads/opencv/modules/viz/src/precomp.hpp:144:
  1276. In file included from /Users/rafaelruizmunoz/Downloads/opencv/modules/viz/src/vtk/vtkCloudMatSink.h:48:
  1277. In file included from /Users/rafaelruizmunoz/Downloads/opencv/modules/core/include/opencv2/core.hpp:57:
  1278. /usr/local/include/opencv2/core/mat.hpp:72:8: error: incomplete type 'cv::Mat'
  1279.       named in nested name specifier
  1280. inline Mat::Mat(int _rows, int _cols, int _type) : size(&rows)
  1281.        ^~~~~
  1282. /Users/rafaelruizmunoz/Downloads/opencv/modules/core/include/opencv2/core/base.hpp:679:18: note:
  1283.       forward declaration of 'cv::Mat'
  1284. class CV_EXPORTS Mat;
  1285.                  ^
  1286. In file included from /Users/rafaelruizmunoz/Downloads/opencv/modules/viz/src/types.cpp:46:
  1287. In file included from /Users/rafaelruizmunoz/Downloads/opencv/modules/viz/src/precomp.hpp:144:
  1288. In file included from /Users/rafaelruizmunoz/Downloads/opencv/modules/viz/src/vtk/vtkCloudMatSink.h:48:
  1289. In file included from /Users/rafaelruizmunoz/Downloads/opencv/modules/core/include/opencv2/core.hpp:57:
  1290. /usr/local/include/opencv2/core/mat.hpp:72:8: error: incomplete type 'cv::Mat'
  1291.       named in nested name specifier
  1292. inline Mat::Mat(int _rows, int _cols, int _type) : size(&rows)
  1293.        ^~~~~
  1294. /Users/rafaelruizmunoz/Downloads/opencv/modules/core/include/opencv2/core/base.hpp:679:18: note:
  1295.       forward declaration of 'cv::Mat'
  1296. class CV_EXPORTS Mat;
  1297.                  ^
  1298. In file included from /Users/rafaelruizmunoz/Downloads/opencv/modules/viz/src/types.cpp:46:
  1299. In file included from /Users/rafaelruizmunoz/Downloads/opencv/modules/viz/src/precomp.hpp:144:
  1300. In file included from /Users/rafaelruizmunoz/Downloads/opencv/modules/viz/src/vtk/vtkCloudMatSink.h:48:
  1301. In file included from /Users/rafaelruizmunoz/Downloads/opencv/modules/core/include/opencv2/core.hpp:57:
  1302. /usr/local/include/opencv2/core/mat.hpp:78:8: error: incomplete type 'cv::Mat'
  1303.       named in nested name specifier
  1304. inline Mat::Mat(int _rows, int _cols, int _type, const Scalar& _s) : size(&rows)
  1305.        ^~~~~
  1306. /Users/rafaelruizmunoz/Downloads/opencv/modules/core/include/opencv2/core/base.hpp:679:18: note:
  1307.       forward declaration of 'cv::Mat'
  1308. class CV_EXPORTS Mat;
  1309.                  ^
  1310. In file included from /Users/rafaelruizmunoz/Downloads/opencv/modules/viz/src/types.cpp:46:
  1311. In file included from /Users/rafaelruizmunoz/Downloads/opencv/modules/viz/src/precomp.hpp:144:
  1312. In file included from /Users/rafaelruizmunoz/Downloads/opencv/modules/viz/src/vtk/vtkCloudMatSink.h:48:
  1313. In file included from /Users/rafaelruizmunoz/Downloads/opencv/modules/core/include/opencv2/core.hpp:57:
  1314. /usr/local/include/opencv2/core/mat.hpp:78:8: error: incomplete type 'cv::Mat'
  1315.       named in nested name specifier
  1316. inline Mat::Mat(int _rows, int _cols, int _type, const Scalar& _s) : size(&rows)
  1317.        ^~~~~
  1318. /Users/rafaelruizmunoz/Downloads/opencv/modules/core/include/opencv2/core/base.hpp:679:18: note:
  1319.       forward declaration of 'cv::Mat'
  1320. class CV_EXPORTS Mat;
  1321.                  ^
  1322. In file included from /Users/rafaelruizmunoz/Downloads/opencv/modules/viz/src/types.cpp:46:
  1323. In file included from /Users/rafaelruizmunoz/Downloads/opencv/modules/viz/src/precomp.hpp:144:
  1324. In file included from /Users/rafaelruizmunoz/Downloads/opencv/modules/viz/src/vtk/vtkCloudMatSink.h:48:
  1325. In file included from /Users/rafaelruizmunoz/Downloads/opencv/modules/core/include/opencv2/core.hpp:57:
  1326. /usr/local/include/opencv2/core/mat.hpp:85:8: error: incomplete type 'cv::Mat'
  1327.       named in nested name specifier
  1328. inline Mat::Mat(Size _sz, int _type) : size(&rows)
  1329.        ^~~~~
  1330. /Users/rafaelruizmunoz/Downloads/opencv/modules/core/include/opencv2/core/base.hpp:679:18: note:
  1331.       forward declaration of 'cv::Mat'
  1332. class CV_EXPORTS Mat;
  1333.                  ^
  1334. In file included from /Users/rafaelruizmunoz/Downloads/opencv/modules/viz/src/types.cpp:46:
  1335. In file included from /Users/rafaelruizmunoz/Downloads/opencv/modules/viz/src/precomp.hpp:144:
  1336. In file included from /Users/rafaelruizmunoz/Downloads/opencv/modules/viz/src/vtk/vtkCloudMatSink.h:48:
  1337. In file included from /Users/rafaelruizmunoz/Downloads/opencv/modules/core/include/opencv2/core.hpp:57:
  1338. /usr/local/include/opencv2/core/mat.hpp:85:8: error: incomplete type 'cv::Mat'
  1339.       named in nested name specifier
  1340. inline Mat::Mat(Size _sz, int _type) : size(&rows)
  1341.        ^~~~~
  1342. /Users/rafaelruizmunoz/Downloads/opencv/modules/core/include/opencv2/core/base.hpp:679:18: note:
  1343.       forward declaration of 'cv::Mat'
  1344. class CV_EXPORTS Mat;
  1345.                  ^
  1346. In file included from /Users/rafaelruizmunoz/Downloads/opencv/modules/viz/src/types.cpp:46:
  1347. In file included from /Users/rafaelruizmunoz/Downloads/opencv/modules/viz/src/precomp.hpp:144:
  1348. In file included from /Users/rafaelruizmunoz/Downloads/opencv/modules/viz/src/vtk/vtkCloudMatSink.h:48:
  1349. In file included from /Users/rafaelruizmunoz/Downloads/opencv/modules/core/include/opencv2/core.hpp:57:
  1350. /usr/local/include/opencv2/core/mat.hpp:91:8: error: incomplete type 'cv::Mat'
  1351.       named in nested name specifier
  1352. inline Mat::Mat(Size _sz, int _type, const Scalar& _s) : size(&rows)
  1353.        ^~~~~
  1354. /Users/rafaelruizmunoz/Downloads/opencv/modules/core/include/opencv2/core/base.hpp:679:18: note:
  1355.       forward declaration of 'cv::Mat'
  1356. class CV_EXPORTS Mat;
  1357.                  ^
  1358. In file included from /Users/rafaelruizmunoz/Downloads/opencv/modules/viz/src/types.cpp:46:
  1359. In file included from /Users/rafaelruizmunoz/Downloads/opencv/modules/viz/src/precomp.hpp:144:
  1360. In file included from /Users/rafaelruizmunoz/Downloads/opencv/modules/viz/src/vtk/vtkCloudMatSink.h:48:
  1361. In file included from /Users/rafaelruizmunoz/Downloads/opencv/modules/core/include/opencv2/core.hpp:57:
  1362. /usr/local/include/opencv2/core/mat.hpp:91:8: error: incomplete type 'cv::Mat'
  1363.       named in nested name specifier
  1364. inline Mat::Mat(Size _sz, int _type, const Scalar& _s) : size(&rows)
  1365.        ^~~~~
  1366. /Users/rafaelruizmunoz/Downloads/opencv/modules/core/include/opencv2/core/base.hpp:679:18: note:
  1367.       forward declaration of 'cv::Mat'
  1368. class CV_EXPORTS Mat;
  1369.                  ^
  1370. In file included from /Users/rafaelruizmunoz/Downloads/opencv/modules/viz/src/types.cpp:46:
  1371. In file included from /Users/rafaelruizmunoz/Downloads/opencv/modules/viz/src/precomp.hpp:144:
  1372. In file included from /Users/rafaelruizmunoz/Downloads/opencv/modules/viz/src/vtk/vtkCloudMatSink.h:48:
  1373. In file included from /Users/rafaelruizmunoz/Downloads/opencv/modules/core/include/opencv2/core.hpp:57:
  1374. /usr/local/include/opencv2/core/mat.hpp:98:8: error: incomplete type 'cv::Mat'
  1375.       named in nested name specifier
  1376. inline Mat::Mat(int _dims, const int* _sz, int _type) : size(&rows)
  1377.        ^~~~~
  1378. /Users/rafaelruizmunoz/Downloads/opencv/modules/core/include/opencv2/core/base.hpp:679:18: note:
  1379.       forward declaration of 'cv::Mat'
  1380. class CV_EXPORTS Mat;
  1381.                  ^
  1382. In file included from /Users/rafaelruizmunoz/Downloads/opencv/modules/viz/src/types.cpp:46:
  1383. In file included from /Users/rafaelruizmunoz/Downloads/opencv/modules/viz/src/precomp.hpp:144:
  1384. In file included from /Users/rafaelruizmunoz/Downloads/opencv/modules/viz/src/vtk/vtkCloudMatSink.h:48:
  1385. In file included from /Users/rafaelruizmunoz/Downloads/opencv/modules/core/include/opencv2/core.hpp:57:
  1386. /usr/local/include/opencv2/core/mat.hpp:98:8: error: incomplete type 'cv::Mat'
  1387.       named in nested name specifier
  1388. inline Mat::Mat(int _dims, const int* _sz, int _type) : size(&rows)
  1389.        ^~~~~
  1390. /Users/rafaelruizmunoz/Downloads/opencv/modules/core/include/opencv2/core/base.hpp:679:18: note:
  1391.       forward declaration of 'cv::Mat'
  1392. class CV_EXPORTS Mat;
  1393.                  ^
  1394. In file included from /Users/rafaelruizmunoz/Downloads/opencv/modules/viz/src/types.cpp:46:
  1395. In file included from /Users/rafaelruizmunoz/Downloads/opencv/modules/viz/src/precomp.hpp:144:
  1396. In file included from /Users/rafaelruizmunoz/Downloads/opencv/modules/viz/src/vtk/vtkCloudMatSink.h:48:
  1397. In file included from /Users/rafaelruizmunoz/Downloads/opencv/modules/core/include/opencv2/core.hpp:57:
  1398. /usr/local/include/opencv2/core/mat.hpp:104:8: error: incomplete type 'cv::Mat'
  1399.       named in nested name specifier
  1400. inline Mat::Mat(int _dims, const int* _sz, int _type, const Scalar& _s) ...
  1401.        ^~~~~
  1402. /Users/rafaelruizmunoz/Downloads/opencv/modules/core/include/opencv2/core/base.hpp:679:18: note:
  1403.       forward declaration of 'cv::Mat'
  1404. class CV_EXPORTS Mat;
  1405.                  ^
  1406. In file included from /Users/rafaelruizmunoz/Downloads/opencv/modules/viz/src/types.cpp:46:
  1407. In file included from /Users/rafaelruizmunoz/Downloads/opencv/modules/viz/src/precomp.hpp:144:
  1408. In file included from /Users/rafaelruizmunoz/Downloads/opencv/modules/viz/src/vtk/vtkCloudMatSink.h:48:
  1409. In file included from /Users/rafaelruizmunoz/Downloads/opencv/modules/core/include/opencv2/core.hpp:57:
  1410. /usr/local/include/opencv2/core/mat.hpp:104:8: error: incomplete type 'cv::Mat'
  1411.       named in nested name specifier
  1412. inline Mat::Mat(int _dims, const int* _sz, int _type, const Scalar& _s) ...
  1413.        ^~~~~
  1414. /Users/rafaelruizmunoz/Downloads/opencv/modules/core/include/opencv2/core/base.hpp:679:18: note:
  1415.       forward declaration of 'cv::Mat'
  1416. class CV_EXPORTS Mat;
  1417.                  ^
  1418. In file included from /Users/rafaelruizmunoz/Downloads/opencv/modules/viz/src/types.cpp:46:
  1419. In file included from /Users/rafaelruizmunoz/Downloads/opencv/modules/viz/src/precomp.hpp:144:
  1420. In file included from /Users/rafaelruizmunoz/Downloads/opencv/modules/viz/src/vtk/vtkCloudMatSink.h:48:
  1421. In file included from /Users/rafaelruizmunoz/Downloads/opencv/modules/core/include/opencv2/core.hpp:57:
  1422. /usr/local/include/opencv2/core/mat.hpp:111:8: error: incomplete type 'cv::Mat'
  1423.       named in nested name specifier
  1424. inline Mat::Mat(const Mat& m)
  1425.        ^~~~~
  1426. /Users/rafaelruizmunoz/Downloads/opencv/modules/core/include/opencv2/core/base.hpp:679:18: note:
  1427.       forward declaration of 'cv::Mat'
  1428. class CV_EXPORTS Mat;
  1429.                  ^
  1430. In file included from /Users/rafaelruizmunoz/Downloads/opencv/modules/viz/src/types.cpp:46:
  1431. In file included from /Users/rafaelruizmunoz/Downloads/opencv/modules/viz/src/precomp.hpp:144:
  1432. In file included from /Users/rafaelruizmunoz/Downloads/opencv/modules/viz/src/vtk/vtkCloudMatSink.h:48:
  1433. In file included from /Users/rafaelruizmunoz/Downloads/opencv/modules/core/include/opencv2/core.hpp:57:
  1434. /usr/local/include/opencv2/core/mat.hpp:111:8: error: incomplete type 'cv::Mat'
  1435.       named in nested name specifier
  1436. inline Mat::Mat(const Mat& m)
  1437.        ^~~~~
  1438. /Users/rafaelruizmunoz/Downloads/opencv/modules/core/include/opencv2/core/base.hpp:679:18: note:
  1439.       forward declaration of 'cv::Mat'
  1440. class CV_EXPORTS Mat;
  1441.                  ^
  1442. In file included from /Users/rafaelruizmunoz/Downloads/opencv/modules/viz/src/types.cpp:46:
  1443. In file included from /Users/rafaelruizmunoz/Downloads/opencv/modules/viz/src/precomp.hpp:144:
  1444. In file included from /Users/rafaelruizmunoz/Downloads/opencv/modules/viz/src/vtk/vtkCloudMatSink.h:48:
  1445. In file included from /Users/rafaelruizmunoz/Downloads/opencv/modules/core/include/opencv2/core.hpp:57:
  1446. /usr/local/include/opencv2/core/mat.hpp:129:8: error: incomplete type 'cv::Mat'
  1447.       named in nested name specifier
  1448. inline Mat::Mat(int _rows, int _cols, int _type, void* _data, size_t _step)
  1449.        ^~~~~
  1450. /Users/rafaelruizmunoz/Downloads/opencv/modules/core/include/opencv2/core/base.hpp:679:18: note:
  1451.       forward declaration of 'cv::Mat'
  1452. class CV_EXPORTS Mat;
  1453.                  ^
  1454. In file included from /Users/rafaelruizmunoz/Downloads/opencv/modules/viz/src/types.cpp:46:
  1455. In file included from /Users/rafaelruizmunoz/Downloads/opencv/modules/viz/src/precomp.hpp:144:
  1456. In file included from /Users/rafaelruizmunoz/Downloads/opencv/modules/viz/src/vtk/vtkCloudMatSink.h:48:
  1457. In file included from /Users/rafaelruizmunoz/Downloads/opencv/modules/core/include/opencv2/core.hpp:57:
  1458. /usr/local/include/opencv2/core/mat.hpp:129:8: error: incomplete type 'cv::Mat'
  1459.       named in nested name specifier
  1460. inline Mat::Mat(int _rows, int _cols, int _type, void* _data, size_t _step)
  1461.        ^~~~~
  1462. /Users/rafaelruizmunoz/Downloads/opencv/modules/core/include/opencv2/core/base.hpp:679:18: note:
  1463.       forward declaration of 'cv::Mat'
  1464. class CV_EXPORTS Mat;
  1465.                  ^
  1466. In file included from /Users/rafaelruizmunoz/Downloads/opencv/modules/viz/src/types.cpp:46:
  1467. In file included from /Users/rafaelruizmunoz/Downloads/opencv/modules/viz/src/precomp.hpp:144:
  1468. In file included from /Users/rafaelruizmunoz/Downloads/opencv/modules/viz/src/vtk/vtkCloudMatSink.h:48:
  1469. In file included from /Users/rafaelruizmunoz/Downloads/opencv/modules/core/include/opencv2/core.hpp:57:
  1470. /usr/local/include/opencv2/core/mat.hpp:151:8: error: incomplete type 'cv::Mat'
  1471.       named in nested name specifier
  1472. inline Mat::Mat(Size _sz, int _type, void* _data, size_t _step)
  1473.        ^~~~~
  1474. /Users/rafaelruizmunoz/Downloads/opencv/modules/core/include/opencv2/core/base.hpp:679:18: note:
  1475.       forward declaration of 'cv::Mat'
  1476. class CV_EXPORTS Mat;
  1477.                  ^
  1478. fatal error: too many errors emitted, stopping now [-ferror-limit=]
  1479. [ 45%] Building CXX object modules/imgproc/CMakeFiles/opencv_imgproc.dir/src/gabor.cpp.o
  1480. [ 45%] Building CXX object modules/imgproc/CMakeFiles/opencv_imgproc.dir/src/generalized_hough.cpp.o
  1481. [ 45%] Building CXX object modules/imgproc/CMakeFiles/opencv_imgproc.dir/src/geometry.cpp.o
  1482. 20 errors generated.
  1483. make[2]: *** [modules/viz/CMakeFiles/opencv_viz.dir/src/types.cpp.o] Error 1
  1484. make[1]: *** [modules/viz/CMakeFiles/opencv_viz.dir/all] Error 2
  1485. make[1]: *** Waiting for unfinished jobs....
  1486. [ 45%] Building CXX object modules/imgproc/CMakeFiles/opencv_imgproc.dir/src/grabcut.cpp.o
  1487. [ 45%] Building CXX object modules/imgproc/CMakeFiles/opencv_imgproc.dir/src/hershey_fonts.cpp.o
  1488. [ 45%] Building CXX object modules/imgproc/CMakeFiles/opencv_imgproc.dir/src/histogram.cpp.o
  1489. [ 45%] Building CXX object modules/imgproc/CMakeFiles/opencv_imgproc.dir/src/hough.cpp.o
  1490. [ 46%] Building CXX object modules/imgproc/CMakeFiles/opencv_imgproc.dir/src/imgwarp.cpp.o
  1491. [ 46%] Building CXX object modules/imgproc/CMakeFiles/opencv_imgproc.dir/src/intersection.cpp.o
  1492. [ 46%] Building CXX object modules/imgproc/CMakeFiles/opencv_imgproc.dir/src/linefit.cpp.o
  1493. [ 46%] Building CXX object modules/imgproc/CMakeFiles/opencv_imgproc.dir/src/lsd.cpp.o
  1494. [ 46%] Building CXX object modules/imgproc/CMakeFiles/opencv_imgproc.dir/src/matchcontours.cpp.o
  1495. [ 46%] Building CXX object modules/imgproc/CMakeFiles/opencv_imgproc.dir/src/min_enclosing_triangle.cpp.o
  1496. [ 46%] Building CXX object modules/imgproc/CMakeFiles/opencv_imgproc.dir/src/moments.cpp.o
  1497. [ 47%] Building CXX object modules/imgproc/CMakeFiles/opencv_imgproc.dir/src/morph.cpp.o
  1498. [ 47%] Building CXX object modules/imgproc/CMakeFiles/opencv_imgproc.dir/src/phasecorr.cpp.o
  1499. [ 47%] Building CXX object modules/imgproc/CMakeFiles/opencv_imgproc.dir/src/pyramids.cpp.o
  1500. [ 47%] Building CXX object modules/imgproc/CMakeFiles/opencv_imgproc.dir/src/rotcalipers.cpp.o
  1501. [ 47%] Building CXX object modules/imgproc/CMakeFiles/opencv_imgproc.dir/src/samplers.cpp.o
  1502. [ 47%] Building CXX object modules/imgproc/CMakeFiles/opencv_imgproc.dir/src/segmentation.cpp.o
  1503. [ 47%] Building CXX object modules/imgproc/CMakeFiles/opencv_imgproc.dir/src/shapedescr.cpp.o
  1504. [ 48%] Building CXX object modules/imgproc/CMakeFiles/opencv_imgproc.dir/src/smooth.cpp.o
  1505. [ 48%] Building CXX object modules/imgproc/CMakeFiles/opencv_imgproc.dir/src/subdivision2d.cpp.o
  1506. [ 48%] Building CXX object modules/imgproc/CMakeFiles/opencv_imgproc.dir/src/sumpixels.cpp.o
  1507. [ 48%] Building CXX object modules/imgproc/CMakeFiles/opencv_imgproc.dir/src/tables.cpp.o
  1508. [ 48%] Building CXX object modules/imgproc/CMakeFiles/opencv_imgproc.dir/src/templmatch.cpp.o
  1509. [ 48%] Building CXX object modules/imgproc/CMakeFiles/opencv_imgproc.dir/src/thresh.cpp.o
  1510. Linking CXX shared library ../../lib/libopencv_flann.dylib
  1511. [ 48%] Building CXX object modules/imgproc/CMakeFiles/opencv_imgproc.dir/src/undistort.cpp.o
  1512. [ 48%] Built target opencv_flann
  1513. [ 49%] Building CXX object modules/imgproc/CMakeFiles/opencv_imgproc.dir/src/utils.cpp.o
  1514. [ 49%] Building CXX object modules/imgproc/CMakeFiles/opencv_imgproc.dir/opencl_kernels_imgproc.cpp.o
  1515. Linking CXX shared library ../../lib/libopencv_imgproc.dylib
  1516. [ 49%] Built target opencv_imgproc
  1517. make: *** [all] Error 2
RAW Paste Data
We use cookies for various purposes including analytics. By continuing to use Pastebin, you agree to our use of cookies as described in the Cookies Policy. OK, I Understand
Not a member of Pastebin yet?
Sign Up, it unlocks many cool features!
 
Top