Guest User

Make Error 6 with NvRTX_Caustics-4.26

a guest
May 3rd, 2021
359
0
Never
Not a member of Pastebin yet? Sign Up, it unlocks many cool features!
CMake 1.82 KB | None | 0 0
  1. Building https://github.com/NvRTX/UnrealEngine/tree/NvRTX_Caustics-4.26
  2. Ubunbtu Linux Kernel 5.4.0-66-generic
  3. NVIDIA Driver Version: 460.73.01
  4. CUDA Version: 11.2, and an RTX 3090
  5.  
  6. $ make
  7. Performing 613 actions (8 in parallel)
  8. [1/613] Compile Module.Engine.11_of_48.cpp
  9. [2/613] Compile Module.Engine.35_of_48.cpp
  10. In file included from /mnt/2.26/Engine/Intermediate/Build/Linux/B4D820EA/UE4Editor/Development/Engine/Module.Engine.11_of_48.cpp:11:
  11. /mnt/2.26/Engine/Source/Runtime/Engine/Private/Components/LightComponent.cpp:321:4: error: field 'bTiledDeferredLightingSupported' will be initialized after field 'bAffectWaterCaustics' [-Werror,-Wreorder-ctor]
  12.         , bTiledDeferredLightingSupported(false)
  13.           ^
  14. /mnt/2.26/Engine/Source/Runtime/Engine/Private/Components/LightComponent.cpp:323:4: error: field 'bAffectWaterCaustics' will be initialized after field 'WaterCausticsPrecision' [-Werror,-Wreorder-ctor]
  15.         , bAffectWaterCaustics(InLightComponent->bAffectWaterCaustics)
  16.           ^
  17. In file included from /mnt/2.26/Engine/Intermediate/Build/Linux/B4D820EA/UE4Editor/Development/Engine/Module.Engine.35_of_48.cpp:17:
  18. /mnt/2.26/Engine/Source/Runtime/Engine/Private/PrimitiveSceneProxy.cpp:108:3: error: field 'bRenderInTranslucencyUpscaledRTPass' will be initialized after field 'bIsComponentLevelVisible' [-Werror,-Wreorder-ctor]
  19. ,       bRenderInTranslucencyUpscaledRTPass(false)
  20.         ^
  21. /mnt/2.26/Engine/Source/Runtime/Engine/Private/PrimitiveSceneProxy.cpp:111:3: error: field 'bTreatAsBackgroundForOcclusion' will be initialized after field 'bRequiresVisibleLevelToRender' [-Werror,-Wreorder-ctor]
  22. ,       bTreatAsBackgroundForOcclusion(InComponent->bTreatAsBackgroundForOcclusion)
  23.         ^
  24. 2 errors generated.
  25. 2 errors generated.
  26. Makefile:1008: recipe for target 'UE4Editor' failed
  27. make: *** [UE4Editor] Error 6
  28.  
Advertisement
Add Comment
Please, Sign In to add comment